{"text_format":"1","workbook":"xlsx","n_sheets":21,"sheets":["Instructions","1-Cover Sheet","2-Narrative Summary","3-Financial Summary","Activity 1","Activity 2","Activity 3","Activity 4","Activity 5","Activity 6","Activity 7","Activity 8","Activity 9","Activity 10","Competitive Activity 1","Competitive Activity 2","Certification","Summary Sheet","Project Data","Grantee Data","Drop Down Box"],"not_rendered":{"charts":0,"images":3,"macros":1,"external_links":4,"defined_names":151,"comments":0,"pivot_tables":0},"unopened":[],"bounds":{"document_bytes":16777216,"sheet_cells":100000,"rows_first":2000,"rows_last":500,"rows_between":2000,"halvings":0,"cell_chars":16384,"cell_head_chars":4096},"cells_cut":0,"cells_raw":0,"read":"whole","date_system":"1900"}

{"sheet":"Instructions","index":0,"n_rows":10,"n_cols":1,"rows_kept":10,"cut":false,"hidden":false,"merged":[[9,0,47,7],[0,0,0,7],[1,0,2,7],[3,0,5,7],[6,0,8,7]]}
["Instructions for the Permanent Local Housing Allocation (PLHA) Program Annual Reporting:"]
["Pursuant to Health and Safety Code (HSC) Section 50470\nThe Department is authorized to provide funding based on Entitlement Formula Component HSC 50470(b)(2)(B)(I)(l), Non-Entitlement Formula Component HSC 50470(b)(2)(B)(I)(ll), and Non-Entitlement Competitive Grant Program Component HSC 50470(b)(2)(B)(I)(l) to eligible local governments in California for housing-related projects and programs that assist in addressing the unmet housing needs of their local communities."]
[]
["Annual Reporting\nChapter 364, Statutes of 2017 (SB 2, Atkins) was part of a 15-bill housing package aimed at addressing the state’s housing shortage and high housing costs.  The Department adopted Guidelines in October 2019.  Per Reporting Section 503 of the PLHA Guidelines, not later than July 31 of each year, a Grantee shall provide to the Department an annual report, in a format specified by the Department, including but not limited to the information requested in this workbook.  Per Cancellation and Termination Section 502(c) of the PLHA Guidelines, failure to meet reporting requirements will result in notice to the Grantee that it must satisfactorily cure any deficiencies within three months of the notice, or it will be ineligible for any additional PLHA award."]
[]
[]
["Completion of the Annual Reporting Workbook\nAll fields in which information is requested must be completed by the Grantee within the four plus tabs of the reporting workbook as applicable.  Reporting workbooks which contain blank information will be considered incomplete and will be returned to the Grantee for completion.  Any questions pertaining to the reporting requirements should be directed to the Grant Management Representative assigned to the project.  If you do not have your Grant Management Representative information, you may submit your email inquiry at PLHASGM@hcd.ca.gov."]
[]
[]
["Instructions –\nPlease navigate through form fields using Tab key and fill in information as prompted.\n\nTab 1 - Cover Sheet \nPer Reporting Section 503(a) of the PLHA Guidelines, please complete the table with requested information beginning on Row 8. \n\nIn Cell C12, you must select whether your PLHA allocation is Competitive or Formula. Consult the PLHA final Guidelines and your Standard Agreement if you are uncertain which type of award you are receiving. Your selection will determine which Activity options are available for you to select on the rest of the Cover Sheet and in subsequent Tabs throughout this workbook.\nIf the application is being submitted on behalf of another entity or Housing Trust fund, then select “Yes” in cell F12 and a new row of questions will appear.\nUnder the Allocation Summary, enter the annual amounts you have been awarded to date in the corresponding year columns. Your total cumulative allocation will automatically populate in cell G16. If you have not yet been awarded for a given year, enter 0.\nUnder the Eligible Activity Summary, in columns E and F, select “Yes” or “No” as appropriate for each activity listed in column B and the amount awarded for that activity per your Standard Agreement. When you select “Yes” to an Activity, you will see a new Tab named for that Activity appear in the workbook. You must fill out all Activity Tabs for which you have awarded funds. If you do not see new tabs appear for your selected Activities, check to make sure Macros are enabled by going to File-Options-Trust Center-Trust Center Settings-Macro Settings. \n\nAlternatively, you may email your Grant Monitoring Representative if you need assistance.\n\nTab 2 – Narrative Summary\nAnswer the five questions as accurately and thoroughly as possible. \nUnder Question 4 (Row 11), you will be asked to report Program Income earned. This is any revenue generated directly from the investment of PLHA funds (loan repayments, interest, fees). This does not include matching funds or leveraged funds.  \n\nTab 3 - Financial Summary \nPer Reporting Section 503(a) of the PLHA Guidelines, please complete the following within Tab 2a)\n1. A8-E8 and G8-I8 will automatically populate with data entered in the table. The Sponsor must enter how much Administrative funding has been expended from PLHA to date in cell F8.\n2. In the Table beginning in A12, enter the information requested for each separate Project funded by PLHA funds. Note that this table is by project, not by Activity. All projects must have a name or identifier.\n3. In Column D, select as many Activities as apply to the given project in that row, per Guidelines 301(a)(1-10) (Formula) or 401(a)(1-2) (Competitive). If no options are appearing in the drop-down, then return to the Cover Sheet Tab and ensure that you have selected “Formula” or “Competitive” in cell C12.\n4. In Column E – enter all PLHA program funds expended on Activity Costs. Activity Costs are eligible activities by projects that are directly reimbursed by the PLHA program that do not fall under the administrative cost cap. \n5. In Column I – enter the total cost of the project, if known. This should be a totality of all project expenses including Non-PLHA funds, from planning costs to the completion of construction. \n\nActivity Tabs\nFor each Activity that you are awarded PLHA funds, there will be a corresponding Activity Tab where you will be requested to provide Activity-specific project outcomes and compliance information. \n\nEach tab will have you select the pertaining projects from a drop-down menu at the beginning of the table. Only choose the projects for which that Activity was performed. There is space for 7 projects on each Activity tab, but you only need to fill out as many rows as you have projects that performed that Activity. If you do not see a project in the drop-down that should be there, check the Financial Summary Tab to ensure that you listed the name of your project properly in the Summary Table. \nSome Activities will have two tables – an upper and a lower. The lower table will automatically populate your corresponding Project names once you’ve filled out the upper. Be sure information in each row is for the corresponding project only. Cumulative totals will be automatically calculated in the bottom rows.\nIf a question asks whether certain documentation has been attached or compliance demonstrated, you must attach the form or have sent it to the Department with a previous report if you say “Yes”. \n\nTab – Certification\nPursuant to the PLHA Final Guidelines Section 503 (b), “This report must be signed by both the Local government’s PLHA administrator and the Local government’s City Manager (or his/her designee), or Chief Executive Officer (or his/her designee) or Chief Financial Officer (or his/her designee).” For each required signature, select the method of signing (electronic by printed name or by signature). The Department MUST receive your report back as an excel document, so if you choose to print and sign the certification separately, then you will be asked to send both the uploaded signature and the full Excel workbook.\n\nFor questions, please contact your Grant Monitoring Representative or contact PLHASGM@hcd.ca.gov. "]

{"sheet":"1-Cover Sheet","index":1,"n_rows":49,"n_cols":8,"rows_kept":49,"cut":false,"hidden":false,"merged":[[10,2,10,3],[10,5,10,6],[44,1,44,2],[42,1,42,2],[40,1,40,2],[1,1,2,2],[8,5,8,6],[12,1,12,6],[7,5,7,6],[9,5,9,6],[11,2,11,3],[7,2,7,3],[8,2,8,3],[9,2,9,3],[3,1,3,6],[4,1,4,6],[5,1,5,6],[6,1,6,6]]}
[null,"beginning of sheet 1 - Cover Page."]
[null,"DEPARTMENT OF HOUSING AND COMMUNITY DEVELOPMENT\nDIVISION OF STATE FINANCIAL ASSISTANCE \nSTATE GRANT MANAGEMENT\n2020 West El Camino, 4th Floor\nSacramento, CA 95833\nPLHASGM@HCD.CA.GOV"]
[]
[null,"PERMANENT LOCAL HOUSING ALLOCATION (PLHA) PROGRAM"]
[null,"Annual Report"]
[null,"Cover Page"]
[null,"Last Revised: 6/21/2023"]
[null,"HCD Contract Number:",null,null,"Local Government (Contractor Name):","Select One"]
[null,"Preparer Name:",null,null,"If funds were delegated, provide the name of the Administering Local Government, Local Housing Trust Fund, or Regional Housing Trust Fund: "]
[null,"Preparer Email:",null,null,"Reporting Period:"]
[null,"Preparer Title:",null,null,"Allocation Type Pursuant to Guidelines Articles III and IV","Select One"]
[null,"Preparer Phone Number:"]
[null,"Awarded Activity Summary\nPlease enter the awarded allocation amount (in dollars) for each year by activity. \nIf an allocation year has not yet been awarded (evidenced by a fully executed Standard Agreement or subsequent fully executed amendments to the Standard Agreement), please leave \"$0.00\" in the corresponding column.\nBelow that, enter the amount of funds that have been disbursed for that respective allocation and activity. If funds have been awarded, but have not yet been disbursed, please leave \"$0.00\""]
[null,"Activity","2019 Allocation Amount \nPer Activity","2020 Allocation Amount \nPer Activity","2021 Allocation Amount \nPer Activity","2022 Allocation Amount \nPer Activity","2023 Allocation Amount \nPer Activity"]
[null,"Enter awarded allocation amount for Activity 1: §301(a)(1)",0,0,0,0,0,{"$f":"SUM(C15:G15)","v":0}]
[null,"Amount of the annual allocation's funds that were disbursed by HCD for this activity",0,0,0,0,0,{"$f":"SUM(C16:G16)","v":0}]
[null,"Enter awarded allocation amount for Activity 2: §301(a)(2)",0,0,0,0,0,0]
[null,"Amount of the annual allocation's funds that were disbursed by HCD for this activity",0,0,0,0,0,0]
[null,"Enter awarded allocation amount for Activity 3: §301(a)(3)",0,0,0,0,0,0]
[null,"Amount of the annual allocation's funds that were disbursed by HCD for this activity",0,0,0,0,0,0]
[null,"Enter awarded allocation amount for Activity 4: §301(a)(4)",0,0,0,0,0,0]
[null,"Amount of the annual allocation's funds that were disbursed by HCD for this activity",0,0,0,0,0,0]
[null,"Enter awarded allocation amount for Activity 5: §301(a)(5)",0,0,0,0,0,0]
[null,"Amount of the annual allocation's funds that were disbursed by HCD for this activity",0,0,0,0,0,0]
[null,"Enter awarded allocation amount for Activity 6: §301(a)(6)",0,0,0,0,0,0]
[null,"Amount of the annual allocation's funds that were disbursed by HCD for this activity",0,0,0,0,0,0]
[null,"Enter awarded allocation amount for Activity 7: §301(a)(7)",0,0,0,0,0,0]
[null,"Amount of the annual allocation's funds that were disbursed by HCD for this activity",0,0,0,0,0,0]
[null,"Enter awarded allocation amount for Activity 8: §301(a)(8)",0,0,0,0,0,0]
[null,"Amount of the annual allocation's funds that were disbursed by HCD for this activity",0,0,0,0,0,0]
[null,"Enter awarded allocation amount for Activity 9: §301(a)(9)",0,0,0,0,0,0]
[null,"Amount of the annual allocation's funds that were disbursed by HCD for this activity",0,0,0,0,0,0]
[null,"Enter awarded allocation amount for Activity 10: §301(a)(10)",0,0,0,0,0,0]
[null,"Amount of the annual allocation's funds that were disbursed by HCD for this activity",0,0,0,0,0,0]
[null,"Enter awarded allocation amount for Admin: §301(b)",0,0,0,0,0,0]
[null,"Amount of the annual allocation's funds that were disbursed by HCD for admin",0,0,0,0,0,0]
[null,"Total Amount Allocated:",{"$f":"SUM(C15,C17,C19,C21,C23,C25,C27,C29,C31,C33,C35)","v":0},{"$f":"SUM(D15,D17,D19,D21,D23,D25,D27,D29,D31,D33,D35)","v":0},{"$f":"SUM(E15,E17,E19,E21,E23,E25,E27,E29,E31,E33,E35)","v":0},{"$f":"SUM(F15,F17,F19,F21,F23,F25,F27,F29,F31,F33,F35)","v":0},{"$f":"SUM(G15,G17,G19,G21,G23,G25,G27,G29,G31,G33,G35)","v":0}]
[null,"Amount of annual allocation that will be used for AOWH (See §303(e))",0,0,0,0,0]
[null,"Amount of annual disbursements used for AOWH (See §303(e))",0,0,0,0,0]
[]
[null,"Award Summary\nPlease select the award year and enter awarded amount. Each applicable award year requires a separate annual report."]
[null,"Please Select One",0]
[null,"Disbursement Summary \nPlease select from the dropdown lists whether the funds have been disbursed and in which year."]
[null,"Please Select One","Please Select One"]
[null,"Eligible Activity Summary \nPlease select the activity for which your awarded funds were applied."]
[null,"Activity","Award for this Activity? \nSelect Yes or No"]
[null,"Activity 1 Competitive: §401(a)(1)","Please Select One"]
[null,"Activity 2 Competitive: §401(a)(2)","Please Select One"]
[null,"Admin Used (§405(c))",0]

{"sheet":"2-Narrative Summary","index":2,"n_rows":30,"n_cols":4,"rows_kept":30,"cut":false,"hidden":false,"merged":[[13,6,13,7],[0,0,0,7],[1,0,1,7],[2,0,2,7],[3,0,3,7],[6,0,6,7],[29,0,29,7],[30,0,43,7],[7,0,7,7],[4,0,4,7],[5,0,5,7],[8,0,8,7],[9,0,9,7],[10,0,10,7],[14,0,14,7],[15,0,28,7],[11,0,11,7],[12,0,12,1],[12,3,12,5],[12,6,12,7],[13,0,13,1],[13,3,13,5]]}
["beginning of sheet 2: Narrative Summary"]
["PERMANENT LOCAL HOUSING ALLOCATION (PLHA) PROGRAM"]
["Annual Report"]
["Narrative Summary"]
["1. Please describe any issues or barriers you encountered in securing required entitlements, permits, zoning changes, and environmental clearances as applicable. "]
[]
["2. Please describe the targeted beneficiaries of your project including services to be provided."]
[]
["3. Please describe any proposed amendment(s) to the approved Activities and schedule (pursuant to Guidelines Section 503(b))"]
[]
["4. Please describe additional revenue generated from program funding in this reporting period and how revenue was generated (e.g. loan repayments, interest, fees). Please provide a description of how your estimate of households to be assisted was determined. (pursuant to Guidelines Section 302 (8))"]
[]
["4a. Program Income Earned this reporting period: ",null,null,"4b. Approximate Number of Households to be assisted with this period's Reuse Revenue: "]
["4c. Current Balance of Reuse Revenue: "]
["5. Please share any success stories you've had from PLHA-funded projects\nOptional: Grantees may sent attachments and photos to PLHASGM@hcd.ca.gov"]
[]
[]
[]
[]
[]
[]
[]
[]
[]
[]
[]
[]
[]
[]
["6. If your five-year plan includes any of the following activities:  2, 3, 4, 7, 8, 9, or 10, explain how you are targeting 20% of your allocation toward AOWH.  See Guidelines §303(e) \nIf AOWH is not applicable (e.g. if your plan only includes activities 1, 5, or 6), please enter \"N/A.\""]

{"sheet":"3-Financial Summary","index":3,"n_rows":34,"n_cols":8,"rows_kept":34,"cut":false,"hidden":false,"merged":[[30,0,30,2],[31,0,31,2],[32,0,32,2],[33,0,33,2],[24,0,24,2],[25,0,25,2],[26,0,26,2],[27,0,27,2],[28,0,28,2],[23,0,23,2],[23,3,23,5],[29,0,29,2],[24,3,24,5],[25,3,25,5],[1,0,1,7],[0,0,0,7],[5,1,5,2],[4,0,4,7],[3,0,3,7],[2,0,2,7],[5,6,5,7]]}
["beginning of sheet 3: Financial Summary"]
["PERMANENT LOCAL HOUSING ALLOCATION (PLHA) PROGRAM"]
["Annual Report "]
[{"$f":"_xlfn.IFS('1-Cover Sheet'!F11=\"Formula\",\"Financial Summary for Entitlement & Non-Entitlement Formula Allocations\",'1-Cover Sheet'!F11=\"Competitive\",\"Financial Summary for Non-Entitlement Competitive Allocations\",'1-Cover Sheet'!F11=\"Select One\",\"Financial Summary\")","v":"Financial Summary"}]
["Instructions: Enter the total amount of PLHA funds expended on Administrative Costs to date in cell C8. Use the table below to provide detail on project sites receiving PLHA funding. All projects must be given a unique identifying name in column A to be referenced on subsequent Activity and Outcome pages. Responses should reflect all PLHA funds expended during this reporting period."]
["Local Government or Administering Local Entity:",{"$f":"IF('1-Cover Sheet'!F9=\"\",'1-Cover Sheet'!F8,'1-Cover Sheet'!F9)","v":"Select One"},null,"HCD Contract Number: ",{"$f":"IF('1-Cover Sheet'!C8=\"\",\"\",'1-Cover Sheet'!C8)","v":""},"Reporting Period: ",{"$f":"'1-Cover Sheet'!F10","v":0}]
["Total Amount of PLHA Funds Awarded:","Total Amount of PLHA Funds Expended on Activity Costs:","Total Amount of PLHA Funds Expended on Administrative Expenses:","Percentage of PLHA Funds Expended on Administrative Expenses","Balance of Unexpended PLHA Funds","% of Unexpended PLHA Funds"]
[{"$f":"SUM('1-Cover Sheet'!C37:G37)","v":0},{"$f":"E22","v":0},null,{"$f":"IFERROR(C8/A8,0)","v":0},{"$f":"A8-B8-C8","v":0},{"$f":"IFERROR(E8/A8,0)","v":0}]
[]
["Project(s) Name/Identifier","Project Address\nStreet, City, Zip","Project County\nPlease select one","Activities \nPlease select all that apply\nRefer to Cover Sheet or Guidelines 301 (a) and 401 (a) for Activity references","Amount of PLHA Funds Expended on activity costs","Length of Affordability Restriction\n(in years), if applicable","Date of Affordability Covenant Expiration, if applicable","Total Cost of Project\n(include non-PLHA funds)"]
[]
[]
[]
[]
[]
[]
[]
[]
[]
[]
[]
["Projects Total",null,null,null,{"$f":"SUM(E12:E21)","v":0},null,null,{"$f":"SUM(H12:H21)","v":0}]
[]
["Formula Activity Reference",null,null,"Competitive Activity Reference"]
["Activity 1: §301(a)(1) The predevelopment, development, acquisition, rehabilitation, and preservation of multifamily, residential live-work, rental housing that is Affordable to Extremely low, -Very low-, Low-, or Moderate income households, including necessary operating subsidies",null,null,"Activity 1 Competitive: §401(a)(1) Development of new multifamily rental housing that is Affordable to households at or below 60% of AMI or substantial rehabilitation of multifamily rental housing that will be Affordable to households at or below 60% of AMI, but which is not currently restricted as Affordable housing."]
["Activity 2: §301(a)(2) The predevelopment, development, acquisition, rehabilitation, and preservation of Affordable rental and ownership Housing Including Accessory Dwelling Units (ADUs), that meets the needs of a growing workforce earning up to 120% of AMI, or 150% of AMI in high-cost areas. ADUs shall be available for occupancy for a term of no less than 30 days.",null,null,"Activity 2 Competitive: §401(a)(2) Assistance to persons who are experiencing or At risk of homelessness, including, but not limited to, through rapid rehousing, or rental assistance, supportive services, and case management services, that allow people to obtain and retain housing, operating and capital costs for navigation centers, or new construction, rehabilitation, or preservation of permanent or transitional rental housing. "]
["Activity 3: §301(a)(3) Matching Portion of Funds placed into Local or Regional Housing Trust Funds"]
["Activity 4: §301(a)(4) Matching portions of funds available through the Low- and Moderate-Income Housing Asset Fund pursuant to subdivision (d) of HSC Section 34176"]
["Activity 5: §301(a)(5) Capitalized Reserves for Services connected to the preservation and creation of new Permanent supportive housing."]
["Activity 6: §301(a)(6) Assisting persons who are experiencing or At risk of homelessness, including, but not limited to, providing rapid rehousing, rental assistance, supportive/case management services that allow people to obtain and retain housing, operating and capital costs for navigation centers and emergency shelters, and the new construction, rehabilitation, and preservation of permanent and transitional housing."]
["Activity 7: §301(a)(7) Accessibility modifications in Lower-income Owner-occupied housing."]
["Activity 8: §301(a)(8) Efforts to acquire and rehabilitate foreclosed or vacant homes and apartments."]
["Activity 9: §301(a)(9) Homeownership opportunities, including, but not limited to, down payment assistance"]
["Activity 10: §301(a)(10) Fiscal incentives made by a county to a city within the county to incentivize approval of one or more Affordable housing Projects, or matching funds invested by a county in an Affordable housing development Project in a city within the county, provided that the city has made an equal or greater investment in the Project. The county fiscal incentives shall be in the form of a grant or low-interest loan to an affordable housing Project. Matching funds investments by both the county and the city also shall be a grant or low-interest deferred loan to the Affordable housing project."]

{"sheet":"Activity 1","index":4,"n_rows":56,"n_cols":17,"rows_kept":56,"cut":false,"hidden":true,"merged":[[2,1,2,16],[0,1,0,16],[1,1,1,16],[4,1,4,8],[14,13,14,16],[14,1,14,12],[4,9,4,16],[35,7,35,9],[34,7,34,9],[33,7,33,9],[3,11,3,12],[3,14,3,15],[25,1,25,16],[24,1,24,16],[30,1,30,3],[29,1,29,3],[28,1,28,3],[27,1,27,3],[26,1,26,11],[35,1,35,3],[34,1,34,3],[33,1,33,3],[32,1,32,3],[31,1,31,3],[27,7,27,9],[32,7,32,9],[31,7,31,9],[30,7,30,9],[29,7,29,9],[28,7,28,9]]}
[null,"PERMANENT LOCAL HOUSING ALLOCATION (PLHA) FUND"]
[null,"Activity 1 Outcomes"]
[null,"§301(a)(1) The predevelopment, development, acquisition, rehabilitation, and preservation of multifamily, residential live-work, rental housing that is Affordable to Extremeley low, -Very low-, Low-, or Moderate income households, including necessary operating subsidies"]
[null,"Contract Number:",{"$f":"'1-Cover Sheet'!C8","v":0},"Total Award for Activity: ",{"$f":"SUM('1-Cover Sheet'!C15:G15)","v":0},"% of Total PLHA Award:",{"$f":"(SUM('1-Cover Sheet'!C15:G15))/(SUM('1-Cover Sheet'!C37:G37))","v":{"$error":"#DIV/0!"}},"Amount of PLHA Funds Expended on Activity:",{"$f":"SUM(E14:I14)","v":0},"% of Activity Award Expended:",{"$f":"IFERROR(I4/E4,0)","v":0},"Remaining Balance for Activity:",null,{"$f":"E4-I4","v":0},"% of Activity Funds Remaining:",null,{"$f":"IFERROR(N4/E4,0)","v":0}]
[null,"General Project Information and Expenditure Breakdown",null,null,null,null,null,null,null,"Households Served"]
[null,"Project:\n(Select from Drop-Down)","Developer Name","Grant or Loan","Amount of PLHA Funds Expended on Predevelopment","Amount of PLHA Funds  Expended on Construction/Development","Amount of PLHA Funds Expended on Acquisition","Amount of PLHA Funds Expended on Rehabilitation/Preservation","Amount of PLHA Funds  Expended on Operating Subsidies","Total Number of Individuals to occupy project","Total Number of Households to occupy the project","Seniors (65 and older) to occupy project","Veterans to occupy project","Disabled Persons to occupy project","Families with Minor Children to occupy project","Transition-Aged Youth (ages 18-24) to occupy project","Farmworkers to occupy project"]
["Yes",null,null,"Select One"]
["Yes",null,null,"Select One"]
["Yes",null,null,"Select One"]
["Yes",null,null,"Select One"]
["Yes",null,null,"Select One"]
["Yes",null,null,"Select One"]
["Yes",null,null,"Select One"]
[null,"Total:",null,null,{"$f":"SUM(E7:E13)","v":0},{"$f":"SUM(F7:F13)","v":0},0,0,0,{"$f":"SUM(J7:J13)","v":0},{"$f":"SUM(K7:K13)","v":0},{"$f":"SUM(L7:L13)","v":0},0,0,0,0,0]
[null,"Unit Details",null,null,null,null,null,null,null,null,null,null,null,"Project Status and Evidence of Compliance"]
[null,"Project","Total Number of Units in Project","Total Number of Units restricted for Affordability in Project","Type of Housing","Number of Units Receiving Operating Subsidy","Number of ADA Accessible Units Developed, Rehabilitated or Preserved","Number of Units Developed, Rehabilitated or Preserved for Formerly Homeless Individuals ","Number of Extremely Low- Income Units Developed, Rehabilitated or Preserved\n(Max 30% AMI)\n{Per Guidelines 101(n)}:","Number of Very Low-Income Units Developed, Rehabilitated or Preserved\n(Max 50% AMI)\n{Per Guidelines 101(cc)}:","Total Number of Units at or below 60% AMI Developed, Rehabilitated or Preserved","Number of Low(er)-Income Units Developed, Rehabilitated or Preserved (Max 80% AMI)\n{Per Guidelines 101(s)}:","Number of Moderate-Income Units Developed, Rehabilitated or Preserved\n(Max 120% AMI, or if in High Cost Area 150%)\n{Per Guidelines 101(t)}:","Project Status","Is Award Letter to Affordable Housing Project Attached?","Date of Project Completion \n(if applicable)","If Completed, is Certificate of Occupancy Attached?"]
[null,{"$f":"IF(B7=\"\",\"\",B7)","v":""},null,null,"Select One",null,null,null,null,null,null,null,null,"Select One","Select One",null,"Select One"]
[null,"",null,null,"Select One",null,null,null,null,null,null,null,null,"Select One","Select One",null,"Select One"]
[null,"",null,null,"Select One",null,null,null,null,null,null,null,null,"Select One","Select One",null,"Select One"]
[null,"",null,null,"Select One",null,null,null,null,null,null,null,null,"Select One","Select One",null,"Select One"]
[null,"",null,null,"Select One",null,null,null,null,null,null,null,null,"Select One","Select One",null,"Select One"]
[null,"",null,null,"Select One",null,null,null,null,null,null,null,null,"Select One","Select One",null,"Select One"]
[null,"",null,null,"Select One",null,null,null,null,null,null,null,null,"Select One","Select One",null,"Select One"]
[null,"Total:",{"$f":"SUM(C17:C23)","v":0},{"$f":"SUM(D17:D23)","v":0},null,{"$f":"SUM(F17:F23)","v":0},0,0,0,0,0,0,0]
[null,"Outcomes, Activity Expenditures, and Additional Comments\nPlease note, if you have not requested PLHA funds for this activity, describe the anticipated timeframe in which you will request and expend funds. If you have received PLHA funds but have not yet expended the funds, provide an explanation of when you plan to expend funds. Please be specific."]
[]
[null,"CUMULATIVE DATA:\nReport on totals as previously reported and totals from this reporting period. These two categories combined should represent the overall totals since the execution of your contract.\nThe information you provide should be based on PLHA funded units and individuals served by PLHA funds for this activity."]
[null,"UNITS",null,null,"Total prior to this reporting period","Total for this reporting period",null,"PEOPLE SERVED",null,null,"Total prior to this reporting period","Total for this reporting period"]
[null,"Number of Units Developed, Rehabilitated, or Preserved  by PLHA funds",null,null,null,null,null,"Number of Individuals Served"]
[null,"Number of ADA Accessible Units Developed, Rehabilitated or Preserved",null,null,null,null,null,"Number of Households Served"]
[null,"Number of Units Developed, Rehabilitated or Preserved for Formerly Homeless Individuals ",null,null,null,null,null,"Number of Seniors (65 and older) Served"]
[null,"Number of Extremely Low- Income Units Developed, Rehabilitated or Preserved\n(Max 30% AMI)\n{Per Guidelines 101(n)}:",null,null,null,null,null,"Number of Veterans Served"]
[null,"Number of Very Low-Income Units Developed, Rehabilitated or Preserved\n(Max 50% AMI)\n{Per Guidelines 101(cc)}:",null,null,null,null,null,"Number of Disabled Persons Served"]
[null,"Total Number of Units at or below 60% AMI Developed, Rehabilitated or Preserved",null,null,null,null,null,"Number of Families with Minor Children Served"]
[null,"Number of Low(er)-Income Units Developed, Rehabilitated or Preserved (Max 80% AMI)\n{Per Guidelines 101(s)}:",null,null,null,null,null,"Number of Transition-Aged Youth (ages 18-24) Served"]
[null,"Number of Moderate-Income Units Developed, Rehabilitated or Preserved\n(Max 120% AMI, or if in High Cost Area 150%)\n{Per Guidelines 101(t)}:",null,null,null,null,null,"Number of Farmworkers Served"]
[]
[]
[]
[]
[]
[]
[]
[]
[]
[]
[null,"Project","Total Spent","Project Status"]
[null,{"$f":"B7","v":0},{"$f":"SUM(E7:I7)","v":0},{"$f":"N17","v":"Select One"}]
[null,0,0,{"$f":"N18","v":"Select One"},"Completion Date"]
[null,0,0,"Select One",{"$f":"P17","v":0}]
[null,0,0,"Select One",{"$f":"P18","v":0}]
[null,0,0,"Select One",0]
[null,0,0,"Select One",0]
[null,0,0,"Select One",0]
[null,null,null,null,0]
[null,null,null,null,0]

{"sheet":"Activity 2","index":5,"n_rows":57,"n_cols":17,"rows_kept":57,"cut":false,"hidden":true,"merged":[[25,1,25,16],[0,1,0,16],[1,1,1,16],[14,12,14,16],[14,1,14,11],[24,1,24,16],[3,13,3,14],[4,1,4,8],[4,9,4,16],[2,1,2,16],[3,15,3,16],[26,1,26,11],[27,1,27,3],[27,7,27,9],[28,1,28,3],[28,7,28,9],[29,1,29,3],[29,7,29,9],[30,1,30,3],[30,7,30,9],[31,1,31,3],[31,7,31,9],[35,1,35,3],[35,7,35,9],[32,1,32,3],[32,7,32,9],[33,1,33,3],[33,7,33,9],[34,1,34,3],[34,7,34,9]]}
[null,"PERMANENT LOCAL HOUSING ALLOCATION (PLHA) FUND"]
[null,"Activity 2 Outcomes"]
[null,"§301(a)(2) The predevelopment, development, acquisition, rehabilitation, and preservation of Affordable rental and ownership Housing Including Accessory Dwelling Units (ADUs), that meets the needs of a growing workforce earning up to 120% of AMI, or 150% of AMI in high-cost areas. ADUs shall be available for occupancy for a term of no less than 30 days."]
[null,"Contract Number:",{"$f":"'1-Cover Sheet'!C8","v":0},"Total Award for Activity: ",{"$f":"(SUM('1-Cover Sheet'!C17:G17))","v":0},"% of Total PLHA Award:",{"$f":"(SUM('1-Cover Sheet'!C17:G17))/(SUM('1-Cover Sheet'!C37:G37))","v":{"$error":"#DIV/0!"}},"Amount of PLHA Funds Expended on Activity:",{"$f":"SUM(E14:I14)","v":0},"% of Activity Award Expended:",{"$f":"IFERROR(I4/E4,0)","v":0},"Remaining Balance for Activity:",{"$f":"E4-I4","v":0},"% of Activity Funds Remaining:",null,{"$f":"IFERROR(M4/E4,0)","v":0}]
[null,"General Project Information and Expenditure Breakdown",null,null,null,null,null,null,null,"Households Served"]
[null,"Project:\n(Select from Drop-Down)","Developer Name","Grant or Loan","Amount of PLHA Funds Expended on Predevelopment","Amount of PLHA Funds Expended on Construction/Development","Amount of PLHA Funds Expended on Acquisition","Amount of PLHA Funds Expended on Rehabilitation/Preservation","Amount of PLHA Funds Expended on Operating Subsidies","Total Number of Individuals to occupy project","Total Number of Households to occupy the project","Total Number of Seniors (65 and older) to occupy project","Total Number of Veterans to occupy project","Total Number of Disabled Persons to occupy project","Total Number of Families with Minor Children to occupy project","Total Number of Transition-Aged Youth (ages 18-24) to occupy project","Total Number of Farmworkers to Occupy Project"]
["Yes",null,null,"Select One"]
["Yes",null,null,"Select One"]
["Yes",null,null,"Select One"]
["Yes",null,null,"Select One"]
["Yes",null,null,"Select One"]
["Yes",null,null,"Select One"]
["Yes",null,null,"Select One"]
[null,"Total:",null,null,{"$f":"SUM(E7:E13)","v":0},{"$f":"SUM(F7:F13)","v":0},0,0,0,{"$f":"SUM(J7:J13)","v":0},{"$f":"SUM(K7:K13)","v":0},{"$f":"SUM(L7:L13)","v":0},0,0,0,0,{"$f":"SUM(Q7:Q13)","v":0}]
[null,"Unit Details",null,null,null,null,null,null,null,null,null,null,"Project Status and Evidence of Compliance"]
[null,"Project","Number of Housing Units Developed, Acquired, Rehabilitated or Preserved","Type of Housing","Number of ADA-Accessible Units Developed, Rehabilitated or Preserved","Number of Units Developed, Rehabilitated or Preserved for Formerly Homeless Individuals","Number of Extremely Low- Income Units Developed, Rehabilitated or Preserved\n(Max 30% AMI)\n{Per Guidelines 101(n)}:","Number of Very Low-Income Units Developed, Rehabilitated or Preserved\n(Max 50% AMI)\n{Per Guidelines 101(cc)}:","Total Number of Units at or below 60% AMI Developed, Rehabilitated or Preserved","Number of Low(er)-Income Units Developed, Rehabilitated or Preserved (Max 80%AMI)\n{Per Guidelines 101(s)}:","Number of Moderate-Income Units Developed, Rehabilitated or Preserved\n(Max 120% AMI, or if in High Cost Area 150%)\n{Per Guidelines 101(t)}:","Tax Credit Project","Is Deed Restriction Recorded?","Project Status","Is Award Letter to Affordable Housing Project Attached?","Date of Project Completion \n(if applicable)","If Completed, is Certificate of Occupancy Attached?"]
[null,{"$f":"IF(B7=\"\",\"\",B7)","v":""},null,"Select One",null,null,null,null,null,null,null,"Select One","Select One","Select One","Select One",null,"Select One"]
[null,"",null,"Select One",null,null,null,null,null,null,null,"Select One","Select One","Select One","Select One",null,"Select One"]
[null,"",null,"Select One",null,null,null,null,null,null,null,"Select One","Select One","Select One","Select One",null,"Select One"]
[null,"",null,"Select One",null,null,null,null,null,null,null,"Select One","Select One","Select One","Select One",null,"Select One"]
[null,"",null,"Select One",null,null,null,null,null,null,null,"Select One","Select One","Select One","Select One",null,"Select One"]
[null,"",null,"Select One",null,null,null,null,null,null,null,"Select One","Select One","Select One","Select One",null,"Select One"]
[null,"",null,"Select One",null,null,null,null,null,null,null,"Select One","Select One","Select One","Select One",null,"Select One"]
[null,"Total:",{"$f":"SUM(C17:C23)","v":0},null,{"$f":"SUM(E17:E23)","v":0},0,0,0,0,0,0]
[null,"Outcomes, Activity Expenditures, and Additional Comments\nPlease note, if you have not requested PLHA funds for this activity, describe the anticipated timeframe in which you will request and expend funds. If you have received PLHA funds but have not yet expended the funds, provide an explanation of when you plan to expend funds. Please be specific."]
[]
[null,"CUMULATIVE DATA:\nReport on totals as previously reported and totals from this reporting period. These two categories combined should represent the overall totals since the execution of your contract.\nThe information you provide should be based on PLHA funded units and individuals served by PLHA funds for this activity."]
[null,"UNITS",null,null,"Total prior to this reporting period","Total for this reporting period",null,"PEOPLE SERVED",null,null,"Total prior to this reporting period","Total for this reporting period"]
[null,"Number of Units Developed, Rehabilitated, or Preserved  by PLHA funds",null,null,null,null,null,"Number of Individuals Served"]
[null,"Number of ADA Accessible Units Developed, Rehabilitated or Preserved",null,null,null,null,null,"Number of Households Served"]
[null,"Number of Units Developed, Rehabilitated or Preserved for Formerly Homeless Individuals ",null,null,null,null,null,"Number of Seniors (65 and older) Served"]
[null,"Number of Extremely Low- Income Units Developed, Rehabilitated or Preserved\n(Max 30% AMI)\n{Per Guidelines 101(n)}:",null,null,null,null,null,"Number of Veterans Served"]
[null,"Number of Very Low-Income Units Developed, Rehabilitated or Preserved\n(Max 50% AMI)\n{Per Guidelines 101(cc)}:",null,null,null,null,null,"Number of Disabled Persons Served"]
[null,"Total Number of Units at or below 60% AMI Developed, Rehabilitated or Preserved",null,null,null,null,null,"Number of Families with Minor Children Served"]
[null,"Number of Low(er)-Income Units Developed, Rehabilitated or Preserved (Max 80% AMI)\n{Per Guidelines 101(s)}:",null,null,null,null,null,"Number of Transition-Aged Youth (ages 18-24) Served"]
[null,"Number of Moderate-Income Units Developed, Rehabilitated or Preserved\n(Max 120% AMI, or if in High Cost Area 150%)\n{Per Guidelines 101(t)}:",null,null,null,null,null,"Number of Farmworkers Served"]
[]
[]
[]
[]
[]
[]
[]
[]
[]
[]
[]
[]
[]
[null,"Project","Total Spent","Project Status","Completion Date"]
[null,{"$f":"B7","v":0},{"$f":"SUM(E7:I7)","v":0},{"$f":"N17","v":"Select One"},{"$f":"P17","v":"00:00:00"}]
[null,0,0,"Select One","00:00:00"]
[null,0,0,"Select One","00:00:00"]
[null,0,0,"Select One","00:00:00"]
[null,0,0,"Select One","00:00:00"]
[null,0,0,"Select One","00:00:00"]
[null,0,0,"Select One","00:00:00"]

{"sheet":"Activity 3","index":6,"n_rows":53,"n_cols":9,"rows_kept":53,"cut":false,"hidden":true,"merged":[[0,1,0,8],[1,1,1,8],[2,1,2,8],[15,1,15,8],[16,1,16,8],[5,1,5,8],[3,5,3,6],[4,5,4,6],[3,7,3,8],[4,7,4,8],[17,1,17,8],[22,1,22,2],[21,1,21,2],[20,1,20,2],[19,1,19,2],[18,1,18,2],[22,5,22,6],[21,5,21,6],[20,5,20,6],[19,5,19,6],[18,5,18,6]]}
[null,"PERMANENT LOCAL HOUSING ALLOCATION (PLHA) FUND"]
[null,"Activity 3 Outcomes"]
[null,"§301(a)(3) Matching Portion of Funds placed into Local or Regional Housing Trust Funds"]
[null,"Contract Number:",{"$f":"'1-Cover Sheet'!C8","v":0},"Total Award for Activity: ",{"$f":"(SUM('1-Cover Sheet'!C19:G19))","v":0},"% of Total PLHA Award:",null,{"$f":"(SUM('1-Cover Sheet'!C19:G19))/(SUM('1-Cover Sheet'!C37:G37))","v":{"$error":"#DIV/0!"}}]
[null,"Amount of Activity Award Expended",{"$f":"C15","v":0},"Remaining Balance for Activity:",{"$f":"E4-C15","v":0},"% of Activity Funds Remaining:",null,{"$f":"IFERROR(E5/E4,0)","v":0}]
[null,"Trust Fund Details"]
[null,"Project:\n(Select from Drop-Down)","Amount of PLHA Funds Deposited into Trust Fund","Local or Regional Trust","Type of Trust Fund","Type of Project being Funded","Project Status","Date of Project Completion (if applicable) ","Proof of Deposit Attached?"]
["Yes",null,null,"Select One","Select One","Select One","Select One",null,"Select One"]
["Yes",null,null,"Select One","Select One","Select One","Select One",null,"Select One"]
["Yes",null,null,"Select One","Select One","Select One","Select One",null,"Select One"]
["Yes",null,null,"Select One","Select One","Select One","Select One",null,"Select One"]
["Yes",null,null,"Select One","Select One","Select One","Select One",null,"Select One"]
["Yes",null,null,"Select One","Select One","Select One","Select One",null,"Select One"]
["Yes",null,null,"Select One","Select One","Select One","Select One",null,"Select One"]
[null,"Total:",{"$f":"SUM(C8:C14)","v":0}]
[null,"Outcomes, Activity Expenditures, and Additional Comments\nPlease note, if you have not requested PLHA funds for this activity, describe the anticipated timeframe in which you will request and expend funds. \nIf you have received PLHA funds but have not yet expended the funds, provide an explanation of when you plan to expend funds. Please be specific."]
[]
[null,"CUMULATIVE DATA:\nReport on totals as previously reported and totals from this reporting period. These two categories combined should represent the overall totals since the execution of your contract.\nThe information you provide should be based on PLHA funded units and individuals served by PLHA funds for this activity."]
[null,"UNITS",null,"Total prior to this reporting period","Total for this reporting period","PEOPLE SERVED",null,"Total prior to this reporting period","Total for this reporting period"]
[null,"Number of Units Funded by PLHA",null,null,null,"Number of Individuals Served"]
[null,"Number of Rental Units Funded by PLHA"]
[null,"Number of Ownership Units Funded by PLHA"]
[null,"Number of ADUs Funded by PLHA"]
[]
[]
[]
[]
[]
[]
[]
[]
[]
[]
[]
[]
[]
[]
[]
[]
[]
[]
[]
[]
[]
[]
[null,"Project","Total Spent","Project Status","Completion Date"]
[null,{"$f":"B8","v":0},0,{"$f":"G8","v":"Select One"},{"$f":"H8","v":"00:00:00"}]
[null,0,0,{"$f":"G9","v":"Select One"},{"$f":"H9","v":"00:00:00"}]
[null,0,0,"Select One","00:00:00"]
[null,0,0,"Select One","00:00:00"]
[null,0,0,"Select One","00:00:00"]
[null,0,0,"Select One","00:00:00"]
[null,0,0,"Select One","00:00:00"]

{"sheet":"Activity 4","index":7,"n_rows":56,"n_cols":7,"rows_kept":56,"cut":false,"hidden":true,"merged":[[2,1,2,6],[0,1,0,6],[1,1,1,6],[5,1,5,6],[20,5,20,6],[21,5,21,6],[17,1,17,6],[15,1,15,6],[16,1,16,6]]}
[null,"PERMANENT LOCAL HOUSING ALLOCATION (PLHA) FUND"]
[null,"Activity 4 Outcomes"]
[null,"§301(a)(4) Matching portions of funds available through the Low- and Moderate-Income Housing Asset Fund (LMIHAF) pursuant to subdivision (d) of HSC Section 34176"]
[null,"Contract Number:",{"$f":"'1-Cover Sheet'!C8","v":0},"Total Award for Activity: ",{"$f":"(SUM('1-Cover Sheet'!C21:G21))","v":0},"% of Total PLHA Award:",{"$f":"(SUM('1-Cover Sheet'!C21:G21))/(SUM('1-Cover Sheet'!C37:G37))","v":{"$error":"#DIV/0!"}}]
[null,"Amount of Activity Award Expended:",{"$f":"C15","v":0},"Remaining Balance for Activity:",{"$f":"E4-C15","v":0},"% of Activity Funds Remaining:",{"$f":"IFERROR(E5/E4,0)","v":0}]
[null,"Trust Fund Details"]
[null,"Project:\n(Select from Drop-Down)","Amount of PLHA Funds Deposited into LMIHAF ","Type of Project being Funded","Project Status","Date of Project Completion (if applicable) ","Proof of Deposit Attached?"]
["Yes",null,null,"Select One","Select One",null,"Select One"]
["Yes",null,null,"Select One","Select One",null,"Select One"]
["Yes",null,null,"Select One","Select One",null,"Select One"]
["Yes",null,null,"Select One","Select One",null,"Select One"]
["Yes",null,null,"Select One","Select One",null,"Select One"]
["Yes",null,null,"Select One","Select One",null,"Select One"]
["Yes",null,null,"Select One","Select One",null,"Select One"]
[null,"Total:",{"$f":"SUM(C8:C14)","v":0}]
[null,"Outcomes, Activity Expenditures, and Additional Comments\nPlease note, if you have not requested PLHA funds for this activity, describe the anticipated timeframe in which you will request and expend funds. If you have received PLHA funds but have not yet expended the funds, provide an explanation of when you plan to expend funds. Please be specific."]
[]
[null,"CUMULATIVE DATA:\nReport on totals as previously reported and totals from this reporting period. \nThese two categories combined should represent the overall totals since the execution of your contract.\nThe information you provide should be based on PLHA funded units and individuals served by PLHA funds for this activity."]
[null,"UNITS","Total prior to this reporting period","Total for this reporting period","PEOPLE SERVED","Total prior to this reporting period","Total for this reporting period"]
[null,"Number of Units Funded by PLHA",null,null,"Number of Individuals Served"]
[null,"Number of Rental Units Funded by PLHA"]
[null,"Number of Ownership Units Funded by PLHA"]
[]
[]
[]
[]
[]
[]
[]
[]
[]
[]
[]
[]
[]
[]
[]
[]
[]
[]
[]
[]
[]
[]
[]
[]
[]
[]
[null,"Project","Total Spent","Project Status","Completion Date"]
[null,{"$f":"B8","v":0},0,{"$f":"E8","v":"Select One"},"00:00:00"]
[null,0,0,"Select One","00:00:00"]
[null,0,0,"Select One","00:00:00"]
[null,0,0,"Select One","00:00:00"]
[null,0,0,"Select One","00:00:00"]
[null,0,0,"Select One","00:00:00"]
[null,0,0,"Select One","00:00:00"]

{"sheet":"Activity 5","index":8,"n_rows":57,"n_cols":10,"rows_kept":57,"cut":false,"hidden":true,"merged":[[16,1,16,9],[17,1,17,9],[18,1,18,9],[0,1,0,9],[1,1,1,9],[2,1,2,9],[5,1,5,9],[15,1,15,9],[3,8,3,9],[4,8,4,9],[3,6,3,7],[4,6,4,7],[3,3,3,4],[4,3,4,4],[22,5,22,6],[23,5,23,6],[19,1,19,9],[21,6,21,7],[20,6,20,7],[23,1,23,2],[22,1,22,2],[21,1,21,2],[20,1,20,2]]}
[null,"PERMANENT LOCAL HOUSING ALLOCATION (PLHA) FUND"]
[null,"Activity 5 Outcomes"]
[null,"§301(a)(5) Capitalized Reserves for Services connected to the preservation and creation of new permanent supportive housing (PSH)."]
[null,"Contract Number:",{"$f":"'1-Cover Sheet'!C8","v":0},"Total Award for Activity: ",null,{"$f":"(SUM('1-Cover Sheet'!C23:G23))","v":0},"% of Total PLHA Award:",null,{"$f":"(SUM('1-Cover Sheet'!C23:G23))/(SUM('1-Cover Sheet'!C37:G37))","v":{"$error":"#DIV/0!"}}]
[null,"Amount of Activity Award Encumbered:",{"$f":"G15","v":0},"Remaining Balance for Activity:",null,{"$f":"F4-G15","v":0},"% of Activity Funds Remaining:",null,{"$f":"IFERROR(F5/F4,0)","v":0}]
[null,"Project Information"]
[null,"Project:\n(Select from Drop-Down)","Number of Existing Permanent Supportive Housing Units Preserved by PLHA Funds","Number of New Permanent Supportive Units Created by PLHA Funds","Project Status","Date of Project Completion (if applicable) ","Amount of PLHA Deposited into Capitalized Reserves","New Balance of Capitalized Reserve Fund","Source of Additional Funds","Proof of Reserve Account Deposit and Current Bank Statement Attached"]
["Yes",null,null,null,"Select One",null,null,null,null,"Select One"]
["Yes",null,null,null,"Select One",null,null,null,null,"Select One"]
["Yes",null,null,null,"Select One",null,null,null,null,"Select One"]
["Yes",null,null,null,"Select One",null,null,null,null,"Select One"]
["Yes",null,null,null,"Select One",null,null,null,null,"Select One"]
["Yes",null,null,null,"Select One",null,null,null,null,"Select One"]
["Yes",null,null,null,"Select One",null,null,null,null,"Select One"]
[null,"Total:",{"$f":"SUM(C8:C14)","v":0},0,null,null,{"$f":"SUM(G8:G14)","v":0},{"$f":"SUM(H8:H14)","v":0}]
[null,"Describe the Services provided by PLHA funds in relation to preservation and creation of Permanent Supportive Housing"]
[]
[null,"Outcomes, Activity Expenditures, and Additional Comments\nPlease note, if you have not requested PLHA funds for this activity, describe the anticipated timeframe in which you will request and expend funds. \nIf you have received PLHA funds but have not yet expended the funds, provide an explanation of when you plan to expend funds. Please be specific."]
[]
[null,"CUMULATIVE DATA:\nReport on totals as previously reported and totals from this reporting period. These two categories combined should represent the overall totals since the execution of your contract.\nThe information you provide should be based on PLHA funded units and individuals served by PLHA funds for this activity."]
[null,"UNITS",null,"Total prior to this reporting period","Total for this reporting period",null,"PEOPLE SERVED",null,"Total prior to this reporting period","Total for this reporting period"]
[null,"Number of Units Funded by PLHA",null,null,null,null,"Number of Individuals Served"]
[null,"Number of Existing Permanent Supportive Housing Units Preserved by PLHA Funds"]
[null,"Number of New Permanent Supportive Units Created by PLHA Funds"]
[]
[]
[]
[]
[]
[]
[]
[]
[]
[]
[]
[]
[]
[]
[]
[]
[]
[]
[]
[]
[]
[]
[]
[]
[]
[null,"Project","Total Spent","Project Status","Completion Date"]
[null,{"$f":"B8","v":0},{"$f":"G8","v":0},{"$f":"E8","v":"Select One"},{"$f":"F8","v":"00:00:00"}]
[null,0,0,{"$f":"E9","v":"Select One"},"00:00:00"]
[null,0,0,"Select One","00:00:00"]
[null,0,0,"Select One","00:00:00"]
[null,0,0,"Select One","00:00:00"]
[null,0,0,"Select One","00:00:00"]
[null,0,0,"Select One","00:00:00"]

{"sheet":"Activity 6","index":9,"n_rows":58,"n_cols":14,"rows_kept":58,"cut":false,"hidden":true,"merged":[[30,11,30,13],[30,1,30,10],[39,12,39,13],[42,1,42,13],[43,1,43,13],[40,1,40,13],[41,1,41,13],[16,12,16,13],[17,12,17,13],[18,12,18,13],[19,12,19,13],[20,1,20,13],[16,1,16,2],[17,1,17,2],[18,1,18,2],[16,3,16,4],[17,3,17,4],[18,3,18,4],[19,3,19,4],[19,1,19,2],[2,1,2,13],[1,1,1,13],[0,1,0,13],[15,1,15,13],[14,1,14,13],[11,12,11,13],[12,12,12,13],[13,12,13,13],[4,1,4,13],[6,12,6,13],[7,12,7,13],[8,12,8,13],[9,12,9,13],[10,12,10,13],[5,12,5,13],[3,11,3,12],[49,7,49,9],[50,1,50,3],[44,1,44,11],[45,1,45,3],[45,7,45,9],[47,1,47,3],[47,7,47,9],[57,7,57,9],[46,7,46,9],[46,1,46,3],[53,7,53,9],[56,7,56,9],[55,7,55,9],[54,7,54,9],[51,1,51,3],[50,7,50,9],[52,1,52,3],[51,7,51,9],[53,1,53,3],[52,7,52,9],[48,1,48,3],[48,7,48,9],[49,1,49,3]]}
[null,"PERMANENT LOCAL HOUSING ALLOCATION (PLHA) FUND"]
[null,"Activity 6 Outcomes"]
[null,"§301(a)(6) Assisting persons who are experiencing or At risk of homelessness, including, but not limited to, providing rapid rehousing, rental assistance, supportive/case management services that allow people to obtain and retain housing, operating and capital costs for navigation centers and emergency shelters, and the new construction, rehabilitation, and preservation of permanent and transitional housing."]
[null,"Contract Number:",{"$f":"'1-Cover Sheet'!C8","v":0},"Total Award for Activity: ",{"$f":"(SUM('1-Cover Sheet'!C25:G25))","v":0},"% of Total PLHA Award:",{"$f":"(SUM('1-Cover Sheet'!C25:G25))/(SUM('1-Cover Sheet'!C37:G37))","v":{"$error":"#DIV/0!"}},"% of PLHA Activity Award Expended:",{"$f":"IFERROR(M14/E4,0)","v":0},"Remaining Balance for Activity:",{"$f":"E4-M14","v":0},"% of Activity Funds Remaining:",null,{"$f":"IFERROR(K4/E4,0)","v":0}]
[null,"Expenditure Breakdown"]
[null,"Project:\n(Select from Drop-Down)","Amount of PLHA Funds Expended on Rapid Re-Housing","Amount of PLHA Funds Expended on Rental Assistance","Amount of PLHA Funds Expended On Supportive/Case Management","Amount of PLHA Funds Expended on Operating and Capital Costs for Navigation Centers","Amount of PLHA Funds Expended On Operating and Capital Costs for Emergency Shelters","Amount of PLHA Funds Expended on New Construction of Permanent Housing","Amount of PLHA Funds Expended on New Construction of Transitional Housing","Amount of PLHA Funds Expended on Rehabilitation and/or Preservation of Permanent Housing","Amount of PLHA Funds Expended on Rehabilitation and/or Preservation of Transitional Housing","Amount of PLHA Funds Expended on Other eligible activities\n(please describe in additional comments)","Total Amount of PLHA Funds Expended"]
["Yes",null,null,null,null,null,null,null,null,null,null,null,{"$f":"SUM(B7:L7)","v":0}]
["Yes",null,null,null,null,null,null,null,null,null,null,null,{"$f":"SUM(B8:L8)","v":0}]
["Yes",null,null,null,null,null,null,null,null,null,null,null,0]
["Yes",null,null,null,null,null,null,null,null,null,null,null,0]
["Yes",null,null,null,null,null,null,null,null,null,null,null,0]
["Yes",null,null,null,null,null,null,null,null,null,null,null,0]
["Yes",null,null,null,null,null,null,null,null,null,null,null,0]
[null,"Total",{"$f":"SUM(C7:C13)","v":0},{"$f":"SUM(D7:D13)","v":0},0,0,0,0,0,{"$f":"SUM(J7:J13)","v":0},0,{"$f":"SUM(L7:L13)","v":0},{"$f":"SUM(M7:M13)","v":0}]
[null,"Sub-Awards "]
[null,"This Activity may include subawards to Administrative Entities as defined in HSC Section 50490(a)(1-3) that were awarded CESH program or HEAP funds for rental assistance to continue assistance to these households (§301(a)(6)(A)).\nInstructions: If program funds were awarded to subrecipients, please use the boxes below to provide the name of the awarded Administrative Entity, the type of funding and contract number from their previous funds (CESH or HEAP), the amount awarded to the subrecipient and the date of the subrecipient award letter."]
[null,"Subawarded Administrative Entity Name:",null,null,null,"Subawarded PLHA Amount:",null,"Prior Source of Rental Assistance:","Select One","HCD CESH or HEAP Contract Number: ",null,"Subrecipient Award Letter Attached?","Select One"]
[null,"Subawarded Administrative Entity Name:",null,null,null,"Subawarded PLHA Amount:",null,"Prior Source of Rental Assistance:","Select One","HCD CESH or HEAP Contract Number: ",null,"Subrecipient Award Letter Attached?","Select One"]
[null,"Subawarded Administrative Entity Name:",null,null,null,"Subawarded PLHA Amount:",null,"Prior Source of Rental Assistance:","Select One","HCD CESH or HEAP Contract Number: ",null,"Subrecipient Award Letter Attached?","Select One"]
[null,"Subawarded Administrative Entity Name:",null,null,null,"Subawarded PLHA Amount:",null,"Prior Source of Rental Assistance:","Select One","HCD CESH or HEAP Contract Number: ",null,"Subrecipient Award Letter Attached?","Select One"]
[null,"Households Served"]
[null,"Project","Number of Persons assisted by Rapid Rehousing","Number of Persons assisted by Rental Assistance","Number of Persons assisted by Supportive/Case Management","Total Number of Unduplicated Persons assisted by project","Number of Individuals to Exit to Homelessness","Number of Individuals to Occupy Newly Constructed or Rehabilitated Permanent Housing","Number of Individuals to Occupy Newly Constructed or Rehabilitated Transitional Housing","Number of Seniors Assisted (65 and older)","Number of Veterans Assisted","Number of Disabled Persons Assisted","Number of Families with Minor Children Assisted","Number of Transition-Aged Youth (18-24) Assisted"]
[null,{"$f":"IF(B7=\"\",\"\",B7)","v":""}]
[null,{"$f":"IF(B8=\"\",\"\",B8)","v":""}]
[null,""]
[null,""]
[null,""]
[null,""]
[null,""]
[null,"Total",{"$f":"SUM(C23:C29)","v":0},0,0,0,0,0,0,0,0,0,0,{"$f":"SUM(N23:N29)","v":0}]
[null,"Unit Breakdown",null,null,null,null,null,null,null,null,null,"Project Status and Evidence of Compliance"]
[null,"Project","Number of Housing Units Receiving Rapid-Rehousing Assistance","Number of Housing Units Receiving Rental Assistance","Number of Housing Units Receiving Supportive/Case Management Services","Number of Housing Units Receiving Operating or Capital subsidy ","Number of Emergency Shelter Beds Supported","Number of Permanent Units Developed, Rehabilitated or Preserved","Number of Transitional Units Developed, Rehabilitated or Preserved","Total number of unduplicated Units Developed, Rehabilitated or Preserved","Type of Housing Developed, Rehabilitated, or Preserved","Project Status","If Completed, is Certificate of Occupancy Attached?","Completion Date (if applicable) "]
[null,{"$f":"IF(B7=\"\",\"\",B7)","v":""},null,null,null,null,null,null,null,null,"Select One","Select One","Select One"]
[null,{"$f":"IF(B8=\"\",\"\",B8)","v":""},null,null,null,null,null,null,null,null,"Select One","Select One","Select One"]
[null,"",null,null,null,null,null,null,null,null,"Select One","Select One","Select One"]
[null,"",null,null,null,null,null,null,null,null,"Select One","Select One","Select One"]
[null,"",null,null,null,null,null,null,null,null,"Select One","Select One","Select One"]
[null,"",null,null,null,null,null,null,null,null,"Select One","Select One","Select One"]
[null,"",null,null,null,null,null,null,null,null,"Select One","Select One","Select One"]
[null,"Total",{"$f":"SUM(C33:C39)","v":0},{"$f":"SUM(D33:D39)","v":0},{"$f":"SUM(E33:E39)","v":0},0,0,0,0,0]
[null,"Explain how you are providing services consistent with the Housing First Practices per 25 CCR, Sec. 8409, Subdivision (b)(1)-(6) and in compliance with WIC, Sec. 8255(b)(8)"]
[]
[null,"Outcomes, Activity Expenditures (including expenditures on assistance or services not listed), and Additional Comments\nPlease note, if you have not requested PLHA funds for this activity, describe the anticipated timeframe in which you will request and expend funds. If you have received PLHA funds but have not yet expended the funds, provide an explanation of when you plan to expend funds. Please be specific."]
[]
[null,"CUMULATIVE DATA:\nReport on totals as previously reported and totals from this reporting period. These two categories combined should represent the overall totals since the execution of your contract.\nThe information you provide should be based on PLHA funded units and individuals served by PLHA funds for this activity."]
[null,"UNITS",null,null,"Total prior to this reporting period","Total for this reporting period",null,"PEOPLE SERVED",null,null,"Total prior to this reporting period","Total for this reporting period"]
[null,"Number of Units Developed, Rehabilitated, or Preserved",null,null,null,null,null,"Number of Persons Served"]
[null,"Number of Housing Units Receiving Rapid-Rehousing Assistance",null,null,null,null,null,"Number of Persons assisted by Rapid Rehousing"]
[null,"Number of Housing Units Receiving Rental Assistance",null,null,null,null,null,"Number of Persons assisted by Rental Assistance"]
[null,"Number of Housing Units Receiving Supportive/Case Management Services",null,null,null,null,null,"Number of Persons assisted by Supportive/Case Management"]
[null,"Number of Housing Units Receiving Operating or Capital subsidy ",null,null,null,null,null,"Number of Individuals to Exit to Homelessness"]
[null,"Number of Emergency Shelter Beds Supported",null,null,null,null,null,"Number of Individuals to Occupy Newly Constructed or Rehabilitated Permanent Housing"]
[null,"Number of Permanent Units Developed, Rehabilitated or Preserved",null,null,null,null,null,"Number of Individuals to Occupy Newly Constructed or Rehabilitated Transitional Housing"]
[null,"Number of Transitional Units Developed, Rehabilitated or Preserved",null,null,null,null,null,"Number of Seniors Assisted (65 and older)"]
[null,null,null,null,{"$f":"N36","v":"00:00:00"},null,null,"Number of Veterans Assisted"]
[null,{"$f":"B10","v":0},{"$f":"M10","v":0},{"$f":"L36","v":"Select One"},"00:00:00",null,null,"Number of Disabled Persons Assisted"]
[null,{"$f":"B11","v":0},{"$f":"M11","v":0},{"$f":"L37","v":"Select One"},"00:00:00",null,null,"Number of Families with Minor Children Assisted"]
[null,{"$f":"B12","v":0},{"$f":"M12","v":0},{"$f":"L38","v":"Select One"},null,null,null,"Number of Transition-Aged Youth (18-24) Assisted"]

{"sheet":"Activity 7","index":10,"n_rows":54,"n_cols":13,"rows_kept":54,"cut":false,"hidden":true,"merged":[[24,1,24,12],[25,1,25,12],[14,1,14,7],[1,1,1,12],[0,1,0,12],[2,1,2,12],[4,1,4,5],[4,6,4,12],[14,8,14,12],[26,1,26,12],[34,8,34,10],[33,8,33,10],[32,8,32,10],[31,8,31,10],[30,8,30,10],[29,8,29,10],[32,1,32,3],[29,1,29,3],[30,1,30,3],[31,1,31,3],[27,1,27,3],[27,8,27,10],[28,1,28,3],[28,8,28,10]]}
[null,"PERMANENT LOCAL HOUSING ALLOCATION (PLHA) FUND"]
[null,"Activity 7 Outcomes"]
[null,"§301(a)(7) Accessibility modifications in Lower-income Owner-occupied housing."]
[null,"Contract Number:",{"$f":"'1-Cover Sheet'!C8","v":0},"Total Award for Activity: ",{"$f":"(SUM('1-Cover Sheet'!C27:G27))","v":0},"% of Total PLHA Award:",{"$f":"(SUM('1-Cover Sheet'!C27:G27))/(SUM('1-Cover Sheet'!C37:G37))","v":{"$error":"#DIV/0!"}},"Amount of PLHA Funds Expended on Activity:",{"$f":"C14","v":0},"% of Activity Award Expended:",{"$f":"IFERROR(C14/E4,0)","v":0},"Remaining Balance for Activity:",{"$f":"E4-C14","v":0}]
[null,"General Project Information",null,null,null,null,"Households Served"]
[null,"Project:\n(Select from Drop-Down)","Amount of PLHA Funds Expended ","Contractor Name","Was Prevailing Wage Paid? ","How was Assistance Provided to Homeowner? ","Total Number of Individuals assisted","Total Number of Households assisted","Number of Seniors Assisted (65 and older)","Number of Veterans Assisted","Number of Disabled Persons Assisted","Number of Families with Minor Children Assisted","Number of Transition-Aged Youth (18-24) Assisted"]
["Yes",null,null,null,null,"Select One"]
["Yes",null,null,null,null,"Select One"]
["Yes",null,null,null,null,"Select One"]
["Yes",null,null,null,null,"Select One"]
["Yes",null,null,null,null,"Select One"]
["Yes",null,null,null,null,"Select One"]
["Yes",null,null,null,null,"Select One"]
[null,"Total:",{"$f":"SUM(C7:C13)","v":0},null,null,null,{"$f":"SUM(G7:G13)","v":0},{"$f":"SUM(H7:H13)","v":0},{"$f":"SUM(I7:I13)","v":0},0,0,0,0]
[null,"Unit Details",null,null,null,null,null,null,"Project Status and Evidence of Compliance"]
[null,"Project","Total Number of Units in Project","Type of Housing","Number of Extremely Low- Income Units Rehabilitated\n(Max 30% AMI)\n{Per Guidelines 101(n)}:","Number of Very Low-Income Units Rehabilitated\n(Max 50% AMI)\n{Per Guidelines 101(cc)}:","Total Number of Units at or below 60% AMI Rehabilitated","Number of Low(er)-Income Units Rehabilitated (Max 80%AMI)\n{Per Guidelines 101(s)}:","Is Deed Restriction Recorded?","Proof of accessibility modifications made attached? \n(scope of work, invoices, etc)","Project Status","If Completed, is Certificate of Completion Attached?","Date of Completion (if applicable)"]
[null,{"$f":"IF(B7=\"\",\"\",B7)","v":""},null,"Select One",null,null,null,null,"Select One","Select One","Select One","Select One"]
[null,{"$f":"IF(B8=\"\",\"\",B8)","v":""},null,"Select One",null,null,null,null,"Select One","Select One","Select One","Select One"]
[null,"",null,"Select One",null,null,null,null,"Select One","Select One","Select One","Select One"]
[null,"",null,"Select One",null,null,null,null,"Select One","Select One","Select One","Select One"]
[null,"",null,"Select One",null,null,null,null,"Select One","Select One","Select One","Select One"]
[null,"",null,"Select One",null,null,null,null,"Select One","Select One","Select One","Select One"]
[null,"",null,"Select One",null,null,null,null,"Select One","Select One","Select One","Select One"]
[null,"Total:",{"$f":"SUM(C17:C23)","v":0},null,{"$f":"SUM(E17:E23)","v":0},0,0,0]
[null,"Outcomes, Activity Expenditures (including description of accessibility modifications made), and Additional Comments\nPlease note, if you have not requested PLHA funds for this activity, describe the anticipated timeframe in which you will request and expend funds. If you have received PLHA funds but have not yet expended the funds, provide an explanation of when you plan to expend funds. Please be specific."]
[]
[null,"CUMULATIVE DATA:\nReport on totals as previously reported and totals from this reporting period. These two categories combined should represent the overall totals since the execution of your contract.\nThe information you provide should be based on PLHA funded units and individuals served by PLHA funds for this activity."]
[null,"UNITS",null,null,"Total prior to this reporting period","Total for this reporting period",null,null,"PEOPLE SERVED",null,null,"Total prior to this reporting period","Total for this reporting period"]
[null,"Number of Units Rehabilitated by PLHA funds",null,null,null,null,null,null,"Number of Individuals Served"]
[null,"Number of Extremely Low- Income Units Rehabilitated\n(Max 30% AMI)\n{Per Guidelines 101(n)}:",null,null,null,null,null,null," Number of Households assisted"]
[null,"Number of Very Low-Income Units Rehabilitated\n(Max 50% AMI)\n{Per Guidelines 101(cc)}:",null,null,null,null,null,null,"Number of Seniors Assisted (65 and older)"]
[null,"Total Number of Units at or below 60% AMI Rehabilitated",null,null,null,null,null,null,"Number of Veterans Assisted"]
[null,"Number of Low(er)-Income Units Rehabilitated (Max 80%AMI)\n{Per Guidelines 101(s)}:",null,null,null,null,null,null,"Number of Disabled Persons Assisted"]
[null,null,null,null,null,null,null,null,"Number of Families with Minor Children Assisted"]
[null,null,null,null,null,null,null,null,"Number of Transition-Aged Youth (18-24) Assisted"]
[]
[]
[]
[]
[]
[]
[]
[]
[]
[]
[]
[null,"Project","Total Spent","Project Status","Completion Date"]
[null,{"$f":"B7","v":0},{"$f":"C7","v":0},{"$f":"K17","v":"Select One"},{"$f":"M17","v":"00:00:00"}]
[null,{"$f":"B8","v":0},0,"Select One","00:00:00"]
[null,0,0,"Select One","00:00:00"]
[null,0,0,"Select One","00:00:00"]
[null,0,0,"Select One","00:00:00"]
[null,0,0,"Select One","00:00:00"]
[null,0,0,"Select One","00:00:00"]

{"sheet":"Activity 8","index":11,"n_rows":57,"n_cols":16,"rows_kept":57,"cut":false,"hidden":true,"merged":[[0,1,0,15],[1,1,1,15],[2,1,2,15],[4,1,4,7],[4,8,4,15],[14,12,14,15],[14,1,14,11],[25,1,25,15],[24,1,24,15],[3,7,3,8],[26,1,26,12],[27,1,27,3],[27,8,27,10],[28,1,28,3],[28,8,28,10],[29,1,29,3],[29,8,29,10],[30,1,30,3],[30,8,30,10],[31,1,31,3],[31,8,31,10],[32,1,32,3],[32,8,32,10],[33,8,33,10],[34,8,34,10],[35,8,35,10],[35,1,35,3],[34,1,34,3],[33,1,33,3]]}
[null,"PERMANENT LOCAL HOUSING ALLOCATION (PLHA) FUND"]
[null,"Activity 8 Outcomes"]
[null,"§301(a)(8) Efforts to acquire and rehabilitate foreclosed or vacant homes and apartments."]
[null,"Contract Number:",{"$f":"'1-Cover Sheet'!C8","v":0},"Total Award for Activity: ",{"$f":"(SUM('1-Cover Sheet'!C29:G29))","v":0},"% of Total PLHA Award:",{"$f":"(SUM('1-Cover Sheet'!C29:G29))/(SUM('1-Cover Sheet'!C37:G37))","v":{"$error":"#DIV/0!"}},"Amount of PLHA Funds Expended on Activity:",null,{"$f":"SUM(F14:G14)","v":0},"% of Activity Award Expended:",{"$f":"IFERROR(J4/E4,0)","v":0},"Remaining Balance for Activity:",{"$f":"E4-F14-G14","v":0},"% of Activity Funds Remaining:",{"$f":"IFERROR(N4/E4,0)","v":0}]
[null,"General Project Information and Expenditure Breakdown",null,null,null,null,null,null,"Households Served"]
[null,"Project:\n(Select from Drop-Down)","Developer Name","Original Status of Property","Year Original Structure was built","Amount of PLHA Funds Expended on Acquisition","Amount of PLHA Funds Expended on Rehabilitation","Was Prevailing Wage Paid? ","Total Number of Individuals to occupy project","Total Number of Households to occupy the project","Seniors (65 and older) to occupy project","Veterans to occupy project","Disabled Persons to occupy project","Families with Minor Children to occupy project","Transition-Aged Youth (ages 18-24) to occupy project","Farmworkers to occupy project"]
["Yes",null,null,"Select One"]
["Yes",null,null,"Select One"]
["Yes",null,null,"Select One"]
["Yes",null,null,"Select One"]
["Yes",null,null,"Select One"]
["Yes",null,null,"Select One"]
["Yes",null,null,"Select One"]
[null,"Total",{"$f":"SUM(F14:G14)","v":0},null,null,{"$f":"SUM(F7:F13)","v":0},{"$f":"SUM(G7:G13)","v":0},null,{"$f":"SUM(I7:I13)","v":0},{"$f":"SUM(J7:J13)","v":0},{"$f":"SUM(K7:K13)","v":0},0,0,0,0,{"$f":"SUM(P7:P13)","v":0}]
[null,"Unit Details",null,null,null,null,null,null,null,null,null,null,"Project Status and Evidence of Compliance"]
[null,"Project","Number of Housing Units Acquired and Rehabilitated","Type of Housing","Number of ADA-Accessible Units Acquired and Rehabilitated","Number of Units Acquired and Rehabilitated for Formerly Homeless Individuals","Number of Extremely Low- Income Units Acquired and Rehabilitated\n(Max 30% AMI)\n{Per Guidelines 101(n)}:","Number of Low-Income Units Acquired and Rehabilitated\n(Max 50% AMI)\n{Per Guidelines 101(cc)}:","Total Number of Units at or below 60% AMI Acquired and Rehabilitated","Number of Low(er)-Income Units Acquired and Rehabilitated (Max 80%AMI)\n{Per Guidelines 101(s)}:","Number of Moderate-Income Units Acquired and Rehabilitated\n(Max 120% AMI, or if in High Cost Area 150%)\n{Per Guidelines 101(t)}:","Tax Credit Project","Is Deed Restriction Recorded?","Project Status","Date of Completion (if applicable)","If Completed, is Certificate of Completion attached?"]
[null,{"$f":"IF(B7=\"\",\"\",B7)","v":""},null,"Select One",null,null,null,null,null,null,null,"Select One","Select One","Select One",null,"Select One"]
[null,{"$f":"IF(B8=\"\",\"\",B8)","v":""},null,"Select One",null,null,null,null,null,null,null,"Select One","Select One","Select One",null,"Select One"]
[null,"",null,"Select One",null,null,null,null,null,null,null,"Select One","Select One","Select One",null,"Select One"]
[null,"",null,"Select One",null,null,null,null,null,null,null,"Select One","Select One","Select One",null,"Select One"]
[null,"",null,"Select One",null,null,null,null,null,null,null,"Select One","Select One","Select One",null,"Select One"]
[null,"",null,"Select One",null,null,null,null,null,null,null,"Select One","Select One","Select One",null,"Select One"]
[null,"",null,"Select One",null,null,null,null,null,null,null,"Select One","Select One","Select One",null,"Select One"]
[null,"Total",{"$f":"SUM(C17:C23)","v":0},null,{"$f":"SUM(E17:E23)","v":0},0,{"$f":"SUM(G17:G23)","v":0},{"$f":"SUM(H17:H23)","v":0},{"$f":"SUM(I17:I23)","v":0},{"$f":"SUM(J17:J23)","v":0},{"$f":"SUM(K17:K23)","v":0}]
[null,"Outcomes, Activity Expenditures, and Additional Comments\nPlease note, if you have not requested PLHA funds for this activity, describe the anticipated timeframe in which you will request and expend funds. If you have received PLHA funds but have not yet expended the funds, provide an explanation of when you plan to expend funds. Please be specific."]
[]
[null,"CUMULATIVE DATA:\nReport on totals as previously reported and totals from this reporting period. These two categories combined should represent the overall totals since the execution of your contract.\nThe information you provide should be based on PLHA funded units and individuals served by PLHA funds for this activity."]
[null,"UNITS",null,null,"Total prior to this reporting period","Total for this reporting period",null,null,"PEOPLE SERVED",null,null,"Total prior to this reporting period","Total for this reporting period"]
[null,"Number of Units Acquired and Rehabilitated by PLHA funds",null,null,null,null,null,null,"Number of Individuals Occuping Projects"]
[null,"Number of ADA-Accessible Units Acquired and Rehabilitated",null,null,null,null,null,null,"Number of Households occupying the projects"]
[null,"Number of Units Acquired and Rehabilitated for Formerly Homeless Individuals",null,null,null,null,null,null,"Seniors (65 and older) occupying the projects"]
[null,"Number of Extremely Low- Income Units Acquired and Rehabilitated\n(Max 30% AMI)\n{Per Guidelines 101(n)}:",null,null,null,null,null,null,"Veterans occupying the projects"]
[null,"Number of Low-Income Units Acquired and Rehabilitated\n(Max 50% AMI)\n{Per Guidelines 101(cc)}:",null,null,null,null,null,null,"Disabled Persons occuping the projects"]
[null,"Total Number of Units at or below 60% AMI Acquired and Rehabilitated",null,null,null,null,null,null,"Families with Minor Children occupying the projects"]
[null,"Number of Low(er)-Income Units Acquired and Rehabilitated (Max 80%AMI)\n{Per Guidelines 101(s)}:",null,null,null,null,null,null,"Transition-Aged Youth (ages 18-24) occupying the projects"]
[null,"Number of Moderate-Income Units Acquired and Rehabilitated\n(Max 120% AMI, or if in High Cost Area 150%)\n{Per Guidelines 101(t)}:",null,null,null,null,null,null,"Farmworkers occupying the projects"]
[]
[]
[]
[]
[]
[]
[]
[]
[]
[]
[]
[]
[]
[null,"Project","Total Spent","Project Status","Completion Date"]
[null,{"$f":"B7","v":0},{"$f":"F7+G7","v":0},{"$f":"N17","v":"Select One"},"00:00:00"]
[null,{"$f":"B8","v":0},0,"Select One","00:00:00"]
[null,0,0,"Select One","00:00:00"]
[null,0,0,"Select One","00:00:00"]
[null,0,0,"Select One","00:00:00"]
[null,0,0,"Select One","00:00:00"]
[null,0,0,"Select One","00:00:00"]

{"sheet":"Activity 9","index":12,"n_rows":55,"n_cols":15,"rows_kept":55,"cut":false,"hidden":true,"merged":[[4,1,4,6],[4,7,4,14],[0,1,0,14],[1,1,1,14],[2,1,2,14],[10,4,10,6],[11,4,11,6],[12,4,12,6],[24,1,24,14],[25,1,25,14],[14,1,14,8],[14,9,14,14],[5,4,5,6],[6,4,6,6],[7,4,7,6],[8,4,8,6],[9,4,9,6],[26,1,26,12],[27,1,27,3],[27,8,27,10],[28,1,28,3],[28,8,28,10],[32,1,32,3],[33,1,33,3],[29,1,29,3],[30,1,30,3],[31,1,31,3],[31,8,31,10],[30,8,30,10],[29,8,29,10],[34,8,34,10],[33,8,33,10],[32,8,32,10]]}
[null,"PERMANENT LOCAL HOUSING ALLOCATION (PLHA) FUND"]
[null,"Activity 9 Outcomes"]
[null,"§301(a)(9) Homeownership opportunities, including, but not limited to, down payment assistance"]
[null,"Contract Number:",{"$f":"'1-Cover Sheet'!C8","v":0},"Total Award for Activity:",{"$f":"(SUM('1-Cover Sheet'!C31:G31))","v":0},"% of Total PLHA Award:",{"$f":"(SUM('1-Cover Sheet'!C31:G31))/(SUM('1-Cover Sheet'!C37:G37))","v":{"$error":"#DIV/0!"}},"Amount of PLHA Funds Expended on Activity:",{"$f":"SUM(C14:D14)","v":0},"% of Activity Award Expended:",{"$f":"IFERROR(I4/E4,0)","v":0},"Remaining Balance for Activity:",{"$f":"E4-I4","v":0},"% of Activity Funds Remaining:",{"$f":"IFERROR(M4/E4,0)","v":0}]
[null,"Expenditure Breakdown",null,null,null,null,null,"Households Served"]
[null,"Project:\n(Select from Drop-Down)","Amount of PLHA Funds Expended on Down Payment Assistance","Amount of PLHA Funds Expended on Other Homeownership Opportunities","Description of Other Homeownership Opportunity Activities",null,null,"Total Number of Households Assisted","Total Number of Individuals Assisted","Total Number of Seniors (65 and older) Assisted","Total Number of Veterans Assisted","Total Number of Disabled Persons Assisted","Total Number of Families with Minor Children Assisted","Total Number of Transition-Aged Youth (ages 18-24) Assisted","Total Number of Farmworkers Assisted"]
["Yes"]
["Yes"]
["Yes"]
["Yes"]
["Yes"]
["Yes"]
["Yes"]
[null,"Total:",{"$f":"SUM(C7:C13)","v":0},{"$f":"SUM(D7:D13)","v":0},null,null,null,{"$f":"SUM(H7:H13)","v":0},{"$f":"SUM(I7:I13)","v":0},{"$f":"SUM(J7:J13)","v":0},0,0,0,0,0]
[null,"Unit Details",null,null,null,null,null,null,null,"Project Status and Evidence of Compliance"]
[null,"Project","Total Homeownership Units Assisted","Type of Housing","Number of Extremely Low- Income Households Assisted\n(Max 30% AMI)\n{Per Guidelines 101(n)}:","Number of Very Low-Income Households Assisted\n(Max 50% AMI)\n{Per Guidelines 101(cc)}:","Total Number of Households at or below 60% AMI Assisted\n","Number of Low(er)-Income Households Assisted (Max 80%AMI)\n{Per Guidelines 101(s)}:","Number of Moderate-Income Households Assisted\n(Max 120% AMI, or if in High Cost Area 150%)\n{Per Guidelines 101(t)}:","Is Deed Restriction Recorded?","Project Status","Are homeownership program policies attached? ","Are proof of awards to homeowners attached? ","Date of Project Completion \n(if applicable)","If Completed, is Certificate of Completion or Occupancy attached?"]
[null,{"$f":"IF(B7=\"\",\"\",B7)","v":""},null,"Select One",null,null,null,null,null,"Select One","Select One","Select One","Select One",null,"Select One"]
[null,{"$f":"IF(B8=\"\",\"\",B8)","v":""},null,"Select One",null,null,null,null,null,"Select One","Select One","Select One","Select One",null,"Select One"]
[null,"",null,"Select One",null,null,null,null,null,"Select One","Select One","Select One","Select One",null,"Select One"]
[null,"",null,"Select One",null,null,null,null,null,"Select One","Select One","Select One","Select One",null,"Select One"]
[null,"",null,"Select One",null,null,null,null,null,"Select One","Select One","Select One","Select One",null,"Select One"]
[null,"",null,"Select One",null,null,null,null,null,"Select One","Select One","Select One","Select One",null,"Select One"]
[null,"",null,"Select One",null,null,null,null,null,"Select One","Select One","Select One","Select One",null,"Select One"]
[null,"Total:",{"$f":"SUM(C17:C23)","v":0},null,{"$f":"SUM(E17:E23)","v":0},0,0,0,0]
[null,"Outcomes, Activity Expenditures, and Additional Comments\nPlease note, if you have not requested PLHA funds for this activity, describe the anticipated timeframe in which you will request and expend funds. If you have received PLHA funds but have not yet expended the funds, provide an explanation of when you plan to expend funds. Please be specific."]
[]
[null,"CUMULATIVE DATA:\nReport on totals as previously reported and totals from this reporting period. These two categories combined should represent the overall totals since the execution of your contract.\nThe information you provide should be based on PLHA funded units and individuals served by PLHA funds for this activity."]
[null,"UNITS",null,null,"Total prior to this reporting period","Total for this reporting period",null,null,"PEOPLE SERVED",null,null,"Total prior to this reporting period","Total for this reporting period"]
[null,"Number of Units Assisted",null,null,null,null,null,null,"Number of Individuals Assisted"]
[null,"Number of Extremely Low- Income Households Assisted\n(Max 30% AMI)\n{Per Guidelines 101(n)}:",null,null,null,null,null,null,"Number of Seniors (65 and older) Assisted"]
[null,"Number of Very Low-Income Households Assisted\n(Max 50% AMI)\n{Per Guidelines 101(cc)}:",null,null,null,null,null,null,"  Number of Veterans Assisted"]
[null,"Number of Households at or below 60% AMI Assisted\n",null,null,null,null,null,null,"  Number of Disabled Persons Assisted"]
[null,"Number of Low(er)-Income Households Assisted (Max 80%AMI)\n{Per Guidelines 101(s)}:",null,null,null,null,null,null,"Number of Families with Minor Children Assisted"]
[null,"Number of Moderate-Income Households Assisted\n(Max 120% AMI, or if in High Cost Area 150%)\n{Per Guidelines 101(t)}:",null,null,null,null,null,null,"Number of Transition-Aged Youth (ages 18-24) Assisted"]
[null,null,null,null,null,null,null,null,"Number of Farmworkers Assisted"]
[]
[]
[]
[]
[]
[]
[]
[]
[]
[]
[]
[]
[null,"Project","Total Spent","Project Status","Completion Date"]
[null,{"$f":"B7","v":0},{"$f":"C7+D7","v":0},{"$f":"K17","v":"Select One"},{"$f":"N17","v":0}]
[null,{"$f":"B8","v":0},{"$f":"C8+D8","v":0},{"$f":"K18","v":"Select One"},{"$f":"N18","v":0}]
[null,0,0,"Select One",0]
[null,0,0,"Select One",0]
[null,0,0,"Select One",0]
[null,0,0,"Select One",0]
[null,0,0,"Select One",0]

{"sheet":"Activity 10","index":13,"n_rows":57,"n_cols":15,"rows_kept":57,"cut":false,"hidden":true,"merged":[[24,1,24,14],[25,1,25,14],[0,1,0,14],[1,1,1,14],[2,1,2,14],[4,1,4,6],[4,7,4,14],[14,1,14,11],[14,12,14,14],[26,1,26,12],[27,1,27,3],[27,8,27,10],[28,1,28,3],[28,8,28,10],[29,1,29,3],[29,8,29,10],[30,1,30,3],[30,8,30,10],[31,1,31,3],[31,8,31,10],[35,8,35,10],[35,1,35,3],[34,1,34,3],[32,1,32,3],[32,8,32,10],[33,1,33,3],[33,8,33,10],[34,8,34,10]]}
[null,"PERMANENT LOCAL HOUSING ALLOCATION (PLHA) FUND"]
[null,"Activity 10 Outcomes"]
[null,"§301(a)(10) Fiscal incentives made by a county to a city within the county to incentivize approval of one or more Affordable housing Projects, or matching funds invested by a county in an Affordable housing development Project in a city within the county, provided that the city has made an equal or greater investment in the Project. The county fiscal incentives shall be in the form of a grant or low-interest loan to an affordable housing Project. Matching funds investments by both the county and the city also shall be a grant or low-interest deferred loan to the Affordable housing project."]
[null,"Contract Number:",{"$f":"'1-Cover Sheet'!C8","v":0},"Total Award for Activity: ",{"$f":"(SUM('1-Cover Sheet'!C33:G33))","v":0},"% of Total PLHA Award:",{"$f":"(SUM('1-Cover Sheet'!C33:G33))/(SUM('1-Cover Sheet'!C37:G37))","v":{"$error":"#DIV/0!"}},"Amount of PLHA Funds Expended on Activity:",{"$f":"SUM(E14)","v":0},"% of Activity Award Expended:",{"$f":"IFERROR(I4/E4,0)","v":0},"Remaining Balance for Activity:",{"$f":"E4-E14","v":0},"% of Activity Funds Remaining:",{"$f":"IFERROR(M4/E4,0)","v":0}]
[null,"Incentive and Match Details",null,null,null,null,null,"Households Served by Project"]
[null,"Project:\n(Select from Drop-Down)","Name of City Receiving PLHA Funds","Is City within the County Offering Assistance","Amount of PLHA Funds Provided","How were PLHA Funds Provided?\n{Per Guidelines 301(a)(10)}","Amount of Matching Funds Provided \n(if applicable)","Total Number of Individuals to occupy project","Total Number of Households to occupy the project","Seniors (65 and older) to occupy project","Veterans to occupy project","Disabled Persons to occupy project","Families with Minor Children to occupy project","Transition-Aged Youth (ages 18-24) to occupy project","Farmworkers to occupy project"]
["Yes",null,null,"Select One",null,"Select One"]
["Yes",null,null,"Select One",null,"Select One"]
["Yes",null,null,"Select One",null,"Select One"]
["Yes",null,null,"Select One",null,"Select One"]
["Yes",null,null,"Select One",null,"Select One"]
["Yes",null,null,"Select One",null,"Select One"]
["Yes",null,null,"Select One",null,"Select One"]
[null,"Total",null,null,{"$f":"SUM(E7:E13)","v":0},null,{"$f":"SUM(G7:G13)","v":0},{"$f":"SUM(H7:H13)","v":0},{"$f":"SUM(I7:I13)","v":0},{"$f":"SUM(J7:J13)","v":0},0,0,0,0,0]
[null,"Unit Details",null,null,null,null,null,null,null,null,null,null,"Project Status and Evidence of Compliance"]
[null,"Project","Total Number of Units in Project","Total Number of Restricted Units in Project","Type of Housing","Number of ADA Accessible Units Developed, Rehabilitated or Preserved","Number of Units Developed, Rehabilitated or Preserved for Formerly Homeless Individuals ","Number of Extremely Low- Income Units Developed, Rehabilitated or Preserved\n(Max 30% AMI)\n{Per Guidelines 101(n)}:","Number of Very Low-Income Units Developed, Rehabilitated or Preserved\n(Max 50% AMI)\n{Per Guidelines 101(cc)}:","Total Number of Units at or below 60% AMI Developed, Rehabilitated or Preserved","Number of Low(er)-Income Units Developed, Rehabilitated or Preserved (Max 80% AMI)\n{Per Guidelines 101(s)}:","Number of Moderate-Income Units Developed, Rehabilitated or Preserved\n(Max 120% AMI, or if in High Cost Area 150%)\n{Per Guidelines 101(t)}:","Project Status","Proof of incentive paid attached to report","Date of Completion (if applicable)"]
[null,{"$f":"IF(B7=\"\",\"\",B7)","v":""},null,null,"Select One",null,null,null,null,null,null,null,"Select One","Select One"]
[null,{"$f":"IF(B8=\"\",\"\",B8)","v":""},null,null,"Select One",null,null,null,null,null,null,null,"Select One","Select One"]
[null,"",null,null,"Select One",null,null,null,null,null,null,null,"Select One","Select One"]
[null,"",null,null,"Select One",null,null,null,null,null,null,null,"Select One","Select One"]
[null,"",null,null,"Select One",null,null,null,null,null,null,null,"Select One","Select One"]
[null,"",null,null,"Select One",null,null,null,null,null,null,null,"Select One","Select One"]
[null,"",null,null,"Select One",null,null,null,null,null,null,null,"Select One","Select One"]
[null,"Total",{"$f":"SUM(C17:C23)","v":0},{"$f":"SUM(D17:D23)","v":0},null,{"$f":"SUM(F17:F23)","v":0},0,0,0,0,0,0]
[null,"Outcomes, Activity Expenditures, and Additional Comments\nPlease note, if you have not requested PLHA funds for this activity, describe the anticipated timeframe in which you will request and expend funds. If you have received PLHA funds but have not yet expended the funds, provide an explanation of when you plan to expend funds. Please be specific."]
[]
[null,"CUMULATIVE DATA:\nReport on totals as previously reported and totals from this reporting period. These two categories combined should represent the overall totals since the execution of your contract.\nThe information you provide should be based on PLHA funded units and individuals served by PLHA funds for this activity."]
[null,"UNITS",null,null,"Total prior to this reporting period","Total for this reporting period",null,null,"PEOPLE SERVED",null,null,"Total prior to this reporting period","Total for this reporting period"]
[null,"Number of Units Developed, Rehabilitated, or Preserved",null,null,null,null,null,null,"Number of Individuals Occuping Projects"]
[null,"Number of ADA Accessible Units Developed, Rehabilitated or Preserved",null,null,null,null,null,null,"Number of Households occupying the projects"]
[null,"Number of Units Developed, Rehabilitated or Preserved for Formerly Homeless Individuals ",null,null,null,null,null,null,"Seniors (65 and older) occupying the projects"]
[null,"Number of Extremely Low- Income Units Developed, Rehabilitated or Preserved\n(Max 30% AMI)\n{Per Guidelines 101(n)}:",null,null,null,null,null,null,"Veterans occupying the projects"]
[null,"Number of Very Low-Income Units Developed, Rehabilitated or Preserved\n(Max 50% AMI)\n{Per Guidelines 101(cc)}:",null,null,null,null,null,null,"Disabled Persons occuping the projects"]
[null,"Total Number of Units at or below 60% AMI Developed, Rehabilitated or Preserved",null,null,null,null,null,null,"Families with Minor Children occupying the projects"]
[null,"Number of Low(er)-Income Units Developed, Rehabilitated or Preserved (Max 80% AMI)\n{Per Guidelines 101(s)}:",null,null,null,null,null,null,"Transition-Aged Youth (ages 18-24) occupying the projects"]
[null,"Number of Moderate-Income Units Developed, Rehabilitated or Preserved\n(Max 120% AMI, or if in High Cost Area 150%)\n{Per Guidelines 101(t)}:",null,null,null,null,null,null,"Farmworkers occupying the projects"]
[]
[]
[]
[]
[]
[]
[]
[]
[]
[]
[]
[]
[]
[null,"Project","Total Spent","Project Status","Completion Date"]
[null,{"$f":"B7","v":0},{"$f":"E7","v":0},{"$f":"M17","v":"Select One"},{"$f":"O17","v":"00:00:00"}]
[null,{"$f":"B8","v":0},{"$f":"E8","v":0},"Select One",{"$f":"O18","v":"00:00:00"}]
[null,0,0,"Select One","00:00:00"]
[null,0,0,"Select One","00:00:00"]
[null,0,0,"Select One","00:00:00"]
[null,0,0,"Select One","00:00:00"]
[null,0,0,"Select One","00:00:00"]

{"sheet":"Competitive Activity 1","index":14,"n_rows":54,"n_cols":16,"rows_kept":54,"cut":false,"hidden":true,"merged":[[25,1,25,15],[4,1,4,7],[4,8,4,15],[14,1,14,10],[14,11,14,15],[1,1,1,15],[0,1,0,15],[2,1,2,15],[3,13,3,14],[24,1,24,15],[26,1,26,12],[27,1,27,3],[27,8,27,10],[28,1,28,3],[28,8,28,10],[29,1,29,3],[29,8,29,10],[30,1,30,3],[30,8,30,10],[31,1,31,3],[31,8,31,10],[35,8,35,10],[32,1,32,3],[32,8,32,10],[33,8,33,10],[34,8,34,10]]}
[null,"PERMANENT LOCAL HOUSING ALLOCATION (PLHA) FUND"]
[null,"Competitive Allocation Activity 1 Outcomes"]
[null,"§401(a)(1) Development of new multifamily rental housing that is Affordable to households at or below 60% of AMI or substantial rehabilitation of multifamily rental housing that will be Affordable to households at or below 60% of AMI, but which is not currently restricted as Affordable housing."]
[null,"Contract Number:",{"$f":"'1-Cover Sheet'!C8","v":0},"Total Award for Activity: ",{"$f":"'1-Cover Sheet'!C42","v":0},"% of Total PLHA Award",{"$f":"E4/'1-Cover Sheet'!C42","v":{"$error":"#DIV/0!"}},"Amount of PLHA Funds Expended on Activity:",{"$f":"SUM(E14:H14)","v":0},"% of Activity Award Expended:",{"$f":"I4/E4","v":{"$error":"#DIV/0!"}},"Remaining Balance for Activity:",{"$f":"E4-I4","v":0},"% of Activity Funds Remaining:",null,{"$f":"M4/E4","v":{"$error":"#DIV/0!"}}]
[null,"General Project Information and Expenditure Breakdown",null,null,null,null,null,null,"Households Served"]
[null,"Project:\n(Select from Drop-Down)","Developer Name","Is assistance offered as a Low Interest Deferred Loan? ","Amount of PLHA Funds Expended on Predevelopment","Amount of PLHA Funds Expended on New Construction/Development","Amount of PLHA Funds Expended on Acquisition","Amount of PLHA Funds Expended on Rehabilitation/Preservation","Total Number of Individuals to occupy project","Total Number of Households to occupy the project","Number of Seniors (65 and older) to occupy project","Number of Veterans to occupy project","Number of Disabled Persons to occupy project","Number of Families with Minor Children to occupy project","Number of Transition-Aged Youth (ages 18-24) to occupy project","Number of Farmworkers to occupy project"]
["Yes",null,null,"Select One"]
["Yes",null,null,"Select One"]
["Yes",null,null,"Select One"]
["Yes",null,null,"Select One"]
["Yes",null,null,"Select One"]
["Yes",null,null,"Select One"]
["Yes",null,null,"Select One"]
[null,"Total:",null,null,{"$f":"SUM(E7:E13)","v":0},{"$f":"SUM(F7:F13)","v":0},0,0,{"$f":"SUM(I7:I13)","v":0},{"$f":"SUM(J7:J13)","v":0},{"$f":"SUM(K7:K13)","v":0},0,0,0,0,0]
[null,"Unit Details",null,null,null,null,null,null,null,null,null,"Project Status and Evidence of Compliance"]
[null,"Project","Total Number of Multifamily Rental Units in Project","Total Number of Units Restricted to at or below 60% AMI in Project","Project Type","Type of Housing","Number of ADA Accessible Units Developed or Rehabilitated","Number of Units Developed or Rehabilitated for Formerly Homeless Individuals ","Number of Extremely Low- Income Units Developed or Rehabilitated\n(Max 30% AMI)\n{Per Guidelines 101(n)}:","Number of Very Low-Income Units Developed or Rehabilitated\n(Max 50% AMI)\n{Per Guidelines 101(cc)}:","Tax Credit Project","Project Status","Is Award Letter to Affordable Housing Project Attached?","Is Evidence that Rehabilitated Units were not restricted prior to rehabilitation attached?","Date of Project Completion \n(if applicable)","If Completed, is Certificate of Occupancy Attached?"]
[null,{"$f":"IF(B7=\"\",\"\",B7)","v":""},null,null,"Select One","Select One",null,null,null,null,"Select One","Select One","Select One","Select One",null,"Select One"]
[null,{"$f":"IF(B8=\"\",\"\",B8)","v":""},null,null,"Select One","Select One",null,null,null,null,"Select One","Select One","Select One","Select One",null,"Select One"]
[null,"",null,null,"Select One","Select One",null,null,null,null,"Select One","Select One","Select One","Select One",null,"Select One"]
[null,"",null,null,"Select One","Select One",null,null,null,null,"Select One","Select One","Select One","Select One",null,"Select One"]
[null,"",null,null,"Select One","Select One",null,null,null,null,"Select One","Select One","Select One","Select One",null,"Select One"]
[null,"",null,null,"Select One","Select One",null,null,null,null,"Select One","Select One","Select One","Select One",null,"Select One"]
[null,"",null,null,"Select One","Select One",null,null,null,null,"Select One","Select One","Select One","Select One",null,"Select One"]
[null,"Total:",{"$f":"SUM(C17:C23)","v":0},{"$f":"SUM(D17:D23)","v":0},null,null,{"$f":"SUM(G17:G23)","v":0},0,0,0]
[null,"Outcomes, Activity Expenditures, and Additional Comments"]
[]
[null,"CUMULATIVE DATA:\nReport on totals as previously reported and totals from this reporting period. These two categories combined should represent the overall totals since the execution of your contract.\nThe information you provide should be based on PLHA funded units and individuals served by PLHA funds for this activity."]
[null,"UNITS",null,null,"Total prior to this reporting period","Total for this reporting period",null,null,"PEOPLE SERVED",null,null,"Total prior to this reporting period","Total for this reporting period"]
[null,"Number of Units Developed, Rehabilitated, or Preserved",null,null,null,null,null,null,"Number of Individuals Occuping Projects"]
[null,"Number of ADA Accessible Units Developed, Rehabilitated or Preserved",null,null,null,null,null,null,"Number of Households occupying the projects"]
[null,"Number of Units Developed, Rehabilitated or Preserved for Formerly Homeless Individuals ",null,null,null,null,null,null,"Seniors (65 and older) occupying the projects"]
[null,"Number of Extremely Low- Income Units Developed, Rehabilitated or Preserved\n(Max 30% AMI)\n{Per Guidelines 101(n)}:",null,null,null,null,null,null,"Veterans occupying the projects"]
[null,"Number of Very Low-Income Units Developed, Rehabilitated or Preserved\n(Max 50% AMI)\n{Per Guidelines 101(cc)}:",null,null,null,null,null,null,"Disabled Persons occuping the projects"]
[null,null,null,null,null,null,null,null,"Families with Minor Children occupying the projects"]
[null,null,null,null,null,null,null,null,"Transition-Aged Youth (ages 18-24) occupying the projects"]
[null,null,null,null,null,null,null,null,"Farmworkers occupying the projects"]
[]
[]
[]
[]
[]
[]
[]
[]
[]
[]
[null,"Project","Total Spent","Project Status","Completion Date"]
[null,{"$f":"B7","v":0},{"$f":"SUM(E7:H7)","v":0},{"$f":"L17","v":"Select One"},{"$f":"O17","v":"00:00:00"}]
[null,{"$f":"B8","v":0},{"$f":"SUM(E8:H8)","v":0},{"$f":"L18","v":"Select One"},{"$f":"O18","v":"00:00:00"}]
[null,0,0,"Select One","00:00:00"]
[null,0,0,"Select One","00:00:00"]
[null,0,0,"Select One","00:00:00"]
[null,0,0,"Select One","00:00:00"]
[null,0,0,"Select One","00:00:00"]

{"sheet":"Competitive Activity 2","index":15,"n_rows":60,"n_cols":13,"rows_kept":60,"cut":false,"hidden":true,"merged":[[37,1,37,12],[34,1,34,12],[35,1,35,12],[36,1,36,12],[4,1,4,12],[2,1,2,12],[1,1,1,12],[0,1,0,12],[24,10,24,12],[24,1,24,9],[14,1,14,12],[5,11,5,12],[6,11,6,12],[7,11,7,12],[13,11,13,12],[8,11,8,12],[9,11,9,12],[10,11,10,12],[11,11,11,12],[12,11,12,12],[38,1,38,12],[39,1,39,3],[39,8,39,10],[41,1,41,3],[40,8,40,10],[40,1,40,3],[42,1,42,3],[41,8,41,10],[43,1,43,3],[42,8,42,10],[44,1,44,3],[43,8,43,10],[45,1,45,3],[44,8,44,10],[45,8,45,10],[46,8,46,10],[47,8,47,10],[51,8,51,10],[50,8,50,10],[49,8,49,10],[48,8,48,10],[46,1,46,3]]}
[null,"PERMANENT LOCAL HOUSING ALLOCATION (PLHA) FUND"]
[null,"Competitive Allocation Activity 2 Outcomes"]
[null,"§401(a)(2) Assisting persons who are experiencing or At risk of homelessness, including, but not limited to, through rapid rehousing, or rental assistance, supportive services and case management services that allow people to obtain and retain housing, operating and capital costs for navigation centers, or new construction, rehabilitation, or preservation of permanent or transitional rental housing."]
[null,"Contract Number:",{"$f":"'1-Cover Sheet'!C8","v":0},"Total Award for Activity: ",{"$f":"'1-Cover Sheet'!C42","v":0},"% of Total PLHA Award:",{"$f":"E4/'1-Cover Sheet'!C42","v":{"$error":"#DIV/0!"}},"Amount of PLHA Funds Expended on Activity:",{"$f":"L14","v":0},"% of Activity Award Expended:",{"$f":"IFERROR(I4/E4,0)","v":0},"Remaining Balance for Activity:",{"$f":"E4-M14","v":0}]
[null,"Expenditure Breakdown"]
[null,"Project:\n(Select from Drop-Down)","Amount of PLHA Funds Expended on Rapid Re-Housing","Amount of PLHA Funds Expended on Rental Assistance","Amount of PLHA Funds Expended On Supportive/Case Management","Amount of PLHA Funds Expended on Operating and Capital Costs for Navigation Centers","Amount of PLHA Funds Expended on New Construction of Permanent Housing","Amount of PLHA Funds Expended on New Construction of Transitional Housing","Amount of PLHA Funds Expended on Rehabilitation and/or Preservation of Permanent Housing","Amount of PLHA Funds Expended on Rehabilitation and/or Preservation of Transitional Housing","Amount of PLHA Funds Expended on Other eligible activities\n(please describe in additional comments)","Total Amount of PLHA Funds Expended"]
["Yes",null,null,null,null,null,null,null,null,null,null,{"$f":"SUM(A7:K7)","v":0}]
["Yes",null,null,null,null,null,null,null,null,null,null,{"$f":"SUM(A8:K8)","v":0}]
["Yes",null,null,null,null,null,null,null,null,null,null,0]
["Yes",null,null,null,null,null,null,null,null,null,null,0]
["Yes",null,null,null,null,null,null,null,null,null,null,0]
["Yes",null,null,null,null,null,null,null,null,null,null,0]
["Yes",null,null,null,null,null,null,null,null,null,null,0]
[null,"Total",{"$f":"SUM(C7:C13)","v":0},{"$f":"SUM(D7:D13)","v":0},0,0,0,0,{"$f":"SUM(I7:I13)","v":0},{"$f":"SUM(J7:J13)","v":0},{"$f":"SUM(K7:K13)","v":0},{"$f":"SUM(L7:L13)","v":0}]
[null,"Households Served"]
[null,"Project","Number of Persons assisted by Rapid Rehousing","Number of Persons assisted by Rental Assistance","Number of Persons assisted by Supportive/Case Management","Total Unduplicated persons assisted by project","Number of Individuals to Occupy Newly Constructed or Rehabilitated Transitional Housing","Number of Individuals to Occupy Newly Constructed or Rehabilitated Permanent Housing","Number of Seniors Assisted (65 and older)","Number of Veterans Assisted","Number of Disabled Persons Assisted","Number of Families with Minor Children Assisted","Number of Transition-Aged Youth (18-24) Assisted"]
[null,{"$f":"IF(B7=\"\",\"\",B7)","v":""}]
[null,""]
[null,""]
[null,""]
[null,""]
[null,""]
[null,""]
[null,"Total:",{"$f":"SUM(C17:C23)","v":0},0,0,0,0,0,0,0,0,0,0]
[null,"Unit Breakdown",null,null,null,null,null,null,null,null,"Project Status and Evidence of Compliance"]
[null,"Project","Number of Housing Units Receiving Rapid-Rehousing Assistance","Number of Housing Units Receiving Rental Assistance","Number of Housing Units Receiving Supportive/Case Management Services","Number of Units Receiving Operating or Capital subsidy ","Number of Transitional Units Developed, Rehabilitated or Preserved","Number of Permanent Units Developed, Rehabilitated or Preserved","Total number of unduplicated Units Developed, Rehabilitated or Preserved","Type of Housing Developed, Rehabilitated, or Preserved","Project Status","If Completed, is Certificate of Occupancy Attached?","Completion Date (if applicable) "]
[null,{"$f":"IF(B17=\"\",\"\",B17)","v":""},null,null,null,null,null,null,null,"Select One","Select One","Select One"]
[null,"",null,null,null,null,null,null,null,"Select One","Select One","Select One"]
[null,"",null,null,null,null,null,null,null,"Select One","Select One","Select One"]
[null,"",null,null,null,null,null,null,null,"Select One","Select One","Select One"]
[null,"",null,null,null,null,null,null,null,"Select One","Select One","Select One"]
[null,"",null,null,null,null,null,null,null,"Select One","Select One","Select One"]
[null,"",null,null,null,null,null,null,null,"Select One","Select One","Select One"]
[null,"Total:",{"$f":"SUM(C27:C33)","v":0},{"$f":"SUM(D27:D33)","v":0},0,0,0,0,0]
[null,"Explain how you are providing services consistent with the Housing First Practices per 25 CCR, Sec. 8409, Subdivision (b)(1)-(6) and in compliance with WIC, Sec. 8255(b)(8)"]
[]
[null,"Outcomes, Activity Expenditures (including expenditures on assistance or services not listed), and Additional Comments"]
[]
[null,"CUMULATIVE DATA:\nReport on totals as previously reported and totals from this reporting period. These two categories combined should represent the overall totals since the execution of your contract.\nThe information you provide should be based on PLHA funded units and individuals served by PLHA funds for this activity."]
[null,"UNITS",null,null,"Total prior to this reporting period","Total for this reporting period",null,null,"PEOPLE SERVED",null,null,"Total prior to this reporting period","Total for this reporting period"]
[null,"Number of Housing Units Assisted",null,null,null,null,null,null,"Number of Persons Assisted"]
[null,"Number of Housing Units Receiving Rapid-Rehousing Assistance",null,null,null,null,null,null,"Number of Persons assisted by Rapid Rehousing"]
[null,"Number of Housing Units Receiving Rental Assistance",null,null,null,null,null,null,"Number of Persons assisted by Rental Assistance"]
[null,"Number of Housing Units Receiving Supportive/Case Management Services",null,null,null,null,null,null,"Number of Persons assisted by Supportive/Case Management"]
[null,"Number of Units Receiving Operating or Capital subsidy ",null,null,null,null,null,null,"Total Unduplicated persons assisted by project"]
[null,"Number of Transitional Units Developed, Rehabilitated or Preserved",null,null,null,null,null,null,"Number of Individuals to Occupy Newly Constructed or Rehabilitated Transitional Housing"]
[null,"Number of Permanent Units Developed, Rehabilitated or Preserved",null,null,null,null,null,null,"Number of Individuals to Occupy Newly Constructed or Rehabilitated Permanent Housing"]
[null,null,null,null,null,null,null,null,"Number of Seniors Assisted (65 and older)"]
[null,null,null,null,null,null,null,null,"Number of Veterans Assisted"]
[null,null,null,null,null,null,null,null,"Number of Disabled Persons Assisted"]
[null,null,null,null,null,null,null,null,"Number of Families with Minor Children Assisted"]
[null,null,null,null,null,null,null,null,"Number of Transition-Aged Youth (18-24) Assisted"]
[null,null,null,null,"Completion Date"]
[null,"Project","Total Spent","Project Status",{"$f":"M27","v":"00:00:00"}]
[null,{"$f":"B7","v":0},{"$f":"M7","v":0},{"$f":"K27","v":"Select One"},"00:00:00"]
[null,0,0,"Select One","00:00:00"]
[null,0,0,"Select One","00:00:00"]
[null,0,0,"Select One","00:00:00"]
[null,0,0,"Select One","00:00:00"]
[null,0,0,"Select One"]

{"sheet":"Certification","index":16,"n_rows":13,"n_cols":7,"rows_kept":13,"cut":false,"hidden":false,"merged":[[6,4,6,7],[6,0,6,3],[4,0,4,1],[4,2,4,3],[5,0,5,3],[5,4,5,7],[0,2,0,4],[3,0,3,7],[0,6,0,7],[1,2,1,7],[2,0,2,7],[0,0,0,1],[1,0,1,1],[13,0,13,3],[12,4,12,7],[13,4,13,7],[7,4,7,7],[10,4,10,7],[11,4,11,7],[8,4,8,7],[9,2,9,3],[11,0,11,3],[8,0,8,3],[9,0,9,1],[12,0,12,3],[7,0,7,3],[10,0,10,3]]}
["Grantee Name:",null,{"$f":"'1-Cover Sheet'!F8","v":"Select One"},null,null,"HCD Grant Number:",{"$f":"'1-Cover Sheet'!C8","v":0}]
["Reporting Period:",null,{"$f":"'1-Cover Sheet'!F10","v":0}]
["CERTIFICATION"]
["***By signing this request, I certify to the best of my knowledge and belief that the request is true, complete, and accurate, and the expenditures, disbursements and cash receipts will be  for the purposes and objectives set forth in the terms and conditions of the State award. I am aware that any false, fictitious, or fraudulent information, or the omission of any material fact, may subject me to criminal, civil or administrative penalties for fraud, false statements, false claims or otherwise. (U.S. Code Title 18, Section 1001 and Title 31, Sections 3729-3730 and 3801-3812)"]
["Signature Method: ",null,"Select One"]
["Name of PLHA Administrator (per Guidelines 503(b))",null,null,null,"Title of PLHA Administrator"]
[]
["Signature of PLHA Administrator",null,null,null,"Date"]
[]
["Signature Method: ",null,"Select One"]
["Name of Authorized Executive Official \n(City Manager, CFO, CEO or designee per Guidelines 503(b)) ",null,null,null,"Title of Authorized Executive Official"]
[]
["Signature of Authorized Executive Official",null,null,null,"Date"]

{"sheet":"Summary Sheet","index":17,"n_rows":50,"n_cols":24,"rows_kept":50,"cut":false,"hidden":true,"merged":[[31,14,31,22],[32,2,32,3],[32,4,32,5],[32,6,32,7],[32,8,32,9],[32,12,32,13],[32,14,32,22],[11,3,11,5],[10,3,10,5],[10,6,10,8],[11,6,11,8],[44,8,44,10],[45,8,45,10],[46,8,46,10],[11,9,11,11],[13,10,13,11],[29,6,29,7],[18,5,18,14],[19,5,19,6],[28,4,28,5],[19,9,19,10],[19,7,19,8],[10,12,10,14],[11,12,11,14],[26,2,26,3],[26,8,26,9],[26,6,26,7],[26,4,26,5],[39,13,39,15],[31,8,31,9],[31,12,31,13],[40,13,40,15],[41,13,41,15],[42,13,42,15],[43,13,43,15],[42,8,42,10],[43,8,43,10],[49,8,49,10],[45,13,45,15],[46,13,46,15],[47,13,47,15],[48,13,48,15],[49,13,49,15],[49,11,49,12],[47,8,47,10],[48,8,48,10],[39,19,39,22],[39,23,39,25],[36,5,36,7],[36,8,36,10],[37,5,37,7],[38,5,38,7],[39,5,39,7],[40,5,40,7],[41,5,41,7],[40,19,40,22],[40,23,40,25],[41,11,41,12],[41,19,41,22],[41,23,41,25],[39,16,39,18],[40,16,40,18],[41,16,41,18],[36,19,36,22],[36,23,36,25],[37,23,37,25],[37,19,37,22],[37,11,37,12],[38,11,38,12],[38,19,38,22],[42,19,42,22],[42,23,42,25],[43,11,43,12],[43,19,43,22],[43,23,43,25],[44,11,44,12],[44,19,44,22],[44,23,44,25],[42,16,42,18],[43,16,43,18],[44,16,44,18],[44,13,44,15],[49,19,49,22],[49,23,49,25],[45,11,45,12],[45,19,45,22],[45,23,45,25],[46,11,46,12],[46,19,46,22],[46,23,46,25],[47,11,47,12],[47,19,47,22],[47,23,47,25],[45,16,45,18],[46,16,46,18],[47,16,47,18],[48,16,48,18],[48,11,48,12],[48,19,48,22],[48,23,48,25],[49,16,49,18],[38,23,38,25],[36,16,36,18],[37,16,37,18],[38,16,38,18],[27,14,27,22],[28,14,28,22],[29,14,29,22],[30,14,30,22],[20,0,20,25],[34,11,34,25],[35,11,35,25],[28,2,28,3],[28,8,28,9],[27,2,27,3],[27,8,27,9],[28,6,28,7],[29,2,29,3],[29,8,29,9],[36,13,36,15],[37,13,37,15],[38,13,38,15],[31,2,31,3],[31,4,31,5],[31,6,31,7],[0,0,0,25],[1,0,2,25],[3,0,3,25],[4,0,4,24],[5,0,5,14],[5,15,5,25],[6,3,6,8],[6,9,6,11],[6,12,6,14],[6,0,7,2],[7,3,7,8],[7,9,7,11],[7,12,7,14],[6,15,6,25],[7,15,7,25],[28,12,28,13],[30,2,30,3],[30,8,30,9],[27,6,27,7],[29,4,29,5],[30,4,30,5],[29,12,29,13],[30,12,30,13],[27,4,27,5],[30,6,30,7],[24,12,24,13],[25,12,25,13],[22,14,22,22],[15,15,15,25],[19,15,19,25],[16,15,16,25],[17,15,17,25],[22,12,22,13],[27,12,27,13],[23,14,23,22],[24,14,24,22],[25,14,25,22],[26,14,26,22],[26,12,26,13],[8,0,9,2],[10,0,13,2],[8,3,8,8],[8,9,8,11],[11,15,11,25],[12,15,12,25],[13,15,13,25],[14,15,14,25],[23,12,23,13],[8,15,8,25],[18,0,18,2],[9,15,9,25],[10,15,10,25],[19,0,19,2],[22,4,22,5],[22,8,22,9],[22,6,22,7],[18,15,18,25],[17,0,17,2],[17,3,17,4],[17,5,17,14],[12,3,12,8],[12,9,12,14],[13,3,13,8],[14,0,14,2],[14,3,14,4],[14,5,14,14],[16,0,16,2],[16,3,16,4],[48,1,48,2],[49,1,49,2],[44,1,44,2],[46,1,46,2],[45,1,45,2],[47,1,47,2],[45,5,45,7],[46,5,46,7],[47,5,47,7],[48,5,48,7],[49,5,49,7],[44,5,44,7],[33,12,33,13],[42,1,42,2],[41,1,41,2],[33,2,33,3],[33,8,33,9],[33,6,33,7],[33,4,33,5],[8,12,8,14],[10,9,10,11],[15,0,15,2],[15,3,15,4],[15,5,15,14],[13,13,13,14],[9,3,9,8],[9,9,9,11],[25,2,25,3],[25,8,25,9],[24,2,24,3],[24,8,24,9],[23,2,23,3],[23,4,23,5],[23,8,23,9],[23,6,23,7],[24,6,24,7],[25,6,25,7],[24,4,24,5],[25,4,25,5],[9,12,9,14],[16,5,16,14],[21,0,21,22],[22,2,22,3],[35,0,35,10],[34,0,34,10],[42,11,42,12],[38,1,38,2],[43,1,43,2],[39,1,39,2],[36,1,36,2],[40,1,40,2],[36,11,36,12],[40,11,40,12],[37,8,37,10],[38,8,38,10],[39,8,39,10],[40,8,40,10],[41,8,41,10],[39,11,39,12],[37,1,37,2],[42,5,42,7],[43,5,43,7]]}
[]
["Permanent Local Housing Allocation (PLHA) "]
[]
["Review Workbook"]
[]
["Section 1\nGeneral Information ",null,null,null,null,null,null,null,null,null,null,null,null,null,null,"Activity References"]
["Rep Information",null,null,"Reviewing Rep Name",null,null,null,null,null,"Review Start Date",null,null,"Review End Date",null,null,"Activity 1: §301(a)(1) The predevelopment, development, acquisition, rehabilitation, and preservation of multifamily, residential live-work, rental housing that is Affordable to Extremeley low, -Very low-, Low-, or Moderate income households, including necessary operating subsidies"]
[null,null,null,null,null,null,null,null,null,null,null,null,null,null,null,"Activity 2: §301(a)(2) The predevelopment, development, acquisition, rehabilitation, and preservation of Affordable rental and ownership Housing Including Accessory Dwelling Units (ADUs), that meets the needs of a growing workforce earning up to 120% of AMI, or 150% of AMI in high-cost areas. ADUs shall be available for occupancy for a term of no less than 30 days."]
["Manager Information",null,null,"Reviewing Manager Name",null,null,null,null,null,"Review Start Date",null,null,"Manager Approval Date",null,null,"Activity 3: §301(a)(3) Matching Portion of Funds placed into Local or Regional Housing Trust Funds"]
[null,null,null,null,null,null,null,null,null,null,null,null,null,null,null,"Activity 4: §301(a)(4) Matching portions of funds available through the Low- and Moderate-Income Housing Asset Fund pursuant to subdivision (d) of HSC Section 34176"]
["General Applicant Information",null,null,"Local Government Name",null,null,"Designated PLHA Administrator \n(if delegated by local govt.)",null,null,"Contract #",null,null,"Total PLHA Award Amount to date",null,null,"Activity 5: §301(a)(5) Capitalized Reserves for Services connected to the preservation and creation of new Permanent supportive housing."]
[null,null,null,{"$f":"'1-Cover Sheet'!F8","v":"Select One"},null,null,{"$f":"'1-Cover Sheet'!F9","v":0},null,null,{"$f":"'1-Cover Sheet'!C8","v":0},null,null,{"$f":"(SUM('1-Cover Sheet'!C37:G37))","v":0},null,null,"Activity 6: §301(a)(6) Assisting persons who are experiencing or At risk of homelessness, including, but not limited to, providing rapid rehousing, rental assistance, supportive/case management services that allow people to obtain and retain housing, operating and capital costs for navigation centers and emergency shelters, and the new construction, rehabilitation, and preservation of permanent and transitional housing."]
[null,null,null,"Preparer Name and Title",null,null,null,null,null,"Preparer Contact Information",null,null,null,null,null,"Activity 7: §301(a)(7) Accessibility modifications in Lower-income Owner-occupied housing."]
[null,null,null,{"$f":"_xlfn.CONCAT('1-Cover Sheet'!C9,\", \",'1-Cover Sheet'!C11)","v":", "},null,null,null,null,null,"Email:",{"$f":"'1-Cover Sheet'!C10","v":0},null,"Phone: ",{"$f":"'1-Cover Sheet'!C12","v":0},null,"Activity 8: §301(a)(8) Efforts to acquire and rehabilitate foreclosed or vacant homes and apartments."]
["General Review Questions:",null,null,"Response",null,"Comments",null,null,null,null,null,null,null,null,null,"Activity 9: §301(a)(9) Homeownership opportunities, including, but not limited to, down payment assistance"]
["Are all required fillable form fields (yellow cells) filled out completely and accurately? ",null,null,"Select One",null,null,null,null,null,null,null,null,null,null,null,"Activity 10: §301(a)(10) Fiscal incentives made by a county to a city within the county to incentivize approval of one or more Affordable housing Projects, or matching funds invested by a county in an Affordable housing development Project in a city within the county, provided that the city has made an equal or greater investment in the Project. The county fiscal incentives shall be in the form of a grant or low-interest loan to an affordable housing Project. Matching funds investments by both the county and the city also shall be a grant or low-interest deferred loan to the Affordable housing project."]
["Are there any cells that turned red that are unresolved? ",null,null,"Select One",null,null,null,null,null,null,null,null,null,null,null,"Competitive Activity 1 : §401(a)(1) Development of new multifamily rental housing that is Affordable to households at or below 60% of AMI or substantial rehabilitation of multifamily rental housing that will be Affordable to households at or below 60% of AMI, but which is not currently restricted as Affordable housing."]
["Were any concerns raised from grantee's responses to narrative questions? ",null,null,"Select One",null,null,null,null,null,null,null,null,null,null,null,"Competitive Activity 2 : §401(a)(2) Assistance to persons who are experiencing or At risk of homelessness, including, but not limited to, through rapid rehousing, or rental assistance, supportive services, and case management services, that allow people to obtain and retain housing, operating and capital costs for navigation centers, or new construction, rehabilitation, or preservation of permanent or transitional rental housing. "]
["Admin Expended and % of Award",null,null,{"$f":"'3-Financial Summary'!C8","v":0},{"$f":"D19/M12","v":{"$error":"#DIV/0!"}}]
["Uncommitted Formula Funds/Eligibility for Subsequent Award (Formula Only)\npursuant to Guidelines 300(e)(1)-(3)",null,null,1000000,"Pending Annual Allocation\n(see most recent NOFA on HCD Website): ",5000000,null,"Eligibility for New Allocation? ",null,{"$f":"_xlfn.IFS(AND(F20<=125000,D20>=(F20*4)),\"Formula Grantee is Not Eligible to Receive a New Allocation of PLHA Funds\",(AND(F20<=500000,D20>=500000)),\"Formula Grantee is Not Eligible to Receive a New Allocation of PLHA Funds\",(AND(F20>500000,D20>=F20)),\"Formula Grantee is Not Eligible to Receive a New Allocation of PLHA Funds\",TRUE,\"Formula Grantee is Eligible for Pending Allocation\")","v":"Formula Grantee is Eligible for Pending Allocation"},null,"County:",{"$f":"'3-Financial Summary'!C12","v":0},"High Cost Area?",{"$f":"VLOOKUP(M20,'Drop Down Box'!A73:B130,2,FALSE)","v":{"$error":"#N/A"}}]
["Section 2 "]
["Project Summary"]
["Project","Project Activities","Program Funds Expended to Date, per Financial Summary",null,"Program Funds Expended to Date, per Activity Sheets\n(manually enter sum of project expenditures if project has multiple activities)",null,"Amounts Allocated and Expended Confirmed by RFFs/Disbursement Tracker? \nRefer to Columns C and D on the PLHA Disbursement Tracker Summary sheet",null,"Does Supporting Documentation and/or amounts entered in this report reconcile with amounts recorded on Disbursement Tracker? ",null,"Project Status\n(manually check if project has multiple activities)","Project Completion Date","If Completed, is necessary documentation (certificate of completion, certificate of occupancy, etc) on file? ",null,"Comments"]
[{"$f":"'3-Financial Summary'!A12","v":0},{"$f":"IF(A24=0,\"N/A\",'3-Financial Summary'!D12)","v":"N/A"},{"$f":"IF(A24=0,\"N/A\",'3-Financial Summary'!E12)","v":"N/A"},null,{"$f":"IFERROR(_xlfn.XLOOKUP(A24,INDIRECT(\"'\"&B24&\"'!\"&\"$B$51:$B$60\",TRUE),INDIRECT(\"'\"&$B24&\"'!\"&\"$C$51:$C$60\",TRUE),\"Enter Manually\",0),\"N/A\")","v":"N/A"},null,"Select One",null,"Select One",null,{"$f":"IFERROR(_xlfn.XLOOKUP(A24,INDIRECT(\"'\"&$B24&\"'!\"&\"$B$51:$B$57\",TRUE),INDIRECT(\"'\"&$B24&\"'!\"&\"$D$51:$D$57\",TRUE),\"Enter Manually\",0),\"N/A\")","v":"N/A"},{"$f":"IFERROR(_xlfn.XLOOKUP($A24,INDIRECT(\"'\"&$B24&\"'!\"&\"$B$51:$B$57\",TRUE),INDIRECT(\"'\"&$B24&\"'!\"&\"$E$51:$E$57\",TRUE),\"Enter Manually\",0),\"N/A\")","v":"N/A"},"Select One"]
[{"$f":"'3-Financial Summary'!A13","v":0},{"$f":"IF(A25=0,\"N/A\",'3-Financial Summary'!D13)","v":"N/A"},{"$f":"IF(A25=0,\"N/A\",'3-Financial Summary'!E13)","v":"N/A"},null,{"$f":"IFERROR(_xlfn.XLOOKUP(A25,INDIRECT(\"'\"&B25&\"'!\"&\"$B$51:$B$60\",TRUE),INDIRECT(\"'\"&$B25&\"'!\"&\"$C$51:$C$60\",TRUE),\"Enter Manually\",0),\"N/A\")","v":"N/A"},null,"Select One",null,"Select One",null,{"$f":"IFERROR(_xlfn.XLOOKUP(A25,INDIRECT(\"'\"&$B25&\"'!\"&\"$B$51:$B$57\",TRUE),INDIRECT(\"'\"&$B25&\"'!\"&\"$D$51:$D$57\",TRUE),\"Enter Manually\",0),\"N/A\")","v":"N/A"},{"$f":"IFERROR(_xlfn.XLOOKUP($A25,INDIRECT(\"'\"&$B25&\"'!\"&\"$B$51:$B$57\",TRUE),INDIRECT(\"'\"&$B25&\"'!\"&\"$E$51:$E$57\",TRUE),\"Enter Manually\",0),\"N/A\")","v":"N/A"},"Select One"]
[{"$f":"'3-Financial Summary'!A14","v":0},{"$f":"IF(A26=0,\"N/A\",'3-Financial Summary'!D14)","v":"N/A"},{"$f":"IF(A26=0,\"N/A\",'3-Financial Summary'!E14)","v":"N/A"},null,{"$f":"IFERROR(_xlfn.XLOOKUP(A26,INDIRECT(\"'\"&B26&\"'!\"&\"$B$51:$B$60\",TRUE),INDIRECT(\"'\"&$B26&\"'!\"&\"$C$51:$C$60\",TRUE),\"Enter Manually\",0),\"N/A\")","v":"N/A"},null,"Select One",null,"Select One",null,{"$f":"IFERROR(_xlfn.XLOOKUP(A26,INDIRECT(\"'\"&$B26&\"'!\"&\"$B$51:$B$57\",TRUE),INDIRECT(\"'\"&$B26&\"'!\"&\"$D$51:$D$57\",TRUE),\"Enter Manually\",0),\"N/A\")","v":"N/A"},{"$f":"IFERROR(_xlfn.XLOOKUP($A26,INDIRECT(\"'\"&$B26&\"'!\"&\"$B$51:$B$57\",TRUE),INDIRECT(\"'\"&$B26&\"'!\"&\"$E$51:$E$57\",TRUE),\"Enter Manually\",0),\"N/A\")","v":"N/A"},"Select One"]
[{"$f":"'3-Financial Summary'!A15","v":0},{"$f":"IF(A27=0,\"N/A\",'3-Financial Summary'!D15)","v":"N/A"},{"$f":"IF(A27=0,\"N/A\",'3-Financial Summary'!E15)","v":"N/A"},null,{"$f":"IFERROR(_xlfn.XLOOKUP(A27,INDIRECT(\"'\"&B27&\"'!\"&\"$B$51:$B$60\",TRUE),INDIRECT(\"'\"&$B27&\"'!\"&\"$C$51:$C$60\",TRUE),\"Enter Manually\",0),\"N/A\")","v":"N/A"},null,"Select One",null,"Select One",null,{"$f":"IFERROR(_xlfn.XLOOKUP(A27,INDIRECT(\"'\"&$B27&\"'!\"&\"$B$51:$B$57\",TRUE),INDIRECT(\"'\"&$B27&\"'!\"&\"$D$51:$D$57\",TRUE),\"Enter Manually\",0),\"N/A\")","v":"N/A"},{"$f":"IFERROR(_xlfn.XLOOKUP($A27,INDIRECT(\"'\"&$B27&\"'!\"&\"$B$51:$B$57\",TRUE),INDIRECT(\"'\"&$B27&\"'!\"&\"$E$51:$E$57\",TRUE),\"Enter Manually\",0),\"N/A\")","v":"N/A"},"Select One"]
[{"$f":"'3-Financial Summary'!A16","v":0},{"$f":"IF(A28=0,\"N/A\",'3-Financial Summary'!D16)","v":"N/A"},{"$f":"IF(A28=0,\"N/A\",'3-Financial Summary'!E16)","v":"N/A"},null,{"$f":"IFERROR(_xlfn.XLOOKUP(A28,INDIRECT(\"'\"&B28&\"'!\"&\"$B$51:$B$60\",TRUE),INDIRECT(\"'\"&$B28&\"'!\"&\"$C$51:$C$60\",TRUE),\"Enter Manually\",0),\"N/A\")","v":"N/A"},null,"Select One",null,"Select One",null,{"$f":"IFERROR(_xlfn.XLOOKUP(A28,INDIRECT(\"'\"&$B28&\"'!\"&\"$B$51:$B$57\",TRUE),INDIRECT(\"'\"&$B28&\"'!\"&\"$D$51:$D$57\",TRUE),\"Enter Manually\",0),\"N/A\")","v":"N/A"},{"$f":"IFERROR(_xlfn.XLOOKUP($A28,INDIRECT(\"'\"&$B28&\"'!\"&\"$B$51:$B$57\",TRUE),INDIRECT(\"'\"&$B28&\"'!\"&\"$E$51:$E$57\",TRUE),\"Enter Manually\",0),\"N/A\")","v":"N/A"},"Select One"]
[{"$f":"'3-Financial Summary'!A17","v":0},{"$f":"IF(A29=0,\"N/A\",'3-Financial Summary'!D17)","v":"N/A"},{"$f":"IF(A29=0,\"N/A\",'3-Financial Summary'!E17)","v":"N/A"},null,{"$f":"IFERROR(_xlfn.XLOOKUP(A29,INDIRECT(\"'\"&B29&\"'!\"&\"$B$51:$B$60\",TRUE),INDIRECT(\"'\"&$B29&\"'!\"&\"$C$51:$C$60\",TRUE),\"Enter Manually\",0),\"N/A\")","v":"N/A"},null,"Select One",null,"Select One",null,{"$f":"IFERROR(_xlfn.XLOOKUP(A29,INDIRECT(\"'\"&$B29&\"'!\"&\"$B$51:$B$57\",TRUE),INDIRECT(\"'\"&$B29&\"'!\"&\"$D$51:$D$57\",TRUE),\"Enter Manually\",0),\"N/A\")","v":"N/A"},{"$f":"IFERROR(_xlfn.XLOOKUP($A29,INDIRECT(\"'\"&$B29&\"'!\"&\"$B$51:$B$57\",TRUE),INDIRECT(\"'\"&$B29&\"'!\"&\"$E$51:$E$57\",TRUE),\"Enter Manually\",0),\"N/A\")","v":"N/A"},"Select One"]
[{"$f":"'3-Financial Summary'!A18","v":0},{"$f":"IF(A30=0,\"N/A\",'3-Financial Summary'!D18)","v":"N/A"},{"$f":"IF(A30=0,\"N/A\",'3-Financial Summary'!E18)","v":"N/A"},null,{"$f":"IFERROR(_xlfn.XLOOKUP(A30,INDIRECT(\"'\"&B30&\"'!\"&\"$B$51:$B$60\",TRUE),INDIRECT(\"'\"&$B30&\"'!\"&\"$C$51:$C$60\",TRUE),\"Enter Manually\",0),\"N/A\")","v":"N/A"},null,"Select One",null,"Select One",null,{"$f":"IFERROR(_xlfn.XLOOKUP(A30,INDIRECT(\"'\"&$B30&\"'!\"&\"$B$51:$B$57\",TRUE),INDIRECT(\"'\"&$B30&\"'!\"&\"$D$51:$D$57\",TRUE),\"Enter Manually\",0),\"N/A\")","v":"N/A"},{"$f":"IFERROR(_xlfn.XLOOKUP($A30,INDIRECT(\"'\"&$B30&\"'!\"&\"$B$51:$B$57\",TRUE),INDIRECT(\"'\"&$B30&\"'!\"&\"$E$51:$E$57\",TRUE),\"Enter Manually\",0),\"N/A\")","v":"N/A"},"Select One"]
[{"$f":"'3-Financial Summary'!A19","v":0},{"$f":"IF(A31=0,\"N/A\",'3-Financial Summary'!D19)","v":"N/A"},{"$f":"IF(A31=0,\"N/A\",'3-Financial Summary'!E19)","v":"N/A"},null,{"$f":"IFERROR(_xlfn.XLOOKUP(A31,INDIRECT(\"'\"&B31&\"'!\"&\"$B$51:$B$60\",TRUE),INDIRECT(\"'\"&$B31&\"'!\"&\"$C$51:$C$60\",TRUE),\"Enter Manually\",0),\"N/A\")","v":"N/A"},null,"Select One",null,"Select One",null,{"$f":"IFERROR(_xlfn.XLOOKUP(A31,INDIRECT(\"'\"&$B31&\"'!\"&\"$B$51:$B$57\",TRUE),INDIRECT(\"'\"&$B31&\"'!\"&\"$D$51:$D$57\",TRUE),\"Enter Manually\",0),\"N/A\")","v":"N/A"},{"$f":"IFERROR(_xlfn.XLOOKUP($A31,INDIRECT(\"'\"&$B31&\"'!\"&\"$B$51:$B$57\",TRUE),INDIRECT(\"'\"&$B31&\"'!\"&\"$E$51:$E$57\",TRUE),\"Enter Manually\",0),\"N/A\")","v":"N/A"},"Select One"]
[{"$f":"'3-Financial Summary'!A20","v":0},{"$f":"IF(A32=0,\"N/A\",'3-Financial Summary'!D20)","v":"N/A"},{"$f":"IF(A32=0,\"N/A\",'3-Financial Summary'!E20)","v":"N/A"},null,{"$f":"IFERROR(_xlfn.XLOOKUP(A32,INDIRECT(\"'\"&B32&\"'!\"&\"$B$51:$B$60\",TRUE),INDIRECT(\"'\"&$B32&\"'!\"&\"$C$51:$C$60\",TRUE),\"Enter Manually\",0),\"N/A\")","v":"N/A"},null,"Select One",null,"Select One",null,{"$f":"IFERROR(_xlfn.XLOOKUP(A32,INDIRECT(\"'\"&$B32&\"'!\"&\"$B$51:$B$57\",TRUE),INDIRECT(\"'\"&$B32&\"'!\"&\"$D$51:$D$57\",TRUE),\"Enter Manually\",0),\"N/A\")","v":"N/A"},{"$f":"IFERROR(_xlfn.XLOOKUP($A32,INDIRECT(\"'\"&$B32&\"'!\"&\"$B$51:$B$57\",TRUE),INDIRECT(\"'\"&$B32&\"'!\"&\"$E$51:$E$57\",TRUE),\"Enter Manually\",0),\"N/A\")","v":"N/A"},"Select One"]
[{"$f":"'3-Financial Summary'!A21","v":0},{"$f":"IF(A33=0,\"N/A\",'3-Financial Summary'!D21)","v":"N/A"},{"$f":"IF(A33=0,\"N/A\",'3-Financial Summary'!E21)","v":"N/A"},null,{"$f":"IFERROR(_xlfn.XLOOKUP(A33,INDIRECT(\"'\"&B33&\"'!\"&\"$B$51:$B$60\",TRUE),INDIRECT(\"'\"&$B33&\"'!\"&\"$C$51:$C$60\",TRUE),\"Enter Manually\",0),\"N/A\")","v":"N/A"},null,"Select One",null,"Select One",null,{"$f":"IFERROR(_xlfn.XLOOKUP(A33,INDIRECT(\"'\"&$B33&\"'!\"&\"$B$51:$B$57\",TRUE),INDIRECT(\"'\"&$B33&\"'!\"&\"$D$51:$D$57\",TRUE),\"Enter Manually\",0),\"N/A\")","v":"N/A"},{"$f":"IFERROR(_xlfn.XLOOKUP($A33,INDIRECT(\"'\"&$B33&\"'!\"&\"$B$51:$B$57\",TRUE),INDIRECT(\"'\"&$B33&\"'!\"&\"$E$51:$E$57\",TRUE),\"Enter Manually\",0),\"N/A\")","v":"N/A"},"Select One"]
["Total:",null,{"$f":"SUM(C24:D31)","v":0},null,{"$f":"IFERROR(SUM(E24:F31),\"Manually Add Missing Numbers to Column\")","v":0}]
["Section 3 ",null,null,null,null,null,null,null,null,null,null,"Section 4"]
["Activity Outcomes",null,null,null,null,null,null,null,null,null,null,"Optional: Rep and Manager Review Notes"]
["Activity #","Award for this Activity",null,"Amount Expended for this Activity","# Projects in Activity","Were any Ineligible Activities performed with PLHA funds?",null,null,"Comments",null,null,"Date",null,"Issue Identified",null,null,"Manager Response",null,null,"Action Taken",null,null,null,"Status \n(resolved, awaiting grantee response, awaiting manager input, etc)"]
["Administrative Expenses",{"$f":"SUM('1-Cover Sheet'!C35:G35)","v":0},null,{"$f":"'3-Financial Summary'!C8","v":0},"N/A"]
["Activity 1",{"$f":"SUM('1-Cover Sheet'!C15:G15)","v":0},null,{"$f":"'Activity 1'!I4","v":0},{"$f":"COUNTA('Activity 1'!B7:B13)","v":0}]
["Activity 2",{"$f":"SUM('1-Cover Sheet'!C17:G17)","v":0},null,{"$f":"'Activity 2'!I4","v":0},{"$f":"COUNTA('Activity 2'!B7:B13)","v":0}]
["Activity 3",{"$f":"SUM('1-Cover Sheet'!C19:G19)","v":0},null,{"$f":"'Activity 3'!C15","v":0},{"$f":"COUNTA('Activity 3'!$B$8:$B$14)","v":0}]
["Activity 4",{"$f":"SUM('1-Cover Sheet'!C21:G21)","v":0},null,{"$f":"'Activity 4'!C15","v":0},{"$f":"COUNTA('Activity 4'!$B$8:$B$14)","v":0}]
["Activity 5",{"$f":"SUM('1-Cover Sheet'!C23:G23)","v":0},null,{"$f":"'Activity 5'!G15","v":0},{"$f":"COUNTA('Activity 5'!$B$8:$B$14)","v":0}]
["Activity 6",{"$f":"SUM('1-Cover Sheet'!C25:G25)","v":0},null,{"$f":"'Activity 6'!M14","v":0},{"$f":"COUNTA('Activity 6'!$B$7:$B$13)","v":0}]
["Activity 7",{"$f":"SUM('1-Cover Sheet'!C27:G27)","v":0},null,{"$f":"'Activity 7'!C14","v":0},{"$f":"COUNTA('Activity 7'!$B$7:$B$13)","v":0}]
["Activity 8",{"$f":"SUM('1-Cover Sheet'!C29:G29)","v":0},null,{"$f":"'Activity 8'!C14","v":0},{"$f":"COUNTA('Activity 8'!$B$7:$B$13)","v":0}]
["Activity 9",{"$f":"SUM('1-Cover Sheet'!C31:G31)","v":0},null,{"$f":"'Activity 9'!I4","v":0},{"$f":"COUNTA('Activity 9'!$B$7:$B$13)","v":0}]
["Activity 10",{"$f":"SUM('1-Cover Sheet'!C33:G33)","v":0},null,{"$f":"'Activity 10'!I4","v":0},{"$f":"COUNTA('Activity 10'!$B$7:$B$13)","v":0}]
["Competitive Activity 1",{"$f":"IF('1-Cover Sheet'!C47=\"Yes\",'1-Cover Sheet'!C42,\"$0.00\")","v":"$0.00"},null,{"$f":"'Competitive Activity 1'!I4","v":0},{"$f":"COUNTA('Competitive Activity 1'!$B$7:$B$13)","v":0}]
["Competitive Activity 2",{"$f":"IF('1-Cover Sheet'!C48=\"Yes\",'1-Cover Sheet'!C42,\"$0.00\")","v":"$0.00"},null,{"$f":"'Competitive Activity 2'!I4","v":0},{"$f":"COUNTA('Competitive Activity 2'!$B$7:$B$13)","v":0}]

{"sheet":"Project Data","index":18,"n_rows":11,"n_cols":279,"rows_kept":11,"cut":false,"hidden":true,"merged":[]}
["HCD Contract #","Grantee Name","SGM Rep","SGM Manager","Project Name","Project Address","County","Activity(ies)","Total Amount of Program Funds Expended on Activity Costs","Project Status","Date of Final Close-Out (if applicable) ","Length of Aff Restrict. (yrs)","Aff Cov Exp. Date","Total Project Cost","Activity 1 Project? ","A1.Developer","A1.Grant/Loan","A1. $ Predevelopment","A1. $ Development","A1. $ Acquisition","A1. $ Rehab/Preserve","A1. $ COSR","A1. # Occupants","A1. # Households","A1. Seniors","A1. Vets","A1. Disabled","A1. Familes w Minor","A1. TAY","A1. Farmworkers","A1. # Units Total","A1.# Units Restrict. ","A1.Housing Type","A1.# Units COSR","A1.# Units ADA","A1.# Units Homeless","A1.# ELI 30% Units","A1.# VLI 50% Units","A1.# 60% Units","A1.# LI 80% Units","A1.# Mod 120% Units","A1.Award Letter?","A1.Cert of Occ.","Activity 2 Project? ","A2. Developer","A2.$ Grant/Loan","A2.$ Predevelopment","A2.$ Development","A2.$ Acquisition","A2.$ Rehab/Preserve","A2.$ COSR","A2. Individuals to Occupy","A2. Households to Occupy","A2. Seniors","A2. Vets","A2. Disabled","A2. Familes w Minor","A2. TAY","A2. Farmworkers","A2. # Units Total","A2. Housing Type","A2. # Units ADA","A2. # Units Homeless","A2. # ELI 30% Units","A2. # VLI 50% Units","A2. # 60% Units","A2. # LI 80% Units","A2. # Mod 120% Units","Tax Credit Project","A2. Deed Restriction?","A2. Award Letter? ","A2. Cert of Occ.","Activity 3 Project?","A3. $ Deposit in TF","A3. Local or Reg.","A3. TF Type","A3. Project Type","A3. Proof of Deposit?","Activity 4 Project?","A4.$ Deposit in LMIHAF","A4.Project Type","A4.Proof of Deposit?","Activity 5 Project?","A5.PSH Preserved","A5.PSH Created","A5.PLHA Deposited","A5.New Balance of CRF","A5.Source of Add. Funds","A5.Proof of Deposit?","Activity 6 Project? ","A6.$ Exp. RRH","A6.$ Exp. Rental Asst.","A6.$ Exp. Case Mgmt","A6.$ Exp. Nav Centers","A6.$ Exp. Em.Shelt","A6.$ Exp PH New Const.","A6.$ Exp. TH New Const.","A6.$ Exp PH Rehab/Preserv","A6.$ Exp TH Rehab/Preserv","A6.$ Exp Other","A6.Total Expended","A6. # Aes\nDo not sum","A6.Subawarded PLHA\nDo not sum","A6.# Persons Asst RRH.","A6.# Persons Rental Asst..","A6.# Persons Case Mgmt","A6.# Persons Asst. TOTAL","A6.# Exit to Homeless","A6.# Occupants PH","A6.# Occupants TH","A6.# Seniors","A6.# Vets","A6.# Disabled","A6.#Families","A6.# TAY","A6.# Units RRH","A6.# Units Rental Asst.","A6.# Units Case Mgmt.","A6.# Units COSR","A6.# ES Beds","A6.# Perm Units","A6.# Tran Units","A6.# Units TOTAL","A6.Housing Type","A6.Cert of Occ?","Activity 7 Project?","A7.$ Exp.","A7.Contractor","A7.Prevail. Wage","A7.Grant or Loan?","A7.# Occupants","A7.# Households","A7.# Seniors","A7.# Vets","A7.# Disabled","A7.# Families","A7.# TAY","A7.# Units Total","A7.Housing Type","A7.# ELI 30% Units","A7.# VLI 50% Units","A7.# 60% Units","A7.# LI 80% Units","A7.Deed Restrict?","A7. Proof of Work ","A7.Cert of Comp.","Activity 8 Activity?","A8.Dev","A8.Orig. Status","A8. Yr Built","A8.$ Acquisition","A8.$ Rehab","A8. Prevail. Wage","A8.# Individuals","A8.# Households","A8. # Seniors","A8.# Vets","A8.# Disabled","A8.# Familes ","A8.# TAY","A8. Farmworker","A8.# Units Total","A8.Housing Type","A8.# Units ADA","A8.# Units Homeless","A8.# ELI 30% Units","A8.# VLI 50% Units","A8.# 60% Units","A8.# LI 80% Units","A8.# Mod 120% Units","A8. Tax Credit","A8.Deed Restrict","A8.Cert of Occ.","Activity 9 Project?","A9. $ Down Payment Asst.","A9. $ Other Homeowner Opp.","A9. Descrip. Homeownership Activities","A9. # Households","A9. # Individuals","A9. # Seniors","A9. # Vets","A9. # Disabled","A9. # Families","A9. # TAY","A9. Farmworkers","A9. # Homeowner Units","A9. Housing Type","A9. # ELI 30% Units","A9. # VLI 50% Units","A9. # 60% Units","A9. # LI 80% Units","A9. # Mod 120% Units","A9. Deed Restrict?","A9. Homeowner Policies?","A9. Proof of Awards?","A9. Cert of Occ.","Activity 10 project?","A10. Receiving City","A10.City Offering Asst?","A10.$ PLHA","A10.How PLHA Provided","A10.$ Match Provided","A10.# Individuals","A10.# Households","A10.# Seniors","A10.# Vets","A10.# Disabled","A10.# Families","A10.# TAY","A10.# Farmworkers","A10.# Units","A10.# Restricted Units","A10.Housing Type","A10.# ADA Units","A10.# Units Former Homeless","A10.# ELI 30% Units","A10.# VLI 50% Units","A10.# 60% Units","A10.# LI 80% Units","A10.# Mod 120% Units","A10.Proof Incentive Paid","Comp. Activity 1?","CA1.Developer","CA1.Grant/Loan","CA1.$ Predevelopment","CA1.$ Development","CA1.$ Acquisition","CA1.$ Rehab/Preserve","CA1.# Occupants","CA1.# Households","CA1.# Seniors","CA1.# Vets","CA1.# Disabled","CA1.# Families","CA1.# TAY","CA1.# Farmworkers","CA1.# Units Total","CA1.# Units <60%","CA1. Project Type","CA1.Housing Type","CA1.# Units ADA","CA1.# Units Homeless","CA1.# ELI 30% Units","CA1.# VLI 50% Units","Tax Credit","CA1.Award Letter?","CA1.Ev of Rehab","CA1.Cert of Occ.","Comp. Activity 2 Project?","CA2.$ Exp. RRH","CA2.$ Exp. Rental Asst.","CA2.$ Exp. Case Manage.","CA2.$ Exp. Nav Centers","CA2.$ Exp PH New Const.","CA2.$ Exp. TH New Const.","CA2.$ Exp PH Rehab/Preserv","CA2.$ Exp TH Rehab/Preserv","CA2.$ Exp Other","CA2.Total Expended","CA2.# Persons Asst RRH.","CA2.# Persons Rental Asst..","CA2.# Persons Case Mgmt","CA2.# Persons Asst. TOTAL","CA2.# Occupants TH","CA2.# Occupants PH","CA2.# Seniors","CA2.# Vets","CA2.# Disabled","CA2.#Families","CA2.# TAY","CA2.# Units RRH","CA2.# Units Rental Asst.","CA2.# Units Case Mgmt.","CA2.# Units COSR","CA2.# Tran Units","CA2.# Perm Units","CA2.# Units TOTAL","CA2.Housing Type","CA2.Cert of Occ?"]
[{"$f":"'1-Cover Sheet'!$C$8","v":0},{"$f":"'1-Cover Sheet'!$F$8","v":"Select One"},{"$f":"'Summary Sheet'!$D$8","v":0},{"$f":"'Summary Sheet'!$D$10","v":0},{"$f":"'3-Financial Summary'!A12","v":0},{"$f":"'3-Financial Summary'!B12","v":0},{"$f":"'3-Financial Summary'!C12","v":0},{"$f":"'3-Financial Summary'!D12","v":0},{"$f":"'3-Financial Summary'!E12","v":0},{"$f":"VLOOKUP(E2,'Summary Sheet'!$A$23:$L$34,11,FALSE)","v":"N/A"},{"$f":"VLOOKUP(E2,'Summary Sheet'!$A$23:$L$34,12,FALSE)","v":"N/A"},{"$f":"'3-Financial Summary'!F12","v":0},{"$f":"'3-Financial Summary'!G12","v":"00:00:00"},{"$f":"'3-Financial Summary'!H12","v":0},{"$f":"_xlfn.XLOOKUP($E2,'Activity 1'!$B$7:$B$13,'Activity 1'!$A$7:$A$13,\"No\",0,1)","v":"No"},{"$f":"_xlfn.XLOOKUP($E2,'Activity 1'!$B$7:$B$13,'Activity 1'!C7:C13,\"N/A\",0,1)","v":"N/A"},{"$f":"_xlfn.XLOOKUP($E2,'Activity 1'!$B$7:$B$13,'Activity 1'!D7:D13,\"N/A\",0,1)","v":"N/A"},{"$f":"_xlfn.XLOOKUP($E2,'Activity 1'!$B$7:$B$13,'Activity 1'!E$7:E$13,\"N/A\",0,1)","v":"N/A"},{"$f":"_xlfn.XLOOKUP($E2,'Activity 1'!$B$7:$B$13,'Activity 1'!F$7:F$13,\"N/A\",0,1)","v":"N/A"},{"$f":"_xlfn.XLOOKUP($E2,'Activity 1'!$B$7:$B$13,'Activity 1'!G$7:G$13,\"N/A\",0,1)","v":"N/A"},{"$f":"_xlfn.XLOOKUP($E2,'Activity 1'!$B$7:$B$13,'Activity 1'!H$7:H$13,\"N/A\",0,1)","v":"N/A"},{"$f":"_xlfn.XLOOKUP($E2,'Activity 1'!$B$7:$B$13,'Activity 1'!I$7:I$13,\"N/A\",0,1)","v":"N/A"},{"$f":"_xlfn.XLOOKUP($E2,'Activity 1'!$B$7:$B$13,'Activity 1'!J$7:J$13,\"N/A\",0,1)","v":"N/A"},{"$f":"_xlfn.XLOOKUP($E2,'Activity 1'!$B$7:$B$13,'Activity 1'!K$7:K$13,\"N/A\",0,1)","v":"N/A"},{"$f":"_xlfn.XLOOKUP($E2,'Activity 1'!$B$7:$B$13,'Activity 1'!L$7:L$13,\"N/A\",0,1)","v":"N/A"},{"$f":"_xlfn.XLOOKUP($E2,'Activity 1'!$B$7:$B$13,'Activity 1'!M$7:M$13,\"N/A\",0,1)","v":"N/A"},{"$f":"_xlfn.XLOOKUP($E2,'Activity 1'!$B$7:$B$13,'Activity 1'!N$7:N$13,\"N/A\",0,1)","v":"N/A"},{"$f":"_xlfn.XLOOKUP($E2,'Activity 1'!$B$7:$B$13,'Activity 1'!O$7:O$13,\"N/A\",0,1)","v":"N/A"},{"$f":"_xlfn.XLOOKUP($E2,'Activity 1'!$B$7:$B$13,'Activity 1'!P$7:P$13,\"N/A\",0,1)","v":"N/A"},{"$f":"_xlfn.XLOOKUP($E2,'Activity 1'!$B$7:$B$13,'Activity 1'!Q$7:Q$13,\"N/A\",0,1)","v":"N/A"},{"$f":"_xlfn.XLOOKUP($E2,'Activity 1'!$B$17:$B$23,'Activity 1'!C$17:C$23,\"N/A\",0,1)","v":"N/A"},{"$f":"_xlfn.XLOOKUP($E2,'Activity 1'!$B$17:$B$23,'Activity 1'!D$17:D$23,\"N/A\",0,1)","v":"N/A"},{"$f":"_xlfn.XLOOKUP($E2,'Activity 1'!$B$17:$B$23,'Activity 1'!E$17:E$23,\"N/A\",0,1)","v":"N/A"},{"$f":"_xlfn.XLOOKUP($E2,'Activity 1'!$B$17:$B$23,'Activity 1'!F$17:F$23,\"N/A\",0,1)","v":"N/A"},{"$f":"_xlfn.XLOOKUP($E2,'Activity 1'!$B$17:$B$23,'Activity 1'!G$17:G$23,\"N/A\",0,1)","v":"N/A"},{"$f":"_xlfn.XLOOKUP($E2,'Activity 1'!$B$17:$B$23,'Activity 1'!H$17:H$23,\"N/A\",0,1)","v":"N/A"},{"$f":"_xlfn.XLOOKUP($E2,'Activity 1'!$B$17:$B$23,'Activity 1'!I$17:I$23,\"N/A\",0,1)","v":"N/A"},{"$f":"_xlfn.XLOOKUP($E2,'Activity 1'!$B$17:$B$23,'Activity 1'!J$17:J$23,\"N/A\",0,1)","v":"N/A"},{"$f":"_xlfn.XLOOKUP($E2,'Activity 1'!$B$17:$B$23,'Activity 1'!K$17:K$23,\"N/A\",0,1)","v":"N/A"},{"$f":"_xlfn.XLOOKUP($E2,'Activity 1'!$B$17:$B$23,'Activity 1'!L$17:L$23,\"N/A\",0,1)","v":"N/A"},{"$f":"_xlfn.XLOOKUP($E2,'Activity 1'!$B$17:$B$23,'Activity 1'!M$17:M$23,\"N/A\",0,1)","v":"N/A"},{"$f":"_xlfn.XLOOKUP($E2,'Activity 1'!$B$17:$B$23,'Activity 1'!O$17:O$23,\"N/A\",0,1)","v":"N/A"},{"$f":"_xlfn.XLOOKUP($E2,'Activity 1'!$B$17:$B$23,'Activity 1'!Q$17:Q$23,\"N/A\",0,1)","v":"N/A"},{"$f":"_xlfn.XLOOKUP($E2,'Activity 2'!$B$7:$B$13,'Activity 2'!A$7:A$13,\"No\",0)","v":"No"},{"$f":"_xlfn.XLOOKUP($E2,'Activity 2'!$B$7:$B$13,'Activity 2'!C$7:C$13,\"N/A\",0,1)","v":"N/A"},{"$f":"_xlfn.XLOOKUP($E2,'Activity 2'!$B$7:$B$13,'Activity 2'!D$7:D$13,\"N/A\",0,1)","v":"N/A"},{"$f":"_xlfn.XLOOKUP($E2,'Activity 2'!$B$7:$B$13,'Activity 2'!E$7:E$13,\"N/A\",0,1)","v":"N/A"},{"$f":"_xlfn.XLOOKUP($E2,'Activity 2'!$B$7:$B$13,'Activity 2'!F$7:F$13,\"N/A\",0,1)","v":"N/A"},{"$f":"_xlfn.XLOOKUP($E2,'Activity 2'!$B$7:$B$13,'Activity 2'!G$7:G$13,\"N/A\",0,1)","v":"N/A"},{"$f":"_xlfn.XLOOKUP($E2,'Activity 2'!$B$7:$B$13,'Activity 2'!H$7:H$13,\"N/A\",0,1)","v":"N/A"},{"$f":"_xlfn.XLOOKUP($E2,'Activity 2'!$B$7:$B$13,'Activity 2'!I$7:I$13,\"N/A\",0,1)","v":"N/A"},{"$f":"_xlfn.XLOOKUP($E2,'Activity 2'!$B$7:$B$13,'Activity 2'!J$7:J$13,\"N/A\",0,1)","v":"N/A"},{"$f":"_xlfn.XLOOKUP($E2,'Activity 2'!$B$7:$B$13,'Activity 2'!K$7:K$13,\"N/A\",0,1)","v":"N/A"},{"$f":"_xlfn.XLOOKUP($E2,'Activity 2'!$B$7:$B$13,'Activity 2'!L$7:L$13,\"N/A\",0,1)","v":"N/A"},{"$f":"_xlfn.XLOOKUP($E2,'Activity 2'!$B$7:$B$13,'Activity 2'!M$7:M$13,\"N/A\",0,1)","v":"N/A"},{"$f":"_xlfn.XLOOKUP($E2,'Activity 2'!$B$7:$B$13,'Activity 2'!N$7:N$13,\"N/A\",0,1)","v":"N/A"},{"$f":"_xlfn.XLOOKUP($E2,'Activity 2'!$B$7:$B$13,'Activity 2'!O$7:O$13,\"N/A\",0,1)","v":"N/A"},{"$f":"_xlfn.XLOOKUP($E2,'Activity 2'!$B$7:$B$13,'Activity 2'!P$7:P$13,\"N/A\",0,1)","v":"N/A"},{"$f":"_xlfn.XLOOKUP($E2,'Activity 2'!$B$7:$B$13,'Activity 2'!Q$7:Q$13,\"N/A\",0,1)","v":"N/A"},{"$f":"_xlfn.XLOOKUP($E2,'Activity 2'!$B$17:$B$23,'Activity 2'!C$17:C$23,\"N/A\",0,1)","v":"N/A"},{"$f":"_xlfn.XLOOKUP($E2,'Activity 2'!$B$17:$B$23,'Activity 2'!D$17:D$23,\"N/A\",0,1)","v":"N/A"},{"$f":"_xlfn.XLOOKUP($E2,'Activity 2'!$B$17:$B$23,'Activity 2'!E$17:E$23,\"N/A\",0,1)","v":"N/A"},{"$f":"_xlfn.XLOOKUP($E2,'Activity 2'!$B$17:$B$23,'Activity 2'!F$17:F$23,\"N/A\",0,1)","v":"N/A"},{"$f":"_xlfn.XLOOKUP($E2,'Activity 2'!$B$17:$B$23,'Activity 2'!G$17:G$23,\"N/A\",0,1)","v":"N/A"},{"$f":"_xlfn.XLOOKUP($E2,'Activity 2'!$B$17:$B$23,'Activity 2'!H$17:H$23,\"N/A\",0,1)","v":"N/A"},{"$f":"_xlfn.XLOOKUP($E2,'Activity 2'!$B$17:$B$23,'Activity 2'!I$17:I$23,\"N/A\",0,1)","v":"N/A"},{"$f":"_xlfn.XLOOKUP($E2,'Activity 2'!$B$17:$B$23,'Activity 2'!J$17:J$23,\"N/A\",0,1)","v":"N/A"},{"$f":"_xlfn.XLOOKUP($E2,'Activity 2'!$B$17:$B$23,'Activity 2'!K$17:K$23,\"N/A\",0,1)","v":"N/A"},{"$f":"_xlfn.XLOOKUP($E2,'Activity 2'!$B$17:$B$23,'Activity 2'!L$17:L$23,\"N/A\",0,1)","v":"N/A"},{"$f":"_xlfn.XLOOKUP($E2,'Activity 2'!$B$17:$B$23,'Activity 2'!M$17:M$23,\"N/A\",0,1)","v":"N/A"},{"$f":"_xlfn.XLOOKUP($E2,'Activity 2'!$B$17:$B$23,'Activity 2'!O$17:O$23,\"N/A\",0,1)","v":"N/A"},{"$f":"_xlfn.XLOOKUP($E2,'Activity 2'!$B$17:$B$23,'Activity 2'!Q$17:Q$23,\"N/A\",0,1)","v":"N/A"},{"$f":"_xlfn.XLOOKUP($E2,'Activity 3'!$B$8:$B$14,'Activity 3'!A$8:A$14,\"No\",0,1)","v":"No"},{"$f":"_xlfn.XLOOKUP($E2,'Activity 3'!$B$8:$B$14,'Activity 3'!C$8:C$14,\"N/A\",0,1)","v":"N/A"},{"$f":"_xlfn.XLOOKUP($E2,'Activity 3'!$B$8:$B$14,'Activity 3'!D$8:D$14,\"N/A\",0,1)","v":"N/A"},{"$f":"_xlfn.XLOOKUP($E2,'Activity 3'!$B$8:$B$14,'Activity 3'!E$8:E$14,\"N/A\",0,1)","v":"N/A"},{"$f":"_xlfn.XLOOKUP($E2,'Activity 3'!$B$8:$B$14,'Activity 3'!F$8:F$14,\"N/A\",0,1)","v":"N/A"},{"$f":"_xlfn.XLOOKUP($E2,'Activity 3'!$B$8:$B$14,'Activity 3'!G$8:G$14,\"N/A\",0,1)","v":"N/A"},{"$f":"_xlfn.XLOOKUP($E2,'Activity 4'!$B$8:$B$14,'Activity 4'!A8:A14,\"No\",0,1)","v":"No"},{"$f":"_xlfn.XLOOKUP($E2,'Activity 4'!$B$8:$B$14,'Activity 4'!C$8:C$14,\"N/A\",0,1)","v":"N/A"},{"$f":"_xlfn.XLOOKUP($E2,'Activity 4'!$B$8:$B$14,'Activity 4'!D$8:D$14,\"N/A\",0,1)","v":"N/A"},{"$f":"_xlfn.XLOOKUP($E2,'Activity 4'!$B$8:$B$14,'Activity 4'!G$8:G$14,\"N/A\",0,1)","v":"N/A"},{"$f":"_xlfn.XLOOKUP($E2,'Activity 5'!$B$8:$B$14,'Activity 5'!$A$8:$A$14,\"No\",0,1)","v":"No"},{"$f":"_xlfn.XLOOKUP($E2,'Activity 5'!$B$8:$B$14,'Activity 5'!C$8:C$14,\"N/A\",0,1)","v":"N/A"},{"$f":"_xlfn.XLOOKUP($E2,'Activity 5'!$B$8:$B$14,'Activity 5'!D$8:D$14,\"N/A\",0,1)","v":"N/A"},{"$f":"_xlfn.XLOOKUP($E2,'Activity 5'!$B$8:$B$14,'Activity 5'!G$8:G$14,\"N/A\",0,1)","v":"N/A"},{"$f":"_xlfn.XLOOKUP($E2,'Activity 5'!$B$8:$B$14,'Activity 5'!H$8:H$14,\"N/A\",0,1)","v":"N/A"},{"$f":"_xlfn.XLOOKUP($E2,'Activity 5'!$B$8:$B$14,'Activity 5'!I$8:I$14,\"N/A\",0,1)","v":"N/A"},{"$f":"_xlfn.XLOOKUP($E2,'Activity 5'!$B$8:$B$14,'Activity 5'!J$8:J$14,\"N/A\",0,1)","v":"N/A"},{"$f":"_xlfn.XLOOKUP($E2,'Activity 6'!$B$7:$B$13,'Activity 6'!A$7:A$13,\"No\",0,1)","v":"No"},{"$f":"_xlfn.XLOOKUP($E2,'Activity 6'!$B$7:$B$13,'Activity 6'!C$7:C$13,\"N/A\",0,1)","v":"N/A"},{"$f":"_xlfn.XLOOKUP($E2,'Activity 6'!$B$7:$B$13,'Activity 6'!D$7:D$13,\"N/A\",0,1)","v":"N/A"},{"$f":"_xlfn.XLOOKUP($E2,'Activity 6'!$B$7:$B$13,'Activity 6'!E$7:E$13,\"N/A\",0,1)","v":"N/A"},{"$f":"_xlfn.XLOOKUP($E2,'Activity 6'!$B$7:$B$13,'Activity 6'!F$7:F$13,\"N/A\",0,1)","v":"N/A"},{"$f":"_xlfn.XLOOKUP($E2,'Activity 6'!$B$7:$B$13,'Activity 6'!G$7:G$13,\"N/A\",0,1)","v":"N/A"},{"$f":"_xlfn.XLOOKUP($E2,'Activity 6'!$B$7:$B$13,'Activity 6'!H$7:H$13,\"N/A\",0,1)","v":"N/A"},{"$f":"_xlfn.XLOOKUP($E2,'Activity 6'!$B$7:$B$13,'Activity 6'!I$7:I$13,\"N/A\",0,1)","v":"N/A"},{"$f":"_xlfn.XLOOKUP($E2,'Activity 6'!$B$7:$B$13,'Activity 6'!J$7:J$13,\"N/A\",0,1)","v":"N/A"},{"$f":"_xlfn.XLOOKUP($E2,'Activity 6'!$B$7:$B$13,'Activity 6'!K$7:K$13,\"N/A\",0,1)","v":"N/A"},{"$f":"_xlfn.XLOOKUP($E2,'Activity 6'!$B$7:$B$13,'Activity 6'!L$7:L$13,\"N/A\",0,1)","v":"N/A"},{"$f":"_xlfn.XLOOKUP($E2,'Activity 6'!$B$7:$B$13,'Activity 6'!M$7:M$13,\"N/A\",0,1)","v":"N/A"},{"$f":"IF(ISNUMBER(SEARCH(\"6\",H2)),COUNTA('Activity 6'!$D$17:$E$20),\"N/A\")","v":"N/A"},{"$f":"IF(ISNUMBER(SEARCH(6,H2)),SUM('Activity 6'!G17:G20),\"N/A\")","v":"N/A"},{"$f":"_xlfn.XLOOKUP($E2,'Activity 6'!$B$23:$B$29,'Activity 6'!C$23:C$29,\"N/A\",0,1)","v":"N/A"},{"$f":"_xlfn.XLOOKUP($E2,'Activity 6'!$B$23:$B$29,'Activity 6'!D$23:D$29,\"N/A\",0,1)","v":"N/A"},{"$f":"_xlfn.XLOOKUP($E2,'Activity 6'!$B$23:$B$29,'Activity 6'!E$23:E$29,\"N/A\",0,1)","v":"N/A"},{"$f":"_xlfn.XLOOKUP($E2,'Activity 6'!$B$23:$B$29,'Activity 6'!F$23:F$29,\"N/A\",0,1)","v":"N/A"},{"$f":"_xlfn.XLOOKUP($E2,'Activity 6'!$B$23:$B$29,'Activity 6'!G$23:G$29,\"N/A\",0,1)","v":"N/A"},{"$f":"_xlfn.XLOOKUP($E2,'Activity 6'!$B$23:$B$29,'Activity 6'!H$23:H$29,\"N/A\",0,1)","v":"N/A"},{"$f":"_xlfn.XLOOKUP($E2,'Activity 6'!$B$23:$B$29,'Activity 6'!I$23:I$29,\"N/A\",0,1)","v":"N/A"},{"$f":"_xlfn.XLOOKUP($E2,'Activity 6'!$B$23:$B$29,'Activity 6'!J$23:J$29,\"N/A\",0,1)","v":"N/A"},{"$f":"_xlfn.XLOOKUP($E2,'Activity 6'!$B$23:$B$29,'Activity 6'!K$23:K$29,\"N/A\",0,1)","v":"N/A"},{"$f":"_xlfn.XLOOKUP($E2,'Activity 6'!$B$23:$B$29,'Activity 6'!L$23:L$29,\"N/A\",0,1)","v":"N/A"},{"$f":"_xlfn.XLOOKUP($E2,'Activity 6'!$B$23:$B$29,'Activity 6'!M$23:M$29,\"N/A\",0,1)","v":"N/A"},{"$f":"_xlfn.XLOOKUP($E2,'Activity 6'!$B$23:$B$29,'Activity 6'!N$23:N$29,\"N/A\",0,1)","v":"N/A"},{"$f":"_xlfn.XLOOKUP($E2,'Activity 6'!$B$33:$B$38,'Activity 6'!C$33:C$38,\"N/A\",0,1)","v":"N/A"},{"$f":"_xlfn.XLOOKUP($E2,'Activity 6'!$B$33:$B$38,'Activity 6'!D$33:D$38,\"N/A\",0,1)","v":"N/A"},{"$f":"_xlfn.XLOOKUP($E2,'Activity 6'!$B$33:$B$38,'Activity 6'!E$33:E$38,\"N/A\",0,1)","v":"N/A"},{"$f":"_xlfn.XLOOKUP($E2,'Activity 6'!$B$33:$B$38,'Activity 6'!I$33:I$38,\"N/A\",0,1)","v":"N/A"},{"$f":"_xlfn.XLOOKUP($E2,'Activity 6'!$B$33:$B$38,'Activity 6'!G$33:G$38,\"N/A\",0,1)","v":"N/A"},{"$f":"_xlfn.XLOOKUP($E2,'Activity 6'!$B$33:$B$38,'Activity 6'!H$33:H$38,\"N/A\",0,1)","v":"N/A"},{"$f":"_xlfn.XLOOKUP($E2,'Activity 6'!$B$33:$B$38,'Activity 6'!I$33:I$38,\"N/A\",0,1)","v":"N/A"},{"$f":"_xlfn.XLOOKUP($E2,'Activity 6'!$B$33:$B$38,'Activity 6'!J$33:J$38,\"N/A\",0,1)","v":"N/A"},{"$f":"_xlfn.XLOOKUP($E2,'Activity 6'!$B$33:$B$38,'Activity 6'!K$33:K$38,\"N/A\",0,1)","v":"N/A"},{"$f":"_xlfn.XLOOKUP($E2,'Activity 6'!$B$33:$B$38,'Activity 6'!M$33:M$38,\"N/A\",0,1)","v":"N/A"},{"$f":"_xlfn.XLOOKUP($E2,'Activity 7'!$B$7:$B$13,'Activity 7'!$A$7:$A$13,\"No\",0,1)","v":"No"},{"$f":"_xlfn.XLOOKUP($E2,'Activity 7'!$B$7:$B$13,'Activity 7'!C$7:C$13,\"N/A\",0,1)","v":"N/A"},{"$f":"_xlfn.XLOOKUP($E2,'Activity 7'!$B$7:$B$13,'Activity 7'!D$7:D$13,\"N/A\",0,1)","v":"N/A"},{"$f":"_xlfn.XLOOKUP($E2,'Activity 7'!$B$7:$B$13,'Activity 7'!E$7:E$13,\"N/A\",0,1)","v":"N/A"},{"$f":"_xlfn.XLOOKUP($E2,'Activity 7'!$B$7:$B$13,'Activity 7'!F$7:F$13,\"N/A\",0,1)","v":"N/A"},{"$f":"_xlfn.XLOOKUP($E2,'Activity 7'!$B$7:$B$13,'Activity 7'!G$7:G$13,\"N/A\",0,1)","v":"N/A"},{"$f":"_xlfn.XLOOKUP($E2,'Activity 7'!$B$7:$B$13,'Activity 7'!H$7:H$13,\"N/A\",0,1)","v":"N/A"},{"$f":"_xlfn.XLOOKUP($E2,'Activity 7'!$B$7:$B$13,'Activity 7'!I$7:I$13,\"N/A\",0,1)","v":"N/A"},{"$f":"_xlfn.XLOOKUP($E2,'Activity 7'!$B$7:$B$13,'Activity 7'!J$7:J$13,\"N/A\",0,1)","v":"N/A"},{"$f":"_xlfn.XLOOKUP($E2,'Activity 7'!$B$7:$B$13,'Activity 7'!K$7:K$13,\"N/A\",0,1)","v":"N/A"},{"$f":"_xlfn.XLOOKUP($E2,'Activity 7'!$B$7:$B$13,'Activity 7'!L$7:L$13,\"N/A\",0,1)","v":"N/A"},{"$f":"_xlfn.XLOOKUP($E2,'Activity 7'!$B$7:$B$13,'Activity 7'!M$7:M$13,\"N/A\",0,1)","v":"N/A"},{"$f":"_xlfn.XLOOKUP($E2,'Activity 7'!$B$17:$B$23,'Activity 7'!C$17:C$23,\"N/A\",0,1)","v":"N/A"},{"$f":"_xlfn.XLOOKUP($E2,'Activity 7'!$B$17:$B$23,'Activity 7'!D$17:D$23,\"N/A\",0,1)","v":"N/A"},{"$f":"_xlfn.XLOOKUP($E2,'Activity 7'!$B$17:$B$23,'Activity 7'!E$17:E$23,\"N/A\",0,1)","v":"N/A"},{"$f":"_xlfn.XLOOKUP($E2,'Activity 7'!$B$17:$B$23,'Activity 7'!F$17:F$23,\"N/A\",0,1)","v":"N/A"},{"$f":"_xlfn.XLOOKUP($E2,'Activity 7'!$B$17:$B$23,'Activity 7'!G$17:G$23,\"N/A\",0,1)","v":"N/A"},{"$f":"_xlfn.XLOOKUP($E2,'Activity 7'!$B$17:$B$23,'Activity 7'!H$17:H$23,\"N/A\",0,1)","v":"N/A"},{"$f":"_xlfn.XLOOKUP($E2,'Activity 7'!$B$17:$B$23,'Activity 7'!I$17:I$23,\"N/A\",0,1)","v":"N/A"},{"$f":"_xlfn.XLOOKUP($E2,'Activity 7'!$B$17:$B$23,'Activity 7'!J$17:J$23,\"N/A\",0,1)","v":"N/A"},{"$f":"_xlfn.XLOOKUP($E2,'Activity 7'!$B$17:$B$23,'Activity 7'!L$17:L$23,\"N/A\",0,1)","v":"N/A"},{"$f":"_xlfn.XLOOKUP($E2,'Activity 8'!$B$7:$B$13,'Activity 8'!A$7:A$13,\"No\",0,1)","v":"No"},{"$f":"_xlfn.XLOOKUP($E2,'Activity 8'!$B$7:$B$13,'Activity 8'!C$7:C$13,\"N/A\",0,1)","v":"N/A"},{"$f":"_xlfn.XLOOKUP($E2,'Activity 8'!$B$7:$B$13,'Activity 8'!D$7:D$13,\"N/A\",0,1)","v":"N/A"},{"$f":"_xlfn.XLOOKUP($E2,'Activity 8'!$B$7:$B$13,'Activity 8'!E$7:E$13,\"N/A\",0,1)","v":"N/A"},{"$f":"_xlfn.XLOOKUP($E2,'Activity 8'!$B$7:$B$13,'Activity 8'!F$7:F$13,\"N/A\",0,1)","v":"N/A"},{"$f":"_xlfn.XLOOKUP($E2,'Activity 8'!$B$7:$B$13,'Activity 8'!G$7:G$13,\"N/A\",0,1)","v":"N/A"},{"$f":"_xlfn.XLOOKUP($E2,'Activity 8'!$B$7:$B$13,'Activity 8'!H$7:H$13,\"N/A\",0,1)","v":"N/A"},{"$f":"_xlfn.XLOOKUP($E2,'Activity 8'!$B$7:$B$13,'Activity 8'!I$7:I$13,\"N/A\",0,1)","v":"N/A"},{"$f":"_xlfn.XLOOKUP($E2,'Activity 8'!$B$7:$B$13,'Activity 8'!J$7:J$13,\"N/A\",0,1)","v":"N/A"},{"$f":"_xlfn.XLOOKUP($E2,'Activity 8'!$B$7:$B$13,'Activity 8'!K$7:K$13,\"N/A\",0,1)","v":"N/A"},{"$f":"_xlfn.XLOOKUP($E2,'Activity 8'!$B$7:$B$13,'Activity 8'!L$7:L$13,\"N/A\",0,1)","v":"N/A"},{"$f":"_xlfn.XLOOKUP($E2,'Activity 8'!$B$7:$B$13,'Activity 8'!M$7:M$13,\"N/A\",0,1)","v":"N/A"},{"$f":"_xlfn.XLOOKUP($E2,'Activity 8'!$B$7:$B$13,'Activity 8'!N$7:N$13,\"N/A\",0,1)","v":"N/A"},{"$f":"_xlfn.XLOOKUP($E2,'Activity 8'!$B$7:$B$13,'Activity 8'!O$7:O$13,\"N/A\",0,1)","v":"N/A"},{"$f":"_xlfn.XLOOKUP($E2,'Activity 8'!$B$7:$B$13,'Activity 8'!P$7:P$13,\"N/A\",0,1)","v":"N/A"},{"$f":"_xlfn.XLOOKUP($E2,'Activity 8'!$B$17:$B$23,'Activity 8'!C$17:C$23,\"N/A\",0,1)","v":"N/A"},{"$f":"_xlfn.XLOOKUP($E2,'Activity 8'!$B$17:$B$23,'Activity 8'!D$17:D$23,\"N/A\",0,1)","v":"N/A"},{"$f":"_xlfn.XLOOKUP($E2,'Activity 8'!$B$17:$B$23,'Activity 8'!E$17:E$23,\"N/A\",0,1)","v":"N/A"},{"$f":"_xlfn.XLOOKUP($E2,'Activity 8'!$B$17:$B$23,'Activity 8'!F$17:F$23,\"N/A\",0,1)","v":"N/A"},{"$f":"_xlfn.XLOOKUP($E2,'Activity 8'!$B$17:$B$23,'Activity 8'!G$17:G$23,\"N/A\",0,1)","v":"N/A"},{"$f":"_xlfn.XLOOKUP($E2,'Activity 8'!$B$17:$B$23,'Activity 8'!H$17:H$23,\"N/A\",0,1)","v":"N/A"},{"$f":"_xlfn.XLOOKUP($E2,'Activity 8'!$B$17:$B$23,'Activity 8'!I$17:I$23,\"N/A\",0,1)","v":"N/A"},{"$f":"_xlfn.XLOOKUP($E2,'Activity 8'!$B$17:$B$23,'Activity 8'!J$17:J$23,\"N/A\",0,1)","v":"N/A"},{"$f":"_xlfn.XLOOKUP($E2,'Activity 8'!$B$17:$B$23,'Activity 8'!K$17:K$23,\"N/A\",0,1)","v":"N/A"},{"$f":"_xlfn.XLOOKUP($E2,'Activity 8'!$B$17:$B$23,'Activity 8'!L$17:L$23,\"N/A\",0,1)","v":"N/A"},{"$f":"_xlfn.XLOOKUP($E2,'Activity 8'!$B$17:$B$23,'Activity 8'!M$17:M$23,\"N/A\",0,1)","v":"N/A"},{"$f":"_xlfn.XLOOKUP($E2,'Activity 8'!$B$17:$B$23,'Activity 8'!P$17:P$23,\"N/A\",0,1)","v":"N/A"},{"$f":"_xlfn.XLOOKUP(E2,'Activity 9'!B7:B13,'Activity 9'!A7:A13,\"No\",0,1)","v":"No"},{"$f":"_xlfn.XLOOKUP($E2,'Activity 9'!$B$7:$B$13,'Activity 9'!C$7:C$13,\"N/A\",0,1)","v":"N/A"},{"$f":"_xlfn.XLOOKUP($E2,'Activity 9'!$B$7:$B$13,'Activity 9'!D$7:D$13,\"N/A\",0,1)","v":"N/A"},{"$f":"_xlfn.XLOOKUP($E2,'Activity 9'!$B$7:$B$13,'Activity 9'!E$7:E$13,\"N/A\",0,1)","v":"N/A"},{"$f":"_xlfn.XLOOKUP($E2,'Activity 9'!$B$7:$B$13,'Activity 9'!H$7:H$13,\"N/A\",0,1)","v":"N/A"},{"$f":"_xlfn.XLOOKUP($E2,'Activity 9'!$B$7:$B$13,'Activity 9'!I$7:I$13,\"N/A\",0,1)","v":"N/A"},{"$f":"_xlfn.XLOOKUP($E2,'Activity 9'!$B$7:$B$13,'Activity 9'!J$7:J$13,\"N/A\",0,1)","v":"N/A"},{"$f":"_xlfn.XLOOKUP($E2,'Activity 9'!$B$7:$B$13,'Activity 9'!K$7:K$13,\"N/A\",0,1)","v":"N/A"},{"$f":"_xlfn.XLOOKUP($E2,'Activity 9'!$B$7:$B$13,'Activity 9'!L$7:L$13,\"N/A\",0,1)","v":"N/A"},{"$f":"_xlfn.XLOOKUP($E2,'Activity 9'!$B$7:$B$13,'Activity 9'!M$7:M$13,\"N/A\",0,1)","v":"N/A"},{"$f":"_xlfn.XLOOKUP($E2,'Activity 9'!$B$7:$B$13,'Activity 9'!N$7:N$13,\"N/A\",0,1)","v":"N/A"},{"$f":"_xlfn.XLOOKUP($E2,'Activity 9'!$B$7:$B$13,'Activity 9'!O$7:O$13,\"N/A\",0,1)","v":"N/A"},{"$f":"_xlfn.XLOOKUP($E2,'Activity 9'!$B$17:$B$23,'Activity 9'!C$17:C$23,\"N/A\",0,1)","v":"N/A"},{"$f":"_xlfn.XLOOKUP($E2,'Activity 9'!$B$17:$B$23,'Activity 9'!D$17:D$23,\"N/A\",0,1)","v":"N/A"},{"$f":"_xlfn.XLOOKUP($E2,'Activity 9'!$B$17:$B$23,'Activity 9'!E$17:E$23,\"N/A\",0,1)","v":"N/A"},{"$f":"_xlfn.XLOOKUP($E2,'Activity 9'!$B$17:$B$23,'Activity 9'!F$17:F$23,\"N/A\",0,1)","v":"N/A"},{"$f":"_xlfn.XLOOKUP($E2,'Activity 9'!$B$17:$B$23,'Activity 9'!G$17:G$23,\"N/A\",0,1)","v":"N/A"},{"$f":"_xlfn.XLOOKUP($E2,'Activity 9'!$B$17:$B$23,'Activity 9'!H$17:H$23,\"N/A\",0,1)","v":"N/A"},{"$f":"_xlfn.XLOOKUP($E2,'Activity 9'!$B$17:$B$23,'Activity 9'!I$17:I$23,\"N/A\",0,1)","v":"N/A"},{"$f":"_xlfn.XLOOKUP($E2,'Activity 9'!$B$17:$B$23,'Activity 9'!J$17:J$23,\"N/A\",0,1)","v":"N/A"},{"$f":"_xlfn.XLOOKUP($E2,'Activity 9'!$B$17:$B$23,'Activity 9'!L$17:L$23,\"N/A\",0,1)","v":"N/A"},{"$f":"_xlfn.XLOOKUP($E2,'Activity 9'!$B$17:$B$23,'Activity 9'!M$17:M$23,\"N/A\",0,1)","v":"N/A"},{"$f":"_xlfn.XLOOKUP($E2,'Activity 9'!$B$17:$B$23,'Activity 9'!O$17:O$23,\"N/A\",0,1)","v":"N/A"},{"$f":"_xlfn.XLOOKUP($E2,'Activity 10'!B7:B13,'Activity 10'!A7:A13,\"No\",0,1)","v":"No"},{"$f":"_xlfn.XLOOKUP($E2,'Activity 10'!$B$7:$B$13,'Activity 10'!C$7:C$13,\"N/A\",0,1)","v":"N/A"},{"$f":"_xlfn.XLOOKUP($E2,'Activity 10'!$B$7:$B$13,'Activity 10'!D$7:D$13,\"N/A\",0,1)","v":"N/A"},{"$f":"_xlfn.XLOOKUP($E2,'Activity 10'!$B$7:$B$13,'Activity 10'!E$7:E$13,\"N/A\",0,1)","v":"N/A"},{"$f":"_xlfn.XLOOKUP($E2,'Activity 10'!$B$7:$B$13,'Activity 10'!F$7:F$13,\"N/A\",0,1)","v":"N/A"},{"$f":"_xlfn.XLOOKUP($E2,'Activity 10'!$B$7:$B$13,'Activity 10'!G$7:G$13,\"N/A\",0,1)","v":"N/A"},{"$f":"_xlfn.XLOOKUP($E2,'Activity 10'!$B$7:$B$13,'Activity 10'!H$7:H$13,\"N/A\",0,1)","v":"N/A"},{"$f":"_xlfn.XLOOKUP($E2,'Activity 10'!$B$7:$B$13,'Activity 10'!I$7:I$13,\"N/A\",0,1)","v":"N/A"},{"$f":"_xlfn.XLOOKUP($E2,'Activity 10'!$B$7:$B$13,'Activity 10'!J$7:J$13,\"N/A\",0,1)","v":"N/A"},{"$f":"_xlfn.XLOOKUP($E2,'Activity 10'!$B$7:$B$13,'Activity 10'!K$7:K$13,\"N/A\",0,1)","v":"N/A"},{"$f":"_xlfn.XLOOKUP($E2,'Activity 10'!$B$7:$B$13,'Activity 10'!L$7:L$13,\"N/A\",0,1)","v":"N/A"},{"$f":"_xlfn.XLOOKUP($E2,'Activity 10'!$B$7:$B$13,'Activity 10'!M$7:M$13,\"N/A\",0,1)","v":"N/A"},{"$f":"_xlfn.XLOOKUP($E2,'Activity 10'!$B$7:$B$13,'Activity 10'!N$7:N$13,\"N/A\",0,1)","v":"N/A"},{"$f":"_xlfn.XLOOKUP($E2,'Activity 10'!$B$7:$B$13,'Activity 10'!O$7:O$13,\"N/A\",0,1)","v":"N/A"},{"$f":"_xlfn.XLOOKUP($E2,'Activity 10'!$B$17:$B$23,'Activity 10'!C$17:C$23,\"N/A\",0,1)","v":"N/A"},{"$f":"_xlfn.XLOOKUP($E2,'Activity 10'!$B$17:$B$23,'Activity 10'!D$17:D$23,\"N/A\",0,1)","v":"N/A"},{"$f":"_xlfn.XLOOKUP($E2,'Activity 10'!$B$17:$B$23,'Activity 10'!E$17:E$23,\"N/A\",0,1)","v":"N/A"},{"$f":"_xlfn.XLOOKUP($E2,'Activity 10'!$B$17:$B$23,'Activity 10'!F$17:F$23,\"N/A\",0,1)","v":"N/A"},{"$f":"_xlfn.XLOOKUP($E2,'Activity 10'!$B$17:$B$23,'Activity 10'!G$17:G$23,\"N/A\",0,1)","v":"N/A"},{"$f":"_xlfn.XLOOKUP($E2,'Activity 10'!$B$17:$B$23,'Activity 10'!H$17:H$23,\"N/A\",0,1)","v":"N/A"},{"$f":"_xlfn.XLOOKUP($E2,'Activity 10'!$B$17:$B$23,'Activity 10'!I$17:I$23,\"N/A\",0,1)","v":"N/A"},{"$f":"_xlfn.XLOOKUP($E2,'Activity 10'!$B$17:$B$23,'Activity 10'!J$17:J$23,\"N/A\",0,1)","v":"N/A"},{"$f":"_xlfn.XLOOKUP($E2,'Activity 10'!$B$17:$B$23,'Activity 10'!K$17:K$23,\"N/A\",0,1)","v":"N/A"},{"$f":"_xlfn.XLOOKUP($E2,'Activity 10'!$B$17:$B$23,'Activity 10'!L$17:L$23,\"N/A\",0,1)","v":"N/A"},{"$f":"_xlfn.XLOOKUP($E2,'Activity 10'!$B$17:$B$23,'Activity 10'!N$17:N$23,\"N/A\",0,1)","v":"N/A"},{"$f":"_xlfn.XLOOKUP($E2,'Competitive Activity 1'!B7:B13,'Competitive Activity 1'!A7:A13,\"No\",0,1)","v":"No"},{"$f":"_xlfn.XLOOKUP($E2,'Competitive Activity 1'!$B$7:$B$13,'Competitive Activity 1'!C$7:C$13,\"N/A\",0,1)","v":"N/A"},{"$f":"_xlfn.XLOOKUP($E2,'Competitive Activity 1'!$B$7:$B$13,'Competitive Activity 1'!D$7:D$13,\"N/A\",0,1)","v":"N/A"},{"$f":"_xlfn.XLOOKUP($E2,'Competitive Activity 1'!$B$7:$B$13,'Competitive Activity 1'!E$7:E$13,\"N/A\",0,1)","v":"N/A"},{"$f":"_xlfn.XLOOKUP($E2,'Competitive Activity 1'!$B$7:$B$13,'Competitive Activity 1'!F$7:F$13,\"N/A\",0,1)","v":"N/A"},{"$f":"_xlfn.XLOOKUP($E2,'Competitive Activity 1'!$B$7:$B$13,'Competitive Activity 1'!G$7:G$13,\"N/A\",0,1)","v":"N/A"},{"$f":"_xlfn.XLOOKUP($E2,'Competitive Activity 1'!$B$7:$B$13,'Competitive Activity 1'!H$7:H$13,\"N/A\",0,1)","v":"N/A"},{"$f":"_xlfn.XLOOKUP($E2,'Competitive Activity 1'!$B$7:$B$13,'Competitive Activity 1'!I$7:I$13,\"N/A\",0,1)","v":"N/A"},{"$f":"_xlfn.XLOOKUP($E2,'Competitive Activity 1'!$B$7:$B$13,'Competitive Activity 1'!J$7:J$13,\"N/A\",0,1)","v":"N/A"},{"$f":"_xlfn.XLOOKUP($E2,'Competitive Activity 1'!$B$7:$B$13,'Competitive Activity 1'!K$7:K$13,\"N/A\",0,1)","v":"N/A"},{"$f":"_xlfn.XLOOKUP($E2,'Competitive Activity 1'!$B$7:$B$13,'Competitive Activity 1'!L$7:L$13,\"N/A\",0,1)","v":"N/A"},{"$f":"_xlfn.XLOOKUP($E2,'Competitive Activity 1'!$B$7:$B$13,'Competitive Activity 1'!M$7:M$13,\"N/A\",0,1)","v":"N/A"},{"$f":"_xlfn.XLOOKUP($E2,'Competitive Activity 1'!$B$7:$B$13,'Competitive Activity 1'!N$7:N$13,\"N/A\",0,1)","v":"N/A"},{"$f":"_xlfn.XLOOKUP($E2,'Competitive Activity 1'!$B$7:$B$13,'Competitive Activity 1'!O$7:O$13,\"N/A\",0,1)","v":"N/A"},{"$f":"_xlfn.XLOOKUP($E2,'Competitive Activity 1'!$B$7:$B$13,'Competitive Activity 1'!P$7:P$13,\"N/A\",0,1)","v":"N/A"},{"$f":"_xlfn.XLOOKUP($E2,'Competitive Activity 1'!$B$17:$B$23,'Competitive Activity 1'!C$17:C$23,\"N/A\",0,1)","v":"N/A"},{"$f":"_xlfn.XLOOKUP($E2,'Competitive Activity 1'!$B$17:$B$23,'Competitive Activity 1'!D$17:D$23,\"N/A\",0,1)","v":"N/A"},{"$f":"_xlfn.XLOOKUP($E2,'Competitive Activity 1'!$B$17:$B$23,'Competitive Activity 1'!E$17:E$23,\"N/A\",0,1)","v":"N/A"},{"$f":"_xlfn.XLOOKUP($E2,'Competitive Activity 1'!$B$17:$B$23,'Competitive Activity 1'!F$17:F$23,\"N/A\",0,1)","v":"N/A"},{"$f":"_xlfn.XLOOKUP($E2,'Competitive Activity 1'!$B$17:$B$23,'Competitive Activity 1'!G$17:G$23,\"N/A\",0,1)","v":"N/A"},{"$f":"_xlfn.XLOOKUP($E2,'Competitive Activity 1'!$B$17:$B$23,'Competitive Activity 1'!H$17:H$23,\"N/A\",0,1)","v":"N/A"},{"$f":"_xlfn.XLOOKUP($E2,'Competitive Activity 1'!$B$17:$B$23,'Competitive Activity 1'!I$17:I$23,\"N/A\",0,1)","v":"N/A"},{"$f":"_xlfn.XLOOKUP($E2,'Competitive Activity 1'!$B$17:$B$23,'Competitive Activity 1'!J$17:J$23,\"N/A\",0,1)","v":"N/A"},{"$f":"_xlfn.XLOOKUP($E2,'Competitive Activity 1'!$B$17:$B$23,'Competitive Activity 1'!K$17:K$23,\"N/A\",0,1)","v":"N/A"},{"$f":"_xlfn.XLOOKUP($E2,'Competitive Activity 1'!$B$17:$B$23,'Competitive Activity 1'!M$17:M$23,\"N/A\",0,1)","v":"N/A"},{"$f":"_xlfn.XLOOKUP($E2,'Competitive Activity 1'!$B$17:$B$23,'Competitive Activity 1'!N$17:N$23,\"N/A\",0,1)","v":"N/A"},{"$f":"_xlfn.XLOOKUP($E2,'Competitive Activity 1'!$B$17:$B$23,'Competitive Activity 1'!P$17:P$23,\"N/A\",0,1)","v":"N/A"},{"$f":"_xlfn.XLOOKUP($E2,'Competitive Activity 2'!$B$7:$B$13,'Competitive Activity 2'!$A$7:$A$13,\"No\",0,1)","v":"No"},{"$f":"_xlfn.XLOOKUP($E2,'Competitive Activity 2'!$B$7:$B$13,'Competitive Activity 2'!C$7:C$13,\"N/A\",0,1)","v":"N/A"},{"$f":"_xlfn.XLOOKUP($E2,'Competitive Activity 2'!$B$7:$B$13,'Competitive Activity 2'!D$7:D$13,\"N/A\",0,1)","v":"N/A"},{"$f":"_xlfn.XLOOKUP($E2,'Competitive Activity 2'!$B$7:$B$13,'Competitive Activity 2'!E$7:E$13,\"N/A\",0,1)","v":"N/A"},{"$f":"_xlfn.XLOOKUP($E2,'Competitive Activity 2'!$B$7:$B$13,'Competitive Activity 2'!F$7:F$13,\"N/A\",0,1)","v":"N/A"},{"$f":"_xlfn.XLOOKUP($E2,'Competitive Activity 2'!$B$7:$B$13,'Competitive Activity 2'!G$7:G$13,\"N/A\",0,1)","v":"N/A"},{"$f":"_xlfn.XLOOKUP($E2,'Competitive Activity 2'!$B$7:$B$13,'Competitive Activity 2'!H$7:H$13,\"N/A\",0,1)","v":"N/A"},{"$f":"_xlfn.XLOOKUP($E2,'Competitive Activity 2'!$B$7:$B$13,'Competitive Activity 2'!I$7:I$13,\"N/A\",0,1)","v":"N/A"},{"$f":"_xlfn.XLOOKUP($E2,'Competitive Activity 2'!$B$7:$B$13,'Competitive Activity 2'!J$7:J$13,\"N/A\",0,1)","v":"N/A"},{"$f":"_xlfn.XLOOKUP($E2,'Competitive Activity 2'!$B$7:$B$13,'Competitive Activity 2'!K$7:K$13,\"N/A\",0,1)","v":"N/A"},{"$f":"_xlfn.XLOOKUP($E2,'Competitive Activity 2'!$B$7:$B$13,'Competitive Activity 2'!L$7:L$13,\"N/A\",0,1)","v":"N/A"},{"$f":"_xlfn.XLOOKUP($E2,'Competitive Activity 2'!$B$17:$B$23,'Competitive Activity 2'!C$17:C$23,\"N/A\",0,1)","v":"N/A"},{"$f":"_xlfn.XLOOKUP($E2,'Competitive Activity 2'!$B$17:$B$23,'Competitive Activity 2'!D$17:D$23,\"N/A\",0,1)","v":"N/A"},{"$f":"_xlfn.XLOOKUP($E2,'Competitive Activity 2'!$B$17:$B$23,'Competitive Activity 2'!E$17:E$23,\"N/A\",0,1)","v":"N/A"},{"$f":"_xlfn.XLOOKUP($E2,'Competitive Activity 2'!$B$17:$B$23,'Competitive Activity 2'!F$17:F$23,\"N/A\",0,1)","v":"N/A"},{"$f":"_xlfn.XLOOKUP($E2,'Competitive Activity 2'!$B$17:$B$23,'Competitive Activity 2'!G$17:G$23,\"N/A\",0,1)","v":"N/A"},{"$f":"_xlfn.XLOOKUP($E2,'Competitive Activity 2'!$B$17:$B$23,'Competitive Activity 2'!H$17:H$23,\"N/A\",0,1)","v":"N/A"},{"$f":"_xlfn.XLOOKUP($E2,'Competitive Activity 2'!$B$17:$B$23,'Competitive Activity 2'!I$17:I$23,\"N/A\",0,1)","v":"N/A"},{"$f":"_xlfn.XLOOKUP($E2,'Competitive Activity 2'!$B$17:$B$23,'Competitive Activity 2'!J$17:J$23,\"N/A\",0,1)","v":"N/A"},{"$f":"_xlfn.XLOOKUP($E2,'Competitive Activity 2'!$B$17:$B$23,'Competitive Activity 2'!K$17:K$23,\"N/A\",0,1)","v":"N/A"},{"$f":"_xlfn.XLOOKUP($E2,'Competitive Activity 2'!$B$17:$B$23,'Competitive Activity 2'!L$17:L$23,\"N/A\",0,1)","v":"N/A"},{"$f":"_xlfn.XLOOKUP($E2,'Competitive Activity 2'!$B$17:$B$23,'Competitive Activity 2'!M$17:M$23,\"N/A\",0,1)","v":"N/A"},{"$f":"_xlfn.XLOOKUP($E2,'Competitive Activity 2'!$B$27:$B$33,'Competitive Activity 2'!C$27:C$33,\"N/A\",0,1)","v":"N/A"},{"$f":"_xlfn.XLOOKUP($E2,'Competitive Activity 2'!$B$27:$B$33,'Competitive Activity 2'!D$27:D$33,\"N/A\",0,1)","v":"N/A"},{"$f":"_xlfn.XLOOKUP($E2,'Competitive Activity 2'!$B$27:$B$33,'Competitive Activity 2'!E$27:E$33,\"N/A\",0,1)","v":"N/A"},{"$f":"_xlfn.XLOOKUP($E2,'Competitive Activity 2'!$B$27:$B$33,'Competitive Activity 2'!F$27:F$33,\"N/A\",0,1)","v":"N/A"},{"$f":"_xlfn.XLOOKUP($E2,'Competitive Activity 2'!$B$27:$B$33,'Competitive Activity 2'!G$27:G$33,\"N/A\",0,1)","v":"N/A"},{"$f":"_xlfn.XLOOKUP($E2,'Competitive Activity 2'!$B$27:$B$33,'Competitive Activity 2'!H$27:H$33,\"N/A\",0,1)","v":"N/A"},{"$f":"_xlfn.XLOOKUP($E2,'Competitive Activity 2'!$B$27:$B$33,'Competitive Activity 2'!I$27:I$33,\"N/A\",0,1)","v":"N/A"},{"$f":"_xlfn.XLOOKUP($E2,'Competitive Activity 2'!$B$27:$B$33,'Competitive Activity 2'!J$27:J$33,\"N/A\",0,1)","v":"N/A"},{"$f":"_xlfn.XLOOKUP($E2,'Competitive Activity 2'!$B$27:$B$33,'Competitive Activity 2'!L$27:L$33,\"N/A\",0,1)","v":"N/A"}]
[{"$f":"'1-Cover Sheet'!$C$8","v":0},{"$f":"'1-Cover Sheet'!$F$8","v":"Select One"},{"$f":"'Summary Sheet'!$D$8","v":0},{"$f":"'Summary Sheet'!$D$10","v":0},{"$f":"'3-Financial Summary'!A13","v":0},{"$f":"'3-Financial Summary'!B13","v":0},{"$f":"'3-Financial Summary'!C13","v":0},{"$f":"'3-Financial Summary'!D13","v":0},{"$f":"'3-Financial Summary'!E13","v":0},{"$f":"VLOOKUP(E3,'Summary Sheet'!$A$23:$L$34,11,FALSE)","v":"N/A"},{"$f":"VLOOKUP(E3,'Summary Sheet'!$A$23:$L$34,12,FALSE)","v":"N/A"},{"$f":"'3-Financial Summary'!F13","v":0},{"$f":"'3-Financial Summary'!G13","v":"00:00:00"},{"$f":"'3-Financial Summary'!H13","v":0},{"$f":"_xlfn.XLOOKUP($E3,'Activity 1'!$B$7:$B$13,'Activity 1'!$A$7:$A$13,\"No\",0,1)","v":"No"},{"$f":"_xlfn.XLOOKUP($E3,'Activity 1'!$B$7:$B$13,'Activity 1'!C8:C14,\"N/A\",0,1)","v":"N/A"},{"$f":"_xlfn.XLOOKUP($E3,'Activity 1'!$B$7:$B$13,'Activity 1'!D8:D14,\"N/A\",0,1)","v":"N/A"},{"$f":"_xlfn.XLOOKUP($E3,'Activity 1'!$B$7:$B$13,'Activity 1'!E$7:E$13,\"N/A\",0,1)","v":"N/A"},{"$f":"_xlfn.XLOOKUP($E3,'Activity 1'!$B$7:$B$13,'Activity 1'!F$7:F$13,\"N/A\",0,1)","v":"N/A"},{"$f":"_xlfn.XLOOKUP($E3,'Activity 1'!$B$7:$B$13,'Activity 1'!G$7:G$13,\"N/A\",0,1)","v":"N/A"},{"$f":"_xlfn.XLOOKUP($E3,'Activity 1'!$B$7:$B$13,'Activity 1'!H$7:H$13,\"N/A\",0,1)","v":"N/A"},{"$f":"_xlfn.XLOOKUP($E3,'Activity 1'!$B$7:$B$13,'Activity 1'!I$7:I$13,\"N/A\",0,1)","v":"N/A"},{"$f":"_xlfn.XLOOKUP($E3,'Activity 1'!$B$7:$B$13,'Activity 1'!J$7:J$13,\"N/A\",0,1)","v":"N/A"},{"$f":"_xlfn.XLOOKUP($E3,'Activity 1'!$B$7:$B$13,'Activity 1'!K$7:K$13,\"N/A\",0,1)","v":"N/A"},{"$f":"_xlfn.XLOOKUP($E3,'Activity 1'!$B$7:$B$13,'Activity 1'!L$7:L$13,\"N/A\",0,1)","v":"N/A"},{"$f":"_xlfn.XLOOKUP($E3,'Activity 1'!$B$7:$B$13,'Activity 1'!M$7:M$13,\"N/A\",0,1)","v":"N/A"},{"$f":"_xlfn.XLOOKUP($E3,'Activity 1'!$B$7:$B$13,'Activity 1'!N$7:N$13,\"N/A\",0,1)","v":"N/A"},{"$f":"_xlfn.XLOOKUP($E3,'Activity 1'!$B$7:$B$13,'Activity 1'!O$7:O$13,\"N/A\",0,1)","v":"N/A"},{"$f":"_xlfn.XLOOKUP($E3,'Activity 1'!$B$7:$B$13,'Activity 1'!P$7:P$13,\"N/A\",0,1)","v":"N/A"},{"$f":"_xlfn.XLOOKUP($E3,'Activity 1'!$B$7:$B$13,'Activity 1'!Q$7:Q$13,\"N/A\",0,1)","v":"N/A"},{"$f":"_xlfn.XLOOKUP($E3,'Activity 1'!$B$17:$B$23,'Activity 1'!C$17:C$23,\"N/A\",0,1)","v":"N/A"},{"$f":"_xlfn.XLOOKUP($E3,'Activity 1'!$B$17:$B$23,'Activity 1'!D$17:D$23,\"N/A\",0,1)","v":"N/A"},{"$f":"_xlfn.XLOOKUP($E3,'Activity 1'!$B$17:$B$23,'Activity 1'!E$17:E$23,\"N/A\",0,1)","v":"N/A"},{"$f":"_xlfn.XLOOKUP($E3,'Activity 1'!$B$17:$B$23,'Activity 1'!F$17:F$23,\"N/A\",0,1)","v":"N/A"},{"$f":"_xlfn.XLOOKUP($E3,'Activity 1'!$B$17:$B$23,'Activity 1'!G$17:G$23,\"N/A\",0,1)","v":"N/A"},{"$f":"_xlfn.XLOOKUP($E3,'Activity 1'!$B$17:$B$23,'Activity 1'!H$17:H$23,\"N/A\",0,1)","v":"N/A"},{"$f":"_xlfn.XLOOKUP($E3,'Activity 1'!$B$17:$B$23,'Activity 1'!I$17:I$23,\"N/A\",0,1)","v":"N/A"},{"$f":"_xlfn.XLOOKUP($E3,'Activity 1'!$B$17:$B$23,'Activity 1'!J$17:J$23,\"N/A\",0,1)","v":"N/A"},{"$f":"_xlfn.XLOOKUP($E3,'Activity 1'!$B$17:$B$23,'Activity 1'!K$17:K$23,\"N/A\",0,1)","v":"N/A"},{"$f":"_xlfn.XLOOKUP($E3,'Activity 1'!$B$17:$B$23,'Activity 1'!L$17:L$23,\"N/A\",0,1)","v":"N/A"},{"$f":"_xlfn.XLOOKUP($E3,'Activity 1'!$B$17:$B$23,'Activity 1'!M$17:M$23,\"N/A\",0,1)","v":"N/A"},{"$f":"_xlfn.XLOOKUP($E3,'Activity 1'!$B$17:$B$23,'Activity 1'!O$17:O$23,\"N/A\",0,1)","v":"N/A"},{"$f":"_xlfn.XLOOKUP($E3,'Activity 1'!$B$17:$B$23,'Activity 1'!Q$17:Q$23,\"N/A\",0,1)","v":"N/A"},{"$f":"_xlfn.XLOOKUP($E3,'Activity 2'!$B$7:$B$13,'Activity 2'!A$7:A$13,\"No\",0)","v":"No"},{"$f":"_xlfn.XLOOKUP($E3,'Activity 2'!$B$7:$B$13,'Activity 2'!C$7:C$13,\"N/A\",0,1)","v":"N/A"},{"$f":"_xlfn.XLOOKUP($E3,'Activity 2'!$B$7:$B$13,'Activity 2'!D$7:D$13,\"N/A\",0,1)","v":"N/A"},{"$f":"_xlfn.XLOOKUP($E3,'Activity 2'!$B$7:$B$13,'Activity 2'!E$7:E$13,\"N/A\",0,1)","v":"N/A"},{"$f":"_xlfn.XLOOKUP($E3,'Activity 2'!$B$7:$B$13,'Activity 2'!F$7:F$13,\"N/A\",0,1)","v":"N/A"},{"$f":"_xlfn.XLOOKUP($E3,'Activity 2'!$B$7:$B$13,'Activity 2'!G$7:G$13,\"N/A\",0,1)","v":"N/A"},{"$f":"_xlfn.XLOOKUP($E3,'Activity 2'!$B$7:$B$13,'Activity 2'!H$7:H$13,\"N/A\",0,1)","v":"N/A"},{"$f":"_xlfn.XLOOKUP($E3,'Activity 2'!$B$7:$B$13,'Activity 2'!I$7:I$13,\"N/A\",0,1)","v":"N/A"},{"$f":"_xlfn.XLOOKUP($E3,'Activity 2'!$B$7:$B$13,'Activity 2'!J$7:J$13,\"N/A\",0,1)","v":"N/A"},{"$f":"_xlfn.XLOOKUP($E3,'Activity 2'!$B$7:$B$13,'Activity 2'!K$7:K$13,\"N/A\",0,1)","v":"N/A"},{"$f":"_xlfn.XLOOKUP($E3,'Activity 2'!$B$7:$B$13,'Activity 2'!L$7:L$13,\"N/A\",0,1)","v":"N/A"},{"$f":"_xlfn.XLOOKUP($E3,'Activity 2'!$B$7:$B$13,'Activity 2'!M$7:M$13,\"N/A\",0,1)","v":"N/A"},{"$f":"_xlfn.XLOOKUP($E3,'Activity 2'!$B$7:$B$13,'Activity 2'!N$7:N$13,\"N/A\",0,1)","v":"N/A"},{"$f":"_xlfn.XLOOKUP($E3,'Activity 2'!$B$7:$B$13,'Activity 2'!O$7:O$13,\"N/A\",0,1)","v":"N/A"},{"$f":"_xlfn.XLOOKUP($E3,'Activity 2'!$B$7:$B$13,'Activity 2'!P$7:P$13,\"N/A\",0,1)","v":"N/A"},{"$f":"_xlfn.XLOOKUP($E3,'Activity 2'!$B$7:$B$13,'Activity 2'!Q$7:Q$13,\"N/A\",0,1)","v":"N/A"},{"$f":"_xlfn.XLOOKUP($E3,'Activity 2'!$B$17:$B$23,'Activity 2'!C$17:C$23,\"N/A\",0,1)","v":"N/A"},{"$f":"_xlfn.XLOOKUP($E3,'Activity 2'!$B$17:$B$23,'Activity 2'!D$17:D$23,\"N/A\",0,1)","v":"N/A"},{"$f":"_xlfn.XLOOKUP($E3,'Activity 2'!$B$17:$B$23,'Activity 2'!E$17:E$23,\"N/A\",0,1)","v":"N/A"},{"$f":"_xlfn.XLOOKUP($E3,'Activity 2'!$B$17:$B$23,'Activity 2'!F$17:F$23,\"N/A\",0,1)","v":"N/A"},{"$f":"_xlfn.XLOOKUP($E3,'Activity 2'!$B$17:$B$23,'Activity 2'!G$17:G$23,\"N/A\",0,1)","v":"N/A"},{"$f":"_xlfn.XLOOKUP($E3,'Activity 2'!$B$17:$B$23,'Activity 2'!H$17:H$23,\"N/A\",0,1)","v":"N/A"},{"$f":"_xlfn.XLOOKUP($E3,'Activity 2'!$B$17:$B$23,'Activity 2'!I$17:I$23,\"N/A\",0,1)","v":"N/A"},{"$f":"_xlfn.XLOOKUP($E3,'Activity 2'!$B$17:$B$23,'Activity 2'!J$17:J$23,\"N/A\",0,1)","v":"N/A"},{"$f":"_xlfn.XLOOKUP($E3,'Activity 2'!$B$17:$B$23,'Activity 2'!K$17:K$23,\"N/A\",0,1)","v":"N/A"},{"$f":"_xlfn.XLOOKUP($E3,'Activity 2'!$B$17:$B$23,'Activity 2'!L$17:L$23,\"N/A\",0,1)","v":"N/A"},{"$f":"_xlfn.XLOOKUP($E3,'Activity 2'!$B$17:$B$23,'Activity 2'!M$17:M$23,\"N/A\",0,1)","v":"N/A"},{"$f":"_xlfn.XLOOKUP($E3,'Activity 2'!$B$17:$B$23,'Activity 2'!O$17:O$23,\"N/A\",0,1)","v":"N/A"},{"$f":"_xlfn.XLOOKUP($E3,'Activity 2'!$B$17:$B$23,'Activity 2'!Q$17:Q$23,\"N/A\",0,1)","v":"N/A"},{"$f":"_xlfn.XLOOKUP($E3,'Activity 3'!$B$8:$B$14,'Activity 3'!A$8:A$14,\"No\",0,1)","v":"No"},{"$f":"_xlfn.XLOOKUP($E3,'Activity 3'!$B$8:$B$14,'Activity 3'!C$8:C$14,\"N/A\",0,1)","v":"N/A"},{"$f":"_xlfn.XLOOKUP($E3,'Activity 3'!$B$8:$B$14,'Activity 3'!D$8:D$14,\"N/A\",0,1)","v":"N/A"},{"$f":"_xlfn.XLOOKUP($E3,'Activity 3'!$B$8:$B$14,'Activity 3'!E$8:E$14,\"N/A\",0,1)","v":"N/A"},{"$f":"_xlfn.XLOOKUP($E3,'Activity 3'!$B$8:$B$14,'Activity 3'!F$8:F$14,\"N/A\",0,1)","v":"N/A"},{"$f":"_xlfn.XLOOKUP($E3,'Activity 3'!$B$8:$B$14,'Activity 3'!G$8:G$14,\"N/A\",0,1)","v":"N/A"},{"$f":"_xlfn.XLOOKUP($E3,'Activity 4'!$B$8:$B$14,'Activity 4'!A9:A15,\"No\",0,1)","v":"No"},{"$f":"_xlfn.XLOOKUP($E3,'Activity 4'!$B$8:$B$14,'Activity 4'!C$8:C$14,\"N/A\",0,1)","v":"N/A"},{"$f":"_xlfn.XLOOKUP($E3,'Activity 4'!$B$8:$B$14,'Activity 4'!D$8:D$14,\"N/A\",0,1)","v":"N/A"},{"$f":"_xlfn.XLOOKUP($E3,'Activity 4'!$B$8:$B$14,'Activity 4'!G$8:G$14,\"N/A\",0,1)","v":"N/A"},{"$f":"_xlfn.XLOOKUP($E3,'Activity 5'!$B$8:$B$14,'Activity 5'!$A$8:$A$14,\"No\",0,1)","v":"No"},{"$f":"_xlfn.XLOOKUP($E3,'Activity 5'!$B$8:$B$14,'Activity 5'!C$8:C$14,\"N/A\",0,1)","v":"N/A"},{"$f":"_xlfn.XLOOKUP($E3,'Activity 5'!$B$8:$B$14,'Activity 5'!D$8:D$14,\"N/A\",0,1)","v":"N/A"},{"$f":"_xlfn.XLOOKUP($E3,'Activity 5'!$B$8:$B$14,'Activity 5'!G$8:G$14,\"N/A\",0,1)","v":"N/A"},{"$f":"_xlfn.XLOOKUP($E3,'Activity 5'!$B$8:$B$14,'Activity 5'!H$8:H$14,\"N/A\",0,1)","v":"N/A"},{"$f":"_xlfn.XLOOKUP($E3,'Activity 5'!$B$8:$B$14,'Activity 5'!I$8:I$14,\"N/A\",0,1)","v":"N/A"},{"$f":"_xlfn.XLOOKUP($E3,'Activity 5'!$B$8:$B$14,'Activity 5'!J$8:J$14,\"N/A\",0,1)","v":"N/A"},{"$f":"_xlfn.XLOOKUP($E3,'Activity 6'!$B$7:$B$13,'Activity 6'!A$7:A$13,\"No\",0,1)","v":"No"},{"$f":"_xlfn.XLOOKUP($E3,'Activity 6'!$B$7:$B$13,'Activity 6'!C$7:C$13,\"N/A\",0,1)","v":"N/A"},{"$f":"_xlfn.XLOOKUP($E3,'Activity 6'!$B$7:$B$13,'Activity 6'!D$7:D$13,\"N/A\",0,1)","v":"N/A"},{"$f":"_xlfn.XLOOKUP($E3,'Activity 6'!$B$7:$B$13,'Activity 6'!E$7:E$13,\"N/A\",0,1)","v":"N/A"},{"$f":"_xlfn.XLOOKUP($E3,'Activity 6'!$B$7:$B$13,'Activity 6'!F$7:F$13,\"N/A\",0,1)","v":"N/A"},{"$f":"_xlfn.XLOOKUP($E3,'Activity 6'!$B$7:$B$13,'Activity 6'!G$7:G$13,\"N/A\",0,1)","v":"N/A"},{"$f":"_xlfn.XLOOKUP($E3,'Activity 6'!$B$7:$B$13,'Activity 6'!H$7:H$13,\"N/A\",0,1)","v":"N/A"},{"$f":"_xlfn.XLOOKUP($E3,'Activity 6'!$B$7:$B$13,'Activity 6'!I$7:I$13,\"N/A\",0,1)","v":"N/A"},{"$f":"_xlfn.XLOOKUP($E3,'Activity 6'!$B$7:$B$13,'Activity 6'!J$7:J$13,\"N/A\",0,1)","v":"N/A"},{"$f":"_xlfn.XLOOKUP($E3,'Activity 6'!$B$7:$B$13,'Activity 6'!K$7:K$13,\"N/A\",0,1)","v":"N/A"},{"$f":"_xlfn.XLOOKUP($E3,'Activity 6'!$B$7:$B$13,'Activity 6'!L$7:L$13,\"N/A\",0,1)","v":"N/A"},{"$f":"_xlfn.XLOOKUP($E3,'Activity 6'!$B$7:$B$13,'Activity 6'!M$7:M$13,\"N/A\",0,1)","v":"N/A"},{"$f":"IF(ISNUMBER(SEARCH(\"6\",H3)),COUNTA('Activity 6'!$D$17:$E$20),\"N/A\")","v":"N/A"},{"$f":"IF(ISNUMBER(SEARCH(6,H3)),SUM('Activity 6'!G18:G21),\"N/A\")","v":"N/A"},{"$f":"_xlfn.XLOOKUP($E3,'Activity 6'!$B$23:$B$29,'Activity 6'!C$23:C$29,\"N/A\",0,1)","v":"N/A"},{"$f":"_xlfn.XLOOKUP($E3,'Activity 6'!$B$23:$B$29,'Activity 6'!D$23:D$29,\"N/A\",0,1)","v":"N/A"},{"$f":"_xlfn.XLOOKUP($E3,'Activity 6'!$B$23:$B$29,'Activity 6'!E$23:E$29,\"N/A\",0,1)","v":"N/A"},{"$f":"_xlfn.XLOOKUP($E3,'Activity 6'!$B$23:$B$29,'Activity 6'!F$23:F$29,\"N/A\",0,1)","v":"N/A"},{"$f":"_xlfn.XLOOKUP($E3,'Activity 6'!$B$23:$B$29,'Activity 6'!G$23:G$29,\"N/A\",0,1)","v":"N/A"},{"$f":"_xlfn.XLOOKUP($E3,'Activity 6'!$B$23:$B$29,'Activity 6'!H$23:H$29,\"N/A\",0,1)","v":"N/A"},{"$f":"_xlfn.XLOOKUP($E3,'Activity 6'!$B$23:$B$29,'Activity 6'!I$23:I$29,\"N/A\",0,1)","v":"N/A"},{"$f":"_xlfn.XLOOKUP($E3,'Activity 6'!$B$23:$B$29,'Activity 6'!J$23:J$29,\"N/A\",0,1)","v":"N/A"},{"$f":"_xlfn.XLOOKUP($E3,'Activity 6'!$B$23:$B$29,'Activity 6'!K$23:K$29,\"N/A\",0,1)","v":"N/A"},{"$f":"_xlfn.XLOOKUP($E3,'Activity 6'!$B$23:$B$29,'Activity 6'!L$23:L$29,\"N/A\",0,1)","v":"N/A"},{"$f":"_xlfn.XLOOKUP($E3,'Activity 6'!$B$23:$B$29,'Activity 6'!M$23:M$29,\"N/A\",0,1)","v":"N/A"},{"$f":"_xlfn.XLOOKUP($E3,'Activity 6'!$B$23:$B$29,'Activity 6'!N$23:N$29,\"N/A\",0,1)","v":"N/A"},{"$f":"_xlfn.XLOOKUP($E3,'Activity 6'!$B$33:$B$38,'Activity 6'!C$33:C$38,\"N/A\",0,1)","v":"N/A"},{"$f":"_xlfn.XLOOKUP($E3,'Activity 6'!$B$33:$B$38,'Activity 6'!D$33:D$38,\"N/A\",0,1)","v":"N/A"},{"$f":"_xlfn.XLOOKUP($E3,'Activity 6'!$B$33:$B$38,'Activity 6'!E$33:E$38,\"N/A\",0,1)","v":"N/A"},{"$f":"_xlfn.XLOOKUP($E3,'Activity 6'!$B$33:$B$38,'Activity 6'!I$33:I$38,\"N/A\",0,1)","v":"N/A"},{"$f":"_xlfn.XLOOKUP($E3,'Activity 6'!$B$33:$B$38,'Activity 6'!G$33:G$38,\"N/A\",0,1)","v":"N/A"},{"$f":"_xlfn.XLOOKUP($E3,'Activity 6'!$B$33:$B$38,'Activity 6'!H$33:H$38,\"N/A\",0,1)","v":"N/A"},{"$f":"_xlfn.XLOOKUP($E3,'Activity 6'!$B$33:$B$38,'Activity 6'!I$33:I$38,\"N/A\",0,1)","v":"N/A"},{"$f":"_xlfn.XLOOKUP($E3,'Activity 6'!$B$33:$B$38,'Activity 6'!J$33:J$38,\"N/A\",0,1)","v":"N/A"},{"$f":"_xlfn.XLOOKUP($E3,'Activity 6'!$B$33:$B$38,'Activity 6'!K$33:K$38,\"N/A\",0,1)","v":"N/A"},{"$f":"_xlfn.XLOOKUP($E3,'Activity 6'!$B$33:$B$38,'Activity 6'!M$33:M$38,\"N/A\",0,1)","v":"N/A"},{"$f":"_xlfn.XLOOKUP($E3,'Activity 7'!$B$7:$B$13,'Activity 7'!$A$7:$A$13,\"No\",0,1)","v":"No"},{"$f":"_xlfn.XLOOKUP($E3,'Activity 7'!$B$7:$B$13,'Activity 7'!C$7:C$13,\"N/A\",0,1)","v":"N/A"},{"$f":"_xlfn.XLOOKUP($E3,'Activity 7'!$B$7:$B$13,'Activity 7'!D$7:D$13,\"N/A\",0,1)","v":"N/A"},{"$f":"_xlfn.XLOOKUP($E3,'Activity 7'!$B$7:$B$13,'Activity 7'!E$7:E$13,\"N/A\",0,1)","v":"N/A"},{"$f":"_xlfn.XLOOKUP($E3,'Activity 7'!$B$7:$B$13,'Activity 7'!F$7:F$13,\"N/A\",0,1)","v":"N/A"},{"$f":"_xlfn.XLOOKUP($E3,'Activity 7'!$B$7:$B$13,'Activity 7'!G$7:G$13,\"N/A\",0,1)","v":"N/A"},{"$f":"_xlfn.XLOOKUP($E3,'Activity 7'!$B$7:$B$13,'Activity 7'!H$7:H$13,\"N/A\",0,1)","v":"N/A"},{"$f":"_xlfn.XLOOKUP($E3,'Activity 7'!$B$7:$B$13,'Activity 7'!I$7:I$13,\"N/A\",0,1)","v":"N/A"},{"$f":"_xlfn.XLOOKUP($E3,'Activity 7'!$B$7:$B$13,'Activity 7'!J$7:J$13,\"N/A\",0,1)","v":"N/A"},{"$f":"_xlfn.XLOOKUP($E3,'Activity 7'!$B$7:$B$13,'Activity 7'!K$7:K$13,\"N/A\",0,1)","v":"N/A"},{"$f":"_xlfn.XLOOKUP($E3,'Activity 7'!$B$7:$B$13,'Activity 7'!L$7:L$13,\"N/A\",0,1)","v":"N/A"},{"$f":"_xlfn.XLOOKUP($E3,'Activity 7'!$B$7:$B$13,'Activity 7'!M$7:M$13,\"N/A\",0,1)","v":"N/A"},{"$f":"_xlfn.XLOOKUP($E3,'Activity 7'!$B$17:$B$23,'Activity 7'!C$17:C$23,\"N/A\",0,1)","v":"N/A"},{"$f":"_xlfn.XLOOKUP($E3,'Activity 7'!$B$17:$B$23,'Activity 7'!D$17:D$23,\"N/A\",0,1)","v":"N/A"},{"$f":"_xlfn.XLOOKUP($E3,'Activity 7'!$B$17:$B$23,'Activity 7'!E$17:E$23,\"N/A\",0,1)","v":"N/A"},{"$f":"_xlfn.XLOOKUP($E3,'Activity 7'!$B$17:$B$23,'Activity 7'!F$17:F$23,\"N/A\",0,1)","v":"N/A"},{"$f":"_xlfn.XLOOKUP($E3,'Activity 7'!$B$17:$B$23,'Activity 7'!G$17:G$23,\"N/A\",0,1)","v":"N/A"},{"$f":"_xlfn.XLOOKUP($E3,'Activity 7'!$B$17:$B$23,'Activity 7'!H$17:H$23,\"N/A\",0,1)","v":"N/A"},{"$f":"_xlfn.XLOOKUP($E3,'Activity 7'!$B$17:$B$23,'Activity 7'!I$17:I$23,\"N/A\",0,1)","v":"N/A"},{"$f":"_xlfn.XLOOKUP($E3,'Activity 7'!$B$17:$B$23,'Activity 7'!J$17:J$23,\"N/A\",0,1)","v":"N/A"},{"$f":"_xlfn.XLOOKUP($E3,'Activity 7'!$B$17:$B$23,'Activity 7'!L$17:L$23,\"N/A\",0,1)","v":"N/A"},{"$f":"_xlfn.XLOOKUP($E3,'Activity 8'!$B$7:$B$13,'Activity 8'!A$7:A$13,\"No\",0,1)","v":"No"},{"$f":"_xlfn.XLOOKUP($E3,'Activity 8'!$B$7:$B$13,'Activity 8'!C$7:C$13,\"N/A\",0,1)","v":"N/A"},{"$f":"_xlfn.XLOOKUP($E3,'Activity 8'!$B$7:$B$13,'Activity 8'!D$7:D$13,\"N/A\",0,1)","v":"N/A"},{"$f":"_xlfn.XLOOKUP($E3,'Activity 8'!$B$7:$B$13,'Activity 8'!E$7:E$13,\"N/A\",0,1)","v":"N/A"},{"$f":"_xlfn.XLOOKUP($E3,'Activity 8'!$B$7:$B$13,'Activity 8'!F$7:F$13,\"N/A\",0,1)","v":"N/A"},{"$f":"_xlfn.XLOOKUP($E3,'Activity 8'!$B$7:$B$13,'Activity 8'!G$7:G$13,\"N/A\",0,1)","v":"N/A"},{"$f":"_xlfn.XLOOKUP($E3,'Activity 8'!$B$7:$B$13,'Activity 8'!H$7:H$13,\"N/A\",0,1)","v":"N/A"},{"$f":"_xlfn.XLOOKUP($E3,'Activity 8'!$B$7:$B$13,'Activity 8'!I$7:I$13,\"N/A\",0,1)","v":"N/A"},{"$f":"_xlfn.XLOOKUP($E3,'Activity 8'!$B$7:$B$13,'Activity 8'!J$7:J$13,\"N/A\",0,1)","v":"N/A"},{"$f":"_xlfn.XLOOKUP($E3,'Activity 8'!$B$7:$B$13,'Activity 8'!K$7:K$13,\"N/A\",0,1)","v":"N/A"},{"$f":"_xlfn.XLOOKUP($E3,'Activity 8'!$B$7:$B$13,'Activity 8'!L$7:L$13,\"N/A\",0,1)","v":"N/A"},{"$f":"_xlfn.XLOOKUP($E3,'Activity 8'!$B$7:$B$13,'Activity 8'!M$7:M$13,\"N/A\",0,1)","v":"N/A"},{"$f":"_xlfn.XLOOKUP($E3,'Activity 8'!$B$7:$B$13,'Activity 8'!N$7:N$13,\"N/A\",0,1)","v":"N/A"},{"$f":"_xlfn.XLOOKUP($E3,'Activity 8'!$B$7:$B$13,'Activity 8'!O$7:O$13,\"N/A\",0,1)","v":"N/A"},{"$f":"_xlfn.XLOOKUP($E3,'Activity 8'!$B$7:$B$13,'Activity 8'!P$7:P$13,\"N/A\",0,1)","v":"N/A"},{"$f":"_xlfn.XLOOKUP($E3,'Activity 8'!$B$17:$B$23,'Activity 8'!C$17:C$23,\"N/A\",0,1)","v":"N/A"},{"$f":"_xlfn.XLOOKUP($E3,'Activity 8'!$B$17:$B$23,'Activity 8'!D$17:D$23,\"N/A\",0,1)","v":"N/A"},{"$f":"_xlfn.XLOOKUP($E3,'Activity 8'!$B$17:$B$23,'Activity 8'!E$17:E$23,\"N/A\",0,1)","v":"N/A"},{"$f":"_xlfn.XLOOKUP($E3,'Activity 8'!$B$17:$B$23,'Activity 8'!F$17:F$23,\"N/A\",0,1)","v":"N/A"},{"$f":"_xlfn.XLOOKUP($E3,'Activity 8'!$B$17:$B$23,'Activity 8'!G$17:G$23,\"N/A\",0,1)","v":"N/A"},{"$f":"_xlfn.XLOOKUP($E3,'Activity 8'!$B$17:$B$23,'Activity 8'!H$17:H$23,\"N/A\",0,1)","v":"N/A"},{"$f":"_xlfn.XLOOKUP($E3,'Activity 8'!$B$17:$B$23,'Activity 8'!I$17:I$23,\"N/A\",0,1)","v":"N/A"},{"$f":"_xlfn.XLOOKUP($E3,'Activity 8'!$B$17:$B$23,'Activity 8'!J$17:J$23,\"N/A\",0,1)","v":"N/A"},{"$f":"_xlfn.XLOOKUP($E3,'Activity 8'!$B$17:$B$23,'Activity 8'!K$17:K$23,\"N/A\",0,1)","v":"N/A"},{"$f":"_xlfn.XLOOKUP($E3,'Activity 8'!$B$17:$B$23,'Activity 8'!L$17:L$23,\"N/A\",0,1)","v":"N/A"},{"$f":"_xlfn.XLOOKUP($E3,'Activity 8'!$B$17:$B$23,'Activity 8'!M$17:M$23,\"N/A\",0,1)","v":"N/A"},{"$f":"_xlfn.XLOOKUP($E3,'Activity 8'!$B$17:$B$23,'Activity 8'!P$17:P$23,\"N/A\",0,1)","v":"N/A"},{"$f":"_xlfn.XLOOKUP(E3,'Activity 9'!B8:B14,'Activity 9'!A8:A14,\"No\",0,1)","v":"No"},{"$f":"_xlfn.XLOOKUP($E3,'Activity 9'!$B$7:$B$13,'Activity 9'!C$7:C$13,\"N/A\",0,1)","v":"N/A"},{"$f":"_xlfn.XLOOKUP($E3,'Activity 9'!$B$7:$B$13,'Activity 9'!D$7:D$13,\"N/A\",0,1)","v":"N/A"},{"$f":"_xlfn.XLOOKUP($E3,'Activity 9'!$B$7:$B$13,'Activity 9'!E$7:E$13,\"N/A\",0,1)","v":"N/A"},{"$f":"_xlfn.XLOOKUP($E3,'Activity 9'!$B$7:$B$13,'Activity 9'!H$7:H$13,\"N/A\",0,1)","v":"N/A"},{"$f":"_xlfn.XLOOKUP($E3,'Activity 9'!$B$7:$B$13,'Activity 9'!I$7:I$13,\"N/A\",0,1)","v":"N/A"},{"$f":"_xlfn.XLOOKUP($E3,'Activity 9'!$B$7:$B$13,'Activity 9'!J$7:J$13,\"N/A\",0,1)","v":"N/A"},{"$f":"_xlfn.XLOOKUP($E3,'Activity 9'!$B$7:$B$13,'Activity 9'!K$7:K$13,\"N/A\",0,1)","v":"N/A"},{"$f":"_xlfn.XLOOKUP($E3,'Activity 9'!$B$7:$B$13,'Activity 9'!L$7:L$13,\"N/A\",0,1)","v":"N/A"},{"$f":"_xlfn.XLOOKUP($E3,'Activity 9'!$B$7:$B$13,'Activity 9'!M$7:M$13,\"N/A\",0,1)","v":"N/A"},{"$f":"_xlfn.XLOOKUP($E3,'Activity 9'!$B$7:$B$13,'Activity 9'!N$7:N$13,\"N/A\",0,1)","v":"N/A"},{"$f":"_xlfn.XLOOKUP($E3,'Activity 9'!$B$7:$B$13,'Activity 9'!O$7:O$13,\"N/A\",0,1)","v":"N/A"},{"$f":"_xlfn.XLOOKUP($E3,'Activity 9'!$B$17:$B$23,'Activity 9'!C$17:C$23,\"N/A\",0,1)","v":"N/A"},{"$f":"_xlfn.XLOOKUP($E3,'Activity 9'!$B$17:$B$23,'Activity 9'!D$17:D$23,\"N/A\",0,1)","v":"N/A"},{"$f":"_xlfn.XLOOKUP($E3,'Activity 9'!$B$17:$B$23,'Activity 9'!E$17:E$23,\"N/A\",0,1)","v":"N/A"},{"$f":"_xlfn.XLOOKUP($E3,'Activity 9'!$B$17:$B$23,'Activity 9'!F$17:F$23,\"N/A\",0,1)","v":"N/A"},{"$f":"_xlfn.XLOOKUP($E3,'Activity 9'!$B$17:$B$23,'Activity 9'!G$17:G$23,\"N/A\",0,1)","v":"N/A"},{"$f":"_xlfn.XLOOKUP($E3,'Activity 9'!$B$17:$B$23,'Activity 9'!H$17:H$23,\"N/A\",0,1)","v":"N/A"},{"$f":"_xlfn.XLOOKUP($E3,'Activity 9'!$B$17:$B$23,'Activity 9'!I$17:I$23,\"N/A\",0,1)","v":"N/A"},{"$f":"_xlfn.XLOOKUP($E3,'Activity 9'!$B$17:$B$23,'Activity 9'!J$17:J$23,\"N/A\",0,1)","v":"N/A"},{"$f":"_xlfn.XLOOKUP($E3,'Activity 9'!$B$17:$B$23,'Activity 9'!L$17:L$23,\"N/A\",0,1)","v":"N/A"},{"$f":"_xlfn.XLOOKUP($E3,'Activity 9'!$B$17:$B$23,'Activity 9'!M$17:M$23,\"N/A\",0,1)","v":"N/A"},{"$f":"_xlfn.XLOOKUP($E3,'Activity 9'!$B$17:$B$23,'Activity 9'!O$17:O$23,\"N/A\",0,1)","v":"N/A"},{"$f":"_xlfn.XLOOKUP($E3,'Activity 10'!B8:B14,'Activity 10'!A8:A14,\"No\",0,1)","v":"No"},{"$f":"_xlfn.XLOOKUP($E3,'Activity 10'!$B$7:$B$13,'Activity 10'!C$7:C$13,\"N/A\",0,1)","v":"N/A"},{"$f":"_xlfn.XLOOKUP($E3,'Activity 10'!$B$7:$B$13,'Activity 10'!D$7:D$13,\"N/A\",0,1)","v":"N/A"},{"$f":"_xlfn.XLOOKUP($E3,'Activity 10'!$B$7:$B$13,'Activity 10'!E$7:E$13,\"N/A\",0,1)","v":"N/A"},{"$f":"_xlfn.XLOOKUP($E3,'Activity 10'!$B$7:$B$13,'Activity 10'!F$7:F$13,\"N/A\",0,1)","v":"N/A"},{"$f":"_xlfn.XLOOKUP($E3,'Activity 10'!$B$7:$B$13,'Activity 10'!G$7:G$13,\"N/A\",0,1)","v":"N/A"},{"$f":"_xlfn.XLOOKUP($E3,'Activity 10'!$B$7:$B$13,'Activity 10'!H$7:H$13,\"N/A\",0,1)","v":"N/A"},{"$f":"_xlfn.XLOOKUP($E3,'Activity 10'!$B$7:$B$13,'Activity 10'!I$7:I$13,\"N/A\",0,1)","v":"N/A"},{"$f":"_xlfn.XLOOKUP($E3,'Activity 10'!$B$7:$B$13,'Activity 10'!J$7:J$13,\"N/A\",0,1)","v":"N/A"},{"$f":"_xlfn.XLOOKUP($E3,'Activity 10'!$B$7:$B$13,'Activity 10'!K$7:K$13,\"N/A\",0,1)","v":"N/A"},{"$f":"_xlfn.XLOOKUP($E3,'Activity 10'!$B$7:$B$13,'Activity 10'!L$7:L$13,\"N/A\",0,1)","v":"N/A"},{"$f":"_xlfn.XLOOKUP($E3,'Activity 10'!$B$7:$B$13,'Activity 10'!M$7:M$13,\"N/A\",0,1)","v":"N/A"},{"$f":"_xlfn.XLOOKUP($E3,'Activity 10'!$B$7:$B$13,'Activity 10'!N$7:N$13,\"N/A\",0,1)","v":"N/A"},{"$f":"_xlfn.XLOOKUP($E3,'Activity 10'!$B$7:$B$13,'Activity 10'!O$7:O$13,\"N/A\",0,1)","v":"N/A"},{"$f":"_xlfn.XLOOKUP($E3,'Activity 10'!$B$17:$B$23,'Activity 10'!C$17:C$23,\"N/A\",0,1)","v":"N/A"},{"$f":"_xlfn.XLOOKUP($E3,'Activity 10'!$B$17:$B$23,'Activity 10'!D$17:D$23,\"N/A\",0,1)","v":"N/A"},{"$f":"_xlfn.XLOOKUP($E3,'Activity 10'!$B$17:$B$23,'Activity 10'!E$17:E$23,\"N/A\",0,1)","v":"N/A"},{"$f":"_xlfn.XLOOKUP($E3,'Activity 10'!$B$17:$B$23,'Activity 10'!F$17:F$23,\"N/A\",0,1)","v":"N/A"},{"$f":"_xlfn.XLOOKUP($E3,'Activity 10'!$B$17:$B$23,'Activity 10'!G$17:G$23,\"N/A\",0,1)","v":"N/A"},{"$f":"_xlfn.XLOOKUP($E3,'Activity 10'!$B$17:$B$23,'Activity 10'!H$17:H$23,\"N/A\",0,1)","v":"N/A"},{"$f":"_xlfn.XLOOKUP($E3,'Activity 10'!$B$17:$B$23,'Activity 10'!I$17:I$23,\"N/A\",0,1)","v":"N/A"},{"$f":"_xlfn.XLOOKUP($E3,'Activity 10'!$B$17:$B$23,'Activity 10'!J$17:J$23,\"N/A\",0,1)","v":"N/A"},{"$f":"_xlfn.XLOOKUP($E3,'Activity 10'!$B$17:$B$23,'Activity 10'!K$17:K$23,\"N/A\",0,1)","v":"N/A"},{"$f":"_xlfn.XLOOKUP($E3,'Activity 10'!$B$17:$B$23,'Activity 10'!L$17:L$23,\"N/A\",0,1)","v":"N/A"},{"$f":"_xlfn.XLOOKUP($E3,'Activity 10'!$B$17:$B$23,'Activity 10'!N$17:N$23,\"N/A\",0,1)","v":"N/A"},{"$f":"_xlfn.XLOOKUP($E3,'Competitive Activity 1'!B8:B14,'Competitive Activity 1'!A8:A14,\"No\",0,1)","v":"No"},{"$f":"_xlfn.XLOOKUP($E3,'Competitive Activity 1'!$B$7:$B$13,'Competitive Activity 1'!C$7:C$13,\"N/A\",0,1)","v":"N/A"},{"$f":"_xlfn.XLOOKUP($E3,'Competitive Activity 1'!$B$7:$B$13,'Competitive Activity 1'!D$7:D$13,\"N/A\",0,1)","v":"N/A"},{"$f":"_xlfn.XLOOKUP($E3,'Competitive Activity 1'!$B$7:$B$13,'Competitive Activity 1'!E$7:E$13,\"N/A\",0,1)","v":"N/A"},{"$f":"_xlfn.XLOOKUP($E3,'Competitive Activity 1'!$B$7:$B$13,'Competitive Activity 1'!F$7:F$13,\"N/A\",0,1)","v":"N/A"},{"$f":"_xlfn.XLOOKUP($E3,'Competitive Activity 1'!$B$7:$B$13,'Competitive Activity 1'!G$7:G$13,\"N/A\",0,1)","v":"N/A"},{"$f":"_xlfn.XLOOKUP($E3,'Competitive Activity 1'!$B$7:$B$13,'Competitive Activity 1'!H$7:H$13,\"N/A\",0,1)","v":"N/A"},{"$f":"_xlfn.XLOOKUP($E3,'Competitive Activity 1'!$B$7:$B$13,'Competitive Activity 1'!I$7:I$13,\"N/A\",0,1)","v":"N/A"},{"$f":"_xlfn.XLOOKUP($E3,'Competitive Activity 1'!$B$7:$B$13,'Competitive Activity 1'!J$7:J$13,\"N/A\",0,1)","v":"N/A"},{"$f":"_xlfn.XLOOKUP($E3,'Competitive Activity 1'!$B$7:$B$13,'Competitive Activity 1'!K$7:K$13,\"N/A\",0,1)","v":"N/A"},{"$f":"_xlfn.XLOOKUP($E3,'Competitive Activity 1'!$B$7:$B$13,'Competitive Activity 1'!L$7:L$13,\"N/A\",0,1)","v":"N/A"},{"$f":"_xlfn.XLOOKUP($E3,'Competitive Activity 1'!$B$7:$B$13,'Competitive Activity 1'!M$7:M$13,\"N/A\",0,1)","v":"N/A"},{"$f":"_xlfn.XLOOKUP($E3,'Competitive Activity 1'!$B$7:$B$13,'Competitive Activity 1'!N$7:N$13,\"N/A\",0,1)","v":"N/A"},{"$f":"_xlfn.XLOOKUP($E3,'Competitive Activity 1'!$B$7:$B$13,'Competitive Activity 1'!O$7:O$13,\"N/A\",0,1)","v":"N/A"},{"$f":"_xlfn.XLOOKUP($E3,'Competitive Activity 1'!$B$7:$B$13,'Competitive Activity 1'!P$7:P$13,\"N/A\",0,1)","v":"N/A"},{"$f":"_xlfn.XLOOKUP($E3,'Competitive Activity 1'!$B$17:$B$23,'Competitive Activity 1'!C$17:C$23,\"N/A\",0,1)","v":"N/A"},{"$f":"_xlfn.XLOOKUP($E3,'Competitive Activity 1'!$B$17:$B$23,'Competitive Activity 1'!D$17:D$23,\"N/A\",0,1)","v":"N/A"},{"$f":"_xlfn.XLOOKUP($E3,'Competitive Activity 1'!$B$17:$B$23,'Competitive Activity 1'!E$17:E$23,\"N/A\",0,1)","v":"N/A"},{"$f":"_xlfn.XLOOKUP($E3,'Competitive Activity 1'!$B$17:$B$23,'Competitive Activity 1'!F$17:F$23,\"N/A\",0,1)","v":"N/A"},{"$f":"_xlfn.XLOOKUP($E3,'Competitive Activity 1'!$B$17:$B$23,'Competitive Activity 1'!G$17:G$23,\"N/A\",0,1)","v":"N/A"},{"$f":"_xlfn.XLOOKUP($E3,'Competitive Activity 1'!$B$17:$B$23,'Competitive Activity 1'!H$17:H$23,\"N/A\",0,1)","v":"N/A"},{"$f":"_xlfn.XLOOKUP($E3,'Competitive Activity 1'!$B$17:$B$23,'Competitive Activity 1'!I$17:I$23,\"N/A\",0,1)","v":"N/A"},{"$f":"_xlfn.XLOOKUP($E3,'Competitive Activity 1'!$B$17:$B$23,'Competitive Activity 1'!J$17:J$23,\"N/A\",0,1)","v":"N/A"},{"$f":"_xlfn.XLOOKUP($E3,'Competitive Activity 1'!$B$17:$B$23,'Competitive Activity 1'!K$17:K$23,\"N/A\",0,1)","v":"N/A"},{"$f":"_xlfn.XLOOKUP($E3,'Competitive Activity 1'!$B$17:$B$23,'Competitive Activity 1'!M$17:M$23,\"N/A\",0,1)","v":"N/A"},{"$f":"_xlfn.XLOOKUP($E3,'Competitive Activity 1'!$B$17:$B$23,'Competitive Activity 1'!N$17:N$23,\"N/A\",0,1)","v":"N/A"},{"$f":"_xlfn.XLOOKUP($E3,'Competitive Activity 1'!$B$17:$B$23,'Competitive Activity 1'!P$17:P$23,\"N/A\",0,1)","v":"N/A"},{"$f":"_xlfn.XLOOKUP($E3,'Competitive Activity 2'!$B$7:$B$13,'Competitive Activity 2'!$A$7:$A$13,\"No\",0,1)","v":"No"},{"$f":"_xlfn.XLOOKUP($E3,'Competitive Activity 2'!$B$7:$B$13,'Competitive Activity 2'!C$7:C$13,\"N/A\",0,1)","v":"N/A"},{"$f":"_xlfn.XLOOKUP($E3,'Competitive Activity 2'!$B$7:$B$13,'Competitive Activity 2'!D$7:D$13,\"N/A\",0,1)","v":"N/A"},{"$f":"_xlfn.XLOOKUP($E3,'Competitive Activity 2'!$B$7:$B$13,'Competitive Activity 2'!E$7:E$13,\"N/A\",0,1)","v":"N/A"},{"$f":"_xlfn.XLOOKUP($E3,'Competitive Activity 2'!$B$7:$B$13,'Competitive Activity 2'!F$7:F$13,\"N/A\",0,1)","v":"N/A"},{"$f":"_xlfn.XLOOKUP($E3,'Competitive Activity 2'!$B$7:$B$13,'Competitive Activity 2'!G$7:G$13,\"N/A\",0,1)","v":"N/A"},{"$f":"_xlfn.XLOOKUP($E3,'Competitive Activity 2'!$B$7:$B$13,'Competitive Activity 2'!H$7:H$13,\"N/A\",0,1)","v":"N/A"},{"$f":"_xlfn.XLOOKUP($E3,'Competitive Activity 2'!$B$7:$B$13,'Competitive Activity 2'!I$7:I$13,\"N/A\",0,1)","v":"N/A"},{"$f":"_xlfn.XLOOKUP($E3,'Competitive Activity 2'!$B$7:$B$13,'Competitive Activity 2'!J$7:J$13,\"N/A\",0,1)","v":"N/A"},{"$f":"_xlfn.XLOOKUP($E3,'Competitive Activity 2'!$B$7:$B$13,'Competitive Activity 2'!K$7:K$13,\"N/A\",0,1)","v":"N/A"},{"$f":"_xlfn.XLOOKUP($E3,'Competitive Activity 2'!$B$7:$B$13,'Competitive Activity 2'!L$7:L$13,\"N/A\",0,1)","v":"N/A"},{"$f":"_xlfn.XLOOKUP($E3,'Competitive Activity 2'!$B$17:$B$23,'Competitive Activity 2'!C$17:C$23,\"N/A\",0,1)","v":"N/A"},{"$f":"_xlfn.XLOOKUP($E3,'Competitive Activity 2'!$B$17:$B$23,'Competitive Activity 2'!D$17:D$23,\"N/A\",0,1)","v":"N/A"},{"$f":"_xlfn.XLOOKUP($E3,'Competitive Activity 2'!$B$17:$B$23,'Competitive Activity 2'!E$17:E$23,\"N/A\",0,1)","v":"N/A"},{"$f":"_xlfn.XLOOKUP($E3,'Competitive Activity 2'!$B$17:$B$23,'Competitive Activity 2'!F$17:F$23,\"N/A\",0,1)","v":"N/A"},{"$f":"_xlfn.XLOOKUP($E3,'Competitive Activity 2'!$B$17:$B$23,'Competitive Activity 2'!G$17:G$23,\"N/A\",0,1)","v":"N/A"},{"$f":"_xlfn.XLOOKUP($E3,'Competitive Activity 2'!$B$17:$B$23,'Competitive Activity 2'!H$17:H$23,\"N/A\",0,1)","v":"N/A"},{"$f":"_xlfn.XLOOKUP($E3,'Competitive Activity 2'!$B$17:$B$23,'Competitive Activity 2'!I$17:I$23,\"N/A\",0,1)","v":"N/A"},{"$f":"_xlfn.XLOOKUP($E3,'Competitive Activity 2'!$B$17:$B$23,'Competitive Activity 2'!J$17:J$23,\"N/A\",0,1)","v":"N/A"},{"$f":"_xlfn.XLOOKUP($E3,'Competitive Activity 2'!$B$17:$B$23,'Competitive Activity 2'!K$17:K$23,\"N/A\",0,1)","v":"N/A"},{"$f":"_xlfn.XLOOKUP($E3,'Competitive Activity 2'!$B$17:$B$23,'Competitive Activity 2'!L$17:L$23,\"N/A\",0,1)","v":"N/A"},{"$f":"_xlfn.XLOOKUP($E3,'Competitive Activity 2'!$B$17:$B$23,'Competitive Activity 2'!M$17:M$23,\"N/A\",0,1)","v":"N/A"},{"$f":"_xlfn.XLOOKUP($E3,'Competitive Activity 2'!$B$27:$B$33,'Competitive Activity 2'!C$27:C$33,\"N/A\",0,1)","v":"N/A"},{"$f":"_xlfn.XLOOKUP($E3,'Competitive Activity 2'!$B$27:$B$33,'Competitive Activity 2'!D$27:D$33,\"N/A\",0,1)","v":"N/A"},{"$f":"_xlfn.XLOOKUP($E3,'Competitive Activity 2'!$B$27:$B$33,'Competitive Activity 2'!E$27:E$33,\"N/A\",0,1)","v":"N/A"},{"$f":"_xlfn.XLOOKUP($E3,'Competitive Activity 2'!$B$27:$B$33,'Competitive Activity 2'!F$27:F$33,\"N/A\",0,1)","v":"N/A"},{"$f":"_xlfn.XLOOKUP($E3,'Competitive Activity 2'!$B$27:$B$33,'Competitive Activity 2'!G$27:G$33,\"N/A\",0,1)","v":"N/A"},{"$f":"_xlfn.XLOOKUP($E3,'Competitive Activity 2'!$B$27:$B$33,'Competitive Activity 2'!H$27:H$33,\"N/A\",0,1)","v":"N/A"},{"$f":"_xlfn.XLOOKUP($E3,'Competitive Activity 2'!$B$27:$B$33,'Competitive Activity 2'!I$27:I$33,\"N/A\",0,1)","v":"N/A"},{"$f":"_xlfn.XLOOKUP($E3,'Competitive Activity 2'!$B$27:$B$33,'Competitive Activity 2'!J$27:J$33,\"N/A\",0,1)","v":"N/A"},{"$f":"_xlfn.XLOOKUP($E3,'Competitive Activity 2'!$B$27:$B$33,'Competitive Activity 2'!L$27:L$33,\"N/A\",0,1)","v":"N/A"}]
[{"$f":"'1-Cover Sheet'!$C$8","v":0},{"$f":"'1-Cover Sheet'!$F$8","v":"Select One"},{"$f":"'Summary Sheet'!$D$8","v":0},{"$f":"'Summary Sheet'!$D$10","v":0},{"$f":"'3-Financial Summary'!A14","v":0},{"$f":"'3-Financial Summary'!B14","v":0},{"$f":"'3-Financial Summary'!C14","v":0},{"$f":"'3-Financial Summary'!D14","v":0},{"$f":"'3-Financial Summary'!E14","v":0},{"$f":"VLOOKUP(E4,'Summary Sheet'!$A$23:$L$34,11,FALSE)","v":"N/A"},{"$f":"VLOOKUP(E4,'Summary Sheet'!$A$23:$L$34,12,FALSE)","v":"N/A"},{"$f":"'3-Financial Summary'!F14","v":0},{"$f":"'3-Financial Summary'!G14","v":"00:00:00"},{"$f":"'3-Financial Summary'!H14","v":0},{"$f":"_xlfn.XLOOKUP($E4,'Activity 1'!$B$7:$B$13,'Activity 1'!$A$7:$A$13,\"No\",0,1)","v":"No"},{"$f":"_xlfn.XLOOKUP($E4,'Activity 1'!$B$7:$B$13,'Activity 1'!C9:C15,\"N/A\",0,1)","v":"N/A"},{"$f":"_xlfn.XLOOKUP($E4,'Activity 1'!$B$7:$B$13,'Activity 1'!D9:D15,\"N/A\",0,1)","v":"N/A"},{"$f":"_xlfn.XLOOKUP($E4,'Activity 1'!$B$7:$B$13,'Activity 1'!E$7:E$13,\"N/A\",0,1)","v":"N/A"},{"$f":"_xlfn.XLOOKUP($E4,'Activity 1'!$B$7:$B$13,'Activity 1'!F$7:F$13,\"N/A\",0,1)","v":"N/A"},{"$f":"_xlfn.XLOOKUP($E4,'Activity 1'!$B$7:$B$13,'Activity 1'!G$7:G$13,\"N/A\",0,1)","v":"N/A"},{"$f":"_xlfn.XLOOKUP($E4,'Activity 1'!$B$7:$B$13,'Activity 1'!H$7:H$13,\"N/A\",0,1)","v":"N/A"},{"$f":"_xlfn.XLOOKUP($E4,'Activity 1'!$B$7:$B$13,'Activity 1'!I$7:I$13,\"N/A\",0,1)","v":"N/A"},{"$f":"_xlfn.XLOOKUP($E4,'Activity 1'!$B$7:$B$13,'Activity 1'!J$7:J$13,\"N/A\",0,1)","v":"N/A"},{"$f":"_xlfn.XLOOKUP($E4,'Activity 1'!$B$7:$B$13,'Activity 1'!K$7:K$13,\"N/A\",0,1)","v":"N/A"},{"$f":"_xlfn.XLOOKUP($E4,'Activity 1'!$B$7:$B$13,'Activity 1'!L$7:L$13,\"N/A\",0,1)","v":"N/A"},{"$f":"_xlfn.XLOOKUP($E4,'Activity 1'!$B$7:$B$13,'Activity 1'!M$7:M$13,\"N/A\",0,1)","v":"N/A"},{"$f":"_xlfn.XLOOKUP($E4,'Activity 1'!$B$7:$B$13,'Activity 1'!N$7:N$13,\"N/A\",0,1)","v":"N/A"},{"$f":"_xlfn.XLOOKUP($E4,'Activity 1'!$B$7:$B$13,'Activity 1'!O$7:O$13,\"N/A\",0,1)","v":"N/A"},{"$f":"_xlfn.XLOOKUP($E4,'Activity 1'!$B$7:$B$13,'Activity 1'!P$7:P$13,\"N/A\",0,1)","v":"N/A"},{"$f":"_xlfn.XLOOKUP($E4,'Activity 1'!$B$7:$B$13,'Activity 1'!Q$7:Q$13,\"N/A\",0,1)","v":"N/A"},{"$f":"_xlfn.XLOOKUP($E4,'Activity 1'!$B$17:$B$23,'Activity 1'!C$17:C$23,\"N/A\",0,1)","v":"N/A"},{"$f":"_xlfn.XLOOKUP($E4,'Activity 1'!$B$17:$B$23,'Activity 1'!D$17:D$23,\"N/A\",0,1)","v":"N/A"},{"$f":"_xlfn.XLOOKUP($E4,'Activity 1'!$B$17:$B$23,'Activity 1'!E$17:E$23,\"N/A\",0,1)","v":"N/A"},{"$f":"_xlfn.XLOOKUP($E4,'Activity 1'!$B$17:$B$23,'Activity 1'!F$17:F$23,\"N/A\",0,1)","v":"N/A"},{"$f":"_xlfn.XLOOKUP($E4,'Activity 1'!$B$17:$B$23,'Activity 1'!G$17:G$23,\"N/A\",0,1)","v":"N/A"},{"$f":"_xlfn.XLOOKUP($E4,'Activity 1'!$B$17:$B$23,'Activity 1'!H$17:H$23,\"N/A\",0,1)","v":"N/A"},{"$f":"_xlfn.XLOOKUP($E4,'Activity 1'!$B$17:$B$23,'Activity 1'!I$17:I$23,\"N/A\",0,1)","v":"N/A"},{"$f":"_xlfn.XLOOKUP($E4,'Activity 1'!$B$17:$B$23,'Activity 1'!J$17:J$23,\"N/A\",0,1)","v":"N/A"},{"$f":"_xlfn.XLOOKUP($E4,'Activity 1'!$B$17:$B$23,'Activity 1'!K$17:K$23,\"N/A\",0,1)","v":"N/A"},{"$f":"_xlfn.XLOOKUP($E4,'Activity 1'!$B$17:$B$23,'Activity 1'!L$17:L$23,\"N/A\",0,1)","v":"N/A"},{"$f":"_xlfn.XLOOKUP($E4,'Activity 1'!$B$17:$B$23,'Activity 1'!M$17:M$23,\"N/A\",0,1)","v":"N/A"},{"$f":"_xlfn.XLOOKUP($E4,'Activity 1'!$B$17:$B$23,'Activity 1'!O$17:O$23,\"N/A\",0,1)","v":"N/A"},{"$f":"_xlfn.XLOOKUP($E4,'Activity 1'!$B$17:$B$23,'Activity 1'!Q$17:Q$23,\"N/A\",0,1)","v":"N/A"},{"$f":"_xlfn.XLOOKUP($E4,'Activity 2'!$B$7:$B$13,'Activity 2'!A$7:A$13,\"No\",0)","v":"No"},{"$f":"_xlfn.XLOOKUP($E4,'Activity 2'!$B$7:$B$13,'Activity 2'!C$7:C$13,\"N/A\",0,1)","v":"N/A"},{"$f":"_xlfn.XLOOKUP($E4,'Activity 2'!$B$7:$B$13,'Activity 2'!D$7:D$13,\"N/A\",0,1)","v":"N/A"},{"$f":"_xlfn.XLOOKUP($E4,'Activity 2'!$B$7:$B$13,'Activity 2'!E$7:E$13,\"N/A\",0,1)","v":"N/A"},{"$f":"_xlfn.XLOOKUP($E4,'Activity 2'!$B$7:$B$13,'Activity 2'!F$7:F$13,\"N/A\",0,1)","v":"N/A"},{"$f":"_xlfn.XLOOKUP($E4,'Activity 2'!$B$7:$B$13,'Activity 2'!G$7:G$13,\"N/A\",0,1)","v":"N/A"},{"$f":"_xlfn.XLOOKUP($E4,'Activity 2'!$B$7:$B$13,'Activity 2'!H$7:H$13,\"N/A\",0,1)","v":"N/A"},{"$f":"_xlfn.XLOOKUP($E4,'Activity 2'!$B$7:$B$13,'Activity 2'!I$7:I$13,\"N/A\",0,1)","v":"N/A"},{"$f":"_xlfn.XLOOKUP($E4,'Activity 2'!$B$7:$B$13,'Activity 2'!J$7:J$13,\"N/A\",0,1)","v":"N/A"},{"$f":"_xlfn.XLOOKUP($E4,'Activity 2'!$B$7:$B$13,'Activity 2'!K$7:K$13,\"N/A\",0,1)","v":"N/A"},{"$f":"_xlfn.XLOOKUP($E4,'Activity 2'!$B$7:$B$13,'Activity 2'!L$7:L$13,\"N/A\",0,1)","v":"N/A"},{"$f":"_xlfn.XLOOKUP($E4,'Activity 2'!$B$7:$B$13,'Activity 2'!M$7:M$13,\"N/A\",0,1)","v":"N/A"},{"$f":"_xlfn.XLOOKUP($E4,'Activity 2'!$B$7:$B$13,'Activity 2'!N$7:N$13,\"N/A\",0,1)","v":"N/A"},{"$f":"_xlfn.XLOOKUP($E4,'Activity 2'!$B$7:$B$13,'Activity 2'!O$7:O$13,\"N/A\",0,1)","v":"N/A"},{"$f":"_xlfn.XLOOKUP($E4,'Activity 2'!$B$7:$B$13,'Activity 2'!P$7:P$13,\"N/A\",0,1)","v":"N/A"},{"$f":"_xlfn.XLOOKUP($E4,'Activity 2'!$B$7:$B$13,'Activity 2'!Q$7:Q$13,\"N/A\",0,1)","v":"N/A"},{"$f":"_xlfn.XLOOKUP($E4,'Activity 2'!$B$17:$B$23,'Activity 2'!C$17:C$23,\"N/A\",0,1)","v":"N/A"},{"$f":"_xlfn.XLOOKUP($E4,'Activity 2'!$B$17:$B$23,'Activity 2'!D$17:D$23,\"N/A\",0,1)","v":"N/A"},{"$f":"_xlfn.XLOOKUP($E4,'Activity 2'!$B$17:$B$23,'Activity 2'!E$17:E$23,\"N/A\",0,1)","v":"N/A"},{"$f":"_xlfn.XLOOKUP($E4,'Activity 2'!$B$17:$B$23,'Activity 2'!F$17:F$23,\"N/A\",0,1)","v":"N/A"},{"$f":"_xlfn.XLOOKUP($E4,'Activity 2'!$B$17:$B$23,'Activity 2'!G$17:G$23,\"N/A\",0,1)","v":"N/A"},{"$f":"_xlfn.XLOOKUP($E4,'Activity 2'!$B$17:$B$23,'Activity 2'!H$17:H$23,\"N/A\",0,1)","v":"N/A"},{"$f":"_xlfn.XLOOKUP($E4,'Activity 2'!$B$17:$B$23,'Activity 2'!I$17:I$23,\"N/A\",0,1)","v":"N/A"},{"$f":"_xlfn.XLOOKUP($E4,'Activity 2'!$B$17:$B$23,'Activity 2'!J$17:J$23,\"N/A\",0,1)","v":"N/A"},{"$f":"_xlfn.XLOOKUP($E4,'Activity 2'!$B$17:$B$23,'Activity 2'!K$17:K$23,\"N/A\",0,1)","v":"N/A"},{"$f":"_xlfn.XLOOKUP($E4,'Activity 2'!$B$17:$B$23,'Activity 2'!L$17:L$23,\"N/A\",0,1)","v":"N/A"},{"$f":"_xlfn.XLOOKUP($E4,'Activity 2'!$B$17:$B$23,'Activity 2'!M$17:M$23,\"N/A\",0,1)","v":"N/A"},{"$f":"_xlfn.XLOOKUP($E4,'Activity 2'!$B$17:$B$23,'Activity 2'!O$17:O$23,\"N/A\",0,1)","v":"N/A"},{"$f":"_xlfn.XLOOKUP($E4,'Activity 2'!$B$17:$B$23,'Activity 2'!Q$17:Q$23,\"N/A\",0,1)","v":"N/A"},{"$f":"_xlfn.XLOOKUP($E4,'Activity 3'!$B$8:$B$14,'Activity 3'!A$8:A$14,\"No\",0,1)","v":"No"},{"$f":"_xlfn.XLOOKUP($E4,'Activity 3'!$B$8:$B$14,'Activity 3'!C$8:C$14,\"N/A\",0,1)","v":"N/A"},{"$f":"_xlfn.XLOOKUP($E4,'Activity 3'!$B$8:$B$14,'Activity 3'!D$8:D$14,\"N/A\",0,1)","v":"N/A"},{"$f":"_xlfn.XLOOKUP($E4,'Activity 3'!$B$8:$B$14,'Activity 3'!E$8:E$14,\"N/A\",0,1)","v":"N/A"},{"$f":"_xlfn.XLOOKUP($E4,'Activity 3'!$B$8:$B$14,'Activity 3'!F$8:F$14,\"N/A\",0,1)","v":"N/A"},{"$f":"_xlfn.XLOOKUP($E4,'Activity 3'!$B$8:$B$14,'Activity 3'!G$8:G$14,\"N/A\",0,1)","v":"N/A"},{"$f":"_xlfn.XLOOKUP($E4,'Activity 4'!$B$8:$B$14,'Activity 4'!A10:A16,\"No\",0,1)","v":"No"},{"$f":"_xlfn.XLOOKUP($E4,'Activity 4'!$B$8:$B$14,'Activity 4'!C$8:C$14,\"N/A\",0,1)","v":"N/A"},{"$f":"_xlfn.XLOOKUP($E4,'Activity 4'!$B$8:$B$14,'Activity 4'!D$8:D$14,\"N/A\",0,1)","v":"N/A"},{"$f":"_xlfn.XLOOKUP($E4,'Activity 4'!$B$8:$B$14,'Activity 4'!G$8:G$14,\"N/A\",0,1)","v":"N/A"},{"$f":"_xlfn.XLOOKUP($E4,'Activity 5'!$B$8:$B$14,'Activity 5'!$A$8:$A$14,\"No\",0,1)","v":"No"},{"$f":"_xlfn.XLOOKUP($E4,'Activity 5'!$B$8:$B$14,'Activity 5'!C$8:C$14,\"N/A\",0,1)","v":"N/A"},{"$f":"_xlfn.XLOOKUP($E4,'Activity 5'!$B$8:$B$14,'Activity 5'!D$8:D$14,\"N/A\",0,1)","v":"N/A"},{"$f":"_xlfn.XLOOKUP($E4,'Activity 5'!$B$8:$B$14,'Activity 5'!G$8:G$14,\"N/A\",0,1)","v":"N/A"},{"$f":"_xlfn.XLOOKUP($E4,'Activity 5'!$B$8:$B$14,'Activity 5'!H$8:H$14,\"N/A\",0,1)","v":"N/A"},{"$f":"_xlfn.XLOOKUP($E4,'Activity 5'!$B$8:$B$14,'Activity 5'!I$8:I$14,\"N/A\",0,1)","v":"N/A"},{"$f":"_xlfn.XLOOKUP($E4,'Activity 5'!$B$8:$B$14,'Activity 5'!J$8:J$14,\"N/A\",0,1)","v":"N/A"},{"$f":"_xlfn.XLOOKUP($E4,'Activity 6'!$B$7:$B$13,'Activity 6'!A$7:A$13,\"No\",0,1)","v":"No"},{"$f":"_xlfn.XLOOKUP($E4,'Activity 6'!$B$7:$B$13,'Activity 6'!C$7:C$13,\"N/A\",0,1)","v":"N/A"},{"$f":"_xlfn.XLOOKUP($E4,'Activity 6'!$B$7:$B$13,'Activity 6'!D$7:D$13,\"N/A\",0,1)","v":"N/A"},{"$f":"_xlfn.XLOOKUP($E4,'Activity 6'!$B$7:$B$13,'Activity 6'!E$7:E$13,\"N/A\",0,1)","v":"N/A"},{"$f":"_xlfn.XLOOKUP($E4,'Activity 6'!$B$7:$B$13,'Activity 6'!F$7:F$13,\"N/A\",0,1)","v":"N/A"},{"$f":"_xlfn.XLOOKUP($E4,'Activity 6'!$B$7:$B$13,'Activity 6'!G$7:G$13,\"N/A\",0,1)","v":"N/A"},{"$f":"_xlfn.XLOOKUP($E4,'Activity 6'!$B$7:$B$13,'Activity 6'!H$7:H$13,\"N/A\",0,1)","v":"N/A"},{"$f":"_xlfn.XLOOKUP($E4,'Activity 6'!$B$7:$B$13,'Activity 6'!I$7:I$13,\"N/A\",0,1)","v":"N/A"},{"$f":"_xlfn.XLOOKUP($E4,'Activity 6'!$B$7:$B$13,'Activity 6'!J$7:J$13,\"N/A\",0,1)","v":"N/A"},{"$f":"_xlfn.XLOOKUP($E4,'Activity 6'!$B$7:$B$13,'Activity 6'!K$7:K$13,\"N/A\",0,1)","v":"N/A"},{"$f":"_xlfn.XLOOKUP($E4,'Activity 6'!$B$7:$B$13,'Activity 6'!L$7:L$13,\"N/A\",0,1)","v":"N/A"},{"$f":"_xlfn.XLOOKUP($E4,'Activity 6'!$B$7:$B$13,'Activity 6'!M$7:M$13,\"N/A\",0,1)","v":"N/A"},{"$f":"IF(ISNUMBER(SEARCH(\"6\",H4)),COUNTA('Activity 6'!$D$17:$E$20),\"N/A\")","v":"N/A"},{"$f":"IF(ISNUMBER(SEARCH(6,H4)),SUM('Activity 6'!G19:G22),\"N/A\")","v":"N/A"},{"$f":"_xlfn.XLOOKUP($E4,'Activity 6'!$B$23:$B$29,'Activity 6'!C$23:C$29,\"N/A\",0,1)","v":"N/A"},{"$f":"_xlfn.XLOOKUP($E4,'Activity 6'!$B$23:$B$29,'Activity 6'!D$23:D$29,\"N/A\",0,1)","v":"N/A"},{"$f":"_xlfn.XLOOKUP($E4,'Activity 6'!$B$23:$B$29,'Activity 6'!E$23:E$29,\"N/A\",0,1)","v":"N/A"},{"$f":"_xlfn.XLOOKUP($E4,'Activity 6'!$B$23:$B$29,'Activity 6'!F$23:F$29,\"N/A\",0,1)","v":"N/A"},{"$f":"_xlfn.XLOOKUP($E4,'Activity 6'!$B$23:$B$29,'Activity 6'!G$23:G$29,\"N/A\",0,1)","v":"N/A"},{"$f":"_xlfn.XLOOKUP($E4,'Activity 6'!$B$23:$B$29,'Activity 6'!H$23:H$29,\"N/A\",0,1)","v":"N/A"},{"$f":"_xlfn.XLOOKUP($E4,'Activity 6'!$B$23:$B$29,'Activity 6'!I$23:I$29,\"N/A\",0,1)","v":"N/A"},{"$f":"_xlfn.XLOOKUP($E4,'Activity 6'!$B$23:$B$29,'Activity 6'!J$23:J$29,\"N/A\",0,1)","v":"N/A"},{"$f":"_xlfn.XLOOKUP($E4,'Activity 6'!$B$23:$B$29,'Activity 6'!K$23:K$29,\"N/A\",0,1)","v":"N/A"},{"$f":"_xlfn.XLOOKUP($E4,'Activity 6'!$B$23:$B$29,'Activity 6'!L$23:L$29,\"N/A\",0,1)","v":"N/A"},{"$f":"_xlfn.XLOOKUP($E4,'Activity 6'!$B$23:$B$29,'Activity 6'!M$23:M$29,\"N/A\",0,1)","v":"N/A"},{"$f":"_xlfn.XLOOKUP($E4,'Activity 6'!$B$23:$B$29,'Activity 6'!N$23:N$29,\"N/A\",0,1)","v":"N/A"},{"$f":"_xlfn.XLOOKUP($E4,'Activity 6'!$B$33:$B$38,'Activity 6'!C$33:C$38,\"N/A\",0,1)","v":"N/A"},{"$f":"_xlfn.XLOOKUP($E4,'Activity 6'!$B$33:$B$38,'Activity 6'!D$33:D$38,\"N/A\",0,1)","v":"N/A"},{"$f":"_xlfn.XLOOKUP($E4,'Activity 6'!$B$33:$B$38,'Activity 6'!E$33:E$38,\"N/A\",0,1)","v":"N/A"},{"$f":"_xlfn.XLOOKUP($E4,'Activity 6'!$B$33:$B$38,'Activity 6'!I$33:I$38,\"N/A\",0,1)","v":"N/A"},{"$f":"_xlfn.XLOOKUP($E4,'Activity 6'!$B$33:$B$38,'Activity 6'!G$33:G$38,\"N/A\",0,1)","v":"N/A"},{"$f":"_xlfn.XLOOKUP($E4,'Activity 6'!$B$33:$B$38,'Activity 6'!H$33:H$38,\"N/A\",0,1)","v":"N/A"},{"$f":"_xlfn.XLOOKUP($E4,'Activity 6'!$B$33:$B$38,'Activity 6'!I$33:I$38,\"N/A\",0,1)","v":"N/A"},{"$f":"_xlfn.XLOOKUP($E4,'Activity 6'!$B$33:$B$38,'Activity 6'!J$33:J$38,\"N/A\",0,1)","v":"N/A"},{"$f":"_xlfn.XLOOKUP($E4,'Activity 6'!$B$33:$B$38,'Activity 6'!K$33:K$38,\"N/A\",0,1)","v":"N/A"},{"$f":"_xlfn.XLOOKUP($E4,'Activity 6'!$B$33:$B$38,'Activity 6'!M$33:M$38,\"N/A\",0,1)","v":"N/A"},{"$f":"_xlfn.XLOOKUP($E4,'Activity 7'!$B$7:$B$13,'Activity 7'!$A$7:$A$13,\"No\",0,1)","v":"No"},{"$f":"_xlfn.XLOOKUP($E4,'Activity 7'!$B$7:$B$13,'Activity 7'!C$7:C$13,\"N/A\",0,1)","v":"N/A"},{"$f":"_xlfn.XLOOKUP($E4,'Activity 7'!$B$7:$B$13,'Activity 7'!D$7:D$13,\"N/A\",0,1)","v":"N/A"},{"$f":"_xlfn.XLOOKUP($E4,'Activity 7'!$B$7:$B$13,'Activity 7'!E$7:E$13,\"N/A\",0,1)","v":"N/A"},{"$f":"_xlfn.XLOOKUP($E4,'Activity 7'!$B$7:$B$13,'Activity 7'!F$7:F$13,\"N/A\",0,1)","v":"N/A"},{"$f":"_xlfn.XLOOKUP($E4,'Activity 7'!$B$7:$B$13,'Activity 7'!G$7:G$13,\"N/A\",0,1)","v":"N/A"},{"$f":"_xlfn.XLOOKUP($E4,'Activity 7'!$B$7:$B$13,'Activity 7'!H$7:H$13,\"N/A\",0,1)","v":"N/A"},{"$f":"_xlfn.XLOOKUP($E4,'Activity 7'!$B$7:$B$13,'Activity 7'!I$7:I$13,\"N/A\",0,1)","v":"N/A"},{"$f":"_xlfn.XLOOKUP($E4,'Activity 7'!$B$7:$B$13,'Activity 7'!J$7:J$13,\"N/A\",0,1)","v":"N/A"},{"$f":"_xlfn.XLOOKUP($E4,'Activity 7'!$B$7:$B$13,'Activity 7'!K$7:K$13,\"N/A\",0,1)","v":"N/A"},{"$f":"_xlfn.XLOOKUP($E4,'Activity 7'!$B$7:$B$13,'Activity 7'!L$7:L$13,\"N/A\",0,1)","v":"N/A"},{"$f":"_xlfn.XLOOKUP($E4,'Activity 7'!$B$7:$B$13,'Activity 7'!M$7:M$13,\"N/A\",0,1)","v":"N/A"},{"$f":"_xlfn.XLOOKUP($E4,'Activity 7'!$B$17:$B$23,'Activity 7'!C$17:C$23,\"N/A\",0,1)","v":"N/A"},{"$f":"_xlfn.XLOOKUP($E4,'Activity 7'!$B$17:$B$23,'Activity 7'!D$17:D$23,\"N/A\",0,1)","v":"N/A"},{"$f":"_xlfn.XLOOKUP($E4,'Activity 7'!$B$17:$B$23,'Activity 7'!E$17:E$23,\"N/A\",0,1)","v":"N/A"},{"$f":"_xlfn.XLOOKUP($E4,'Activity 7'!$B$17:$B$23,'Activity 7'!F$17:F$23,\"N/A\",0,1)","v":"N/A"},{"$f":"_xlfn.XLOOKUP($E4,'Activity 7'!$B$17:$B$23,'Activity 7'!G$17:G$23,\"N/A\",0,1)","v":"N/A"},{"$f":"_xlfn.XLOOKUP($E4,'Activity 7'!$B$17:$B$23,'Activity 7'!H$17:H$23,\"N/A\",0,1)","v":"N/A"},{"$f":"_xlfn.XLOOKUP($E4,'Activity 7'!$B$17:$B$23,'Activity 7'!I$17:I$23,\"N/A\",0,1)","v":"N/A"},{"$f":"_xlfn.XLOOKUP($E4,'Activity 7'!$B$17:$B$23,'Activity 7'!J$17:J$23,\"N/A\",0,1)","v":"N/A"},{"$f":"_xlfn.XLOOKUP($E4,'Activity 7'!$B$17:$B$23,'Activity 7'!L$17:L$23,\"N/A\",0,1)","v":"N/A"},{"$f":"_xlfn.XLOOKUP($E4,'Activity 8'!$B$7:$B$13,'Activity 8'!A$7:A$13,\"No\",0,1)","v":"No"},{"$f":"_xlfn.XLOOKUP($E4,'Activity 8'!$B$7:$B$13,'Activity 8'!C$7:C$13,\"N/A\",0,1)","v":"N/A"},{"$f":"_xlfn.XLOOKUP($E4,'Activity 8'!$B$7:$B$13,'Activity 8'!D$7:D$13,\"N/A\",0,1)","v":"N/A"},{"$f":"_xlfn.XLOOKUP($E4,'Activity 8'!$B$7:$B$13,'Activity 8'!E$7:E$13,\"N/A\",0,1)","v":"N/A"},{"$f":"_xlfn.XLOOKUP($E4,'Activity 8'!$B$7:$B$13,'Activity 8'!F$7:F$13,\"N/A\",0,1)","v":"N/A"},{"$f":"_xlfn.XLOOKUP($E4,'Activity 8'!$B$7:$B$13,'Activity 8'!G$7:G$13,\"N/A\",0,1)","v":"N/A"},{"$f":"_xlfn.XLOOKUP($E4,'Activity 8'!$B$7:$B$13,'Activity 8'!H$7:H$13,\"N/A\",0,1)","v":"N/A"},{"$f":"_xlfn.XLOOKUP($E4,'Activity 8'!$B$7:$B$13,'Activity 8'!I$7:I$13,\"N/A\",0,1)","v":"N/A"},{"$f":"_xlfn.XLOOKUP($E4,'Activity 8'!$B$7:$B$13,'Activity 8'!J$7:J$13,\"N/A\",0,1)","v":"N/A"},{"$f":"_xlfn.XLOOKUP($E4,'Activity 8'!$B$7:$B$13,'Activity 8'!K$7:K$13,\"N/A\",0,1)","v":"N/A"},{"$f":"_xlfn.XLOOKUP($E4,'Activity 8'!$B$7:$B$13,'Activity 8'!L$7:L$13,\"N/A\",0,1)","v":"N/A"},{"$f":"_xlfn.XLOOKUP($E4,'Activity 8'!$B$7:$B$13,'Activity 8'!M$7:M$13,\"N/A\",0,1)","v":"N/A"},{"$f":"_xlfn.XLOOKUP($E4,'Activity 8'!$B$7:$B$13,'Activity 8'!N$7:N$13,\"N/A\",0,1)","v":"N/A"},{"$f":"_xlfn.XLOOKUP($E4,'Activity 8'!$B$7:$B$13,'Activity 8'!O$7:O$13,\"N/A\",0,1)","v":"N/A"},{"$f":"_xlfn.XLOOKUP($E4,'Activity 8'!$B$7:$B$13,'Activity 8'!P$7:P$13,\"N/A\",0,1)","v":"N/A"},{"$f":"_xlfn.XLOOKUP($E4,'Activity 8'!$B$17:$B$23,'Activity 8'!C$17:C$23,\"N/A\",0,1)","v":"N/A"},{"$f":"_xlfn.XLOOKUP($E4,'Activity 8'!$B$17:$B$23,'Activity 8'!D$17:D$23,\"N/A\",0,1)","v":"N/A"},{"$f":"_xlfn.XLOOKUP($E4,'Activity 8'!$B$17:$B$23,'Activity 8'!E$17:E$23,\"N/A\",0,1)","v":"N/A"},{"$f":"_xlfn.XLOOKUP($E4,'Activity 8'!$B$17:$B$23,'Activity 8'!F$17:F$23,\"N/A\",0,1)","v":"N/A"},{"$f":"_xlfn.XLOOKUP($E4,'Activity 8'!$B$17:$B$23,'Activity 8'!G$17:G$23,\"N/A\",0,1)","v":"N/A"},{"$f":"_xlfn.XLOOKUP($E4,'Activity 8'!$B$17:$B$23,'Activity 8'!H$17:H$23,\"N/A\",0,1)","v":"N/A"},{"$f":"_xlfn.XLOOKUP($E4,'Activity 8'!$B$17:$B$23,'Activity 8'!I$17:I$23,\"N/A\",0,1)","v":"N/A"},{"$f":"_xlfn.XLOOKUP($E4,'Activity 8'!$B$17:$B$23,'Activity 8'!J$17:J$23,\"N/A\",0,1)","v":"N/A"},{"$f":"_xlfn.XLOOKUP($E4,'Activity 8'!$B$17:$B$23,'Activity 8'!K$17:K$23,\"N/A\",0,1)","v":"N/A"},{"$f":"_xlfn.XLOOKUP($E4,'Activity 8'!$B$17:$B$23,'Activity 8'!L$17:L$23,\"N/A\",0,1)","v":"N/A"},{"$f":"_xlfn.XLOOKUP($E4,'Activity 8'!$B$17:$B$23,'Activity 8'!M$17:M$23,\"N/A\",0,1)","v":"N/A"},{"$f":"_xlfn.XLOOKUP($E4,'Activity 8'!$B$17:$B$23,'Activity 8'!P$17:P$23,\"N/A\",0,1)","v":"N/A"},{"$f":"_xlfn.XLOOKUP(E4,'Activity 9'!B9:B15,'Activity 9'!A9:A15,\"No\",0,1)","v":"No"},{"$f":"_xlfn.XLOOKUP($E4,'Activity 9'!$B$7:$B$13,'Activity 9'!C$7:C$13,\"N/A\",0,1)","v":"N/A"},{"$f":"_xlfn.XLOOKUP($E4,'Activity 9'!$B$7:$B$13,'Activity 9'!D$7:D$13,\"N/A\",0,1)","v":"N/A"},{"$f":"_xlfn.XLOOKUP($E4,'Activity 9'!$B$7:$B$13,'Activity 9'!E$7:E$13,\"N/A\",0,1)","v":"N/A"},{"$f":"_xlfn.XLOOKUP($E4,'Activity 9'!$B$7:$B$13,'Activity 9'!H$7:H$13,\"N/A\",0,1)","v":"N/A"},{"$f":"_xlfn.XLOOKUP($E4,'Activity 9'!$B$7:$B$13,'Activity 9'!I$7:I$13,\"N/A\",0,1)","v":"N/A"},{"$f":"_xlfn.XLOOKUP($E4,'Activity 9'!$B$7:$B$13,'Activity 9'!J$7:J$13,\"N/A\",0,1)","v":"N/A"},{"$f":"_xlfn.XLOOKUP($E4,'Activity 9'!$B$7:$B$13,'Activity 9'!K$7:K$13,\"N/A\",0,1)","v":"N/A"},{"$f":"_xlfn.XLOOKUP($E4,'Activity 9'!$B$7:$B$13,'Activity 9'!L$7:L$13,\"N/A\",0,1)","v":"N/A"},{"$f":"_xlfn.XLOOKUP($E4,'Activity 9'!$B$7:$B$13,'Activity 9'!M$7:M$13,\"N/A\",0,1)","v":"N/A"},{"$f":"_xlfn.XLOOKUP($E4,'Activity 9'!$B$7:$B$13,'Activity 9'!N$7:N$13,\"N/A\",0,1)","v":"N/A"},{"$f":"_xlfn.XLOOKUP($E4,'Activity 9'!$B$7:$B$13,'Activity 9'!O$7:O$13,\"N/A\",0,1)","v":"N/A"},{"$f":"_xlfn.XLOOKUP($E4,'Activity 9'!$B$17:$B$23,'Activity 9'!C$17:C$23,\"N/A\",0,1)","v":"N/A"},{"$f":"_xlfn.XLOOKUP($E4,'Activity 9'!$B$17:$B$23,'Activity 9'!D$17:D$23,\"N/A\",0,1)","v":"N/A"},{"$f":"_xlfn.XLOOKUP($E4,'Activity 9'!$B$17:$B$23,'Activity 9'!E$17:E$23,\"N/A\",0,1)","v":"N/A"},{"$f":"_xlfn.XLOOKUP($E4,'Activity 9'!$B$17:$B$23,'Activity 9'!F$17:F$23,\"N/A\",0,1)","v":"N/A"},{"$f":"_xlfn.XLOOKUP($E4,'Activity 9'!$B$17:$B$23,'Activity 9'!G$17:G$23,\"N/A\",0,1)","v":"N/A"},{"$f":"_xlfn.XLOOKUP($E4,'Activity 9'!$B$17:$B$23,'Activity 9'!H$17:H$23,\"N/A\",0,1)","v":"N/A"},{"$f":"_xlfn.XLOOKUP($E4,'Activity 9'!$B$17:$B$23,'Activity 9'!I$17:I$23,\"N/A\",0,1)","v":"N/A"},{"$f":"_xlfn.XLOOKUP($E4,'Activity 9'!$B$17:$B$23,'Activity 9'!J$17:J$23,\"N/A\",0,1)","v":"N/A"},{"$f":"_xlfn.XLOOKUP($E4,'Activity 9'!$B$17:$B$23,'Activity 9'!L$17:L$23,\"N/A\",0,1)","v":"N/A"},{"$f":"_xlfn.XLOOKUP($E4,'Activity 9'!$B$17:$B$23,'Activity 9'!M$17:M$23,\"N/A\",0,1)","v":"N/A"},{"$f":"_xlfn.XLOOKUP($E4,'Activity 9'!$B$17:$B$23,'Activity 9'!O$17:O$23,\"N/A\",0,1)","v":"N/A"},{"$f":"_xlfn.XLOOKUP($E4,'Activity 10'!B9:B15,'Activity 10'!A9:A15,\"No\",0,1)","v":"No"},{"$f":"_xlfn.XLOOKUP($E4,'Activity 10'!$B$7:$B$13,'Activity 10'!C$7:C$13,\"N/A\",0,1)","v":"N/A"},{"$f":"_xlfn.XLOOKUP($E4,'Activity 10'!$B$7:$B$13,'Activity 10'!D$7:D$13,\"N/A\",0,1)","v":"N/A"},{"$f":"_xlfn.XLOOKUP($E4,'Activity 10'!$B$7:$B$13,'Activity 10'!E$7:E$13,\"N/A\",0,1)","v":"N/A"},{"$f":"_xlfn.XLOOKUP($E4,'Activity 10'!$B$7:$B$13,'Activity 10'!F$7:F$13,\"N/A\",0,1)","v":"N/A"},{"$f":"_xlfn.XLOOKUP($E4,'Activity 10'!$B$7:$B$13,'Activity 10'!G$7:G$13,\"N/A\",0,1)","v":"N/A"},{"$f":"_xlfn.XLOOKUP($E4,'Activity 10'!$B$7:$B$13,'Activity 10'!H$7:H$13,\"N/A\",0,1)","v":"N/A"},{"$f":"_xlfn.XLOOKUP($E4,'Activity 10'!$B$7:$B$13,'Activity 10'!I$7:I$13,\"N/A\",0,1)","v":"N/A"},{"$f":"_xlfn.XLOOKUP($E4,'Activity 10'!$B$7:$B$13,'Activity 10'!J$7:J$13,\"N/A\",0,1)","v":"N/A"},{"$f":"_xlfn.XLOOKUP($E4,'Activity 10'!$B$7:$B$13,'Activity 10'!K$7:K$13,\"N/A\",0,1)","v":"N/A"},{"$f":"_xlfn.XLOOKUP($E4,'Activity 10'!$B$7:$B$13,'Activity 10'!L$7:L$13,\"N/A\",0,1)","v":"N/A"},{"$f":"_xlfn.XLOOKUP($E4,'Activity 10'!$B$7:$B$13,'Activity 10'!M$7:M$13,\"N/A\",0,1)","v":"N/A"},{"$f":"_xlfn.XLOOKUP($E4,'Activity 10'!$B$7:$B$13,'Activity 10'!N$7:N$13,\"N/A\",0,1)","v":"N/A"},{"$f":"_xlfn.XLOOKUP($E4,'Activity 10'!$B$7:$B$13,'Activity 10'!O$7:O$13,\"N/A\",0,1)","v":"N/A"},{"$f":"_xlfn.XLOOKUP($E4,'Activity 10'!$B$17:$B$23,'Activity 10'!C$17:C$23,\"N/A\",0,1)","v":"N/A"},{"$f":"_xlfn.XLOOKUP($E4,'Activity 10'!$B$17:$B$23,'Activity 10'!D$17:D$23,\"N/A\",0,1)","v":"N/A"},{"$f":"_xlfn.XLOOKUP($E4,'Activity 10'!$B$17:$B$23,'Activity 10'!E$17:E$23,\"N/A\",0,1)","v":"N/A"},{"$f":"_xlfn.XLOOKUP($E4,'Activity 10'!$B$17:$B$23,'Activity 10'!F$17:F$23,\"N/A\",0,1)","v":"N/A"},{"$f":"_xlfn.XLOOKUP($E4,'Activity 10'!$B$17:$B$23,'Activity 10'!G$17:G$23,\"N/A\",0,1)","v":"N/A"},{"$f":"_xlfn.XLOOKUP($E4,'Activity 10'!$B$17:$B$23,'Activity 10'!H$17:H$23,\"N/A\",0,1)","v":"N/A"},{"$f":"_xlfn.XLOOKUP($E4,'Activity 10'!$B$17:$B$23,'Activity 10'!I$17:I$23,\"N/A\",0,1)","v":"N/A"},{"$f":"_xlfn.XLOOKUP($E4,'Activity 10'!$B$17:$B$23,'Activity 10'!J$17:J$23,\"N/A\",0,1)","v":"N/A"},{"$f":"_xlfn.XLOOKUP($E4,'Activity 10'!$B$17:$B$23,'Activity 10'!K$17:K$23,\"N/A\",0,1)","v":"N/A"},{"$f":"_xlfn.XLOOKUP($E4,'Activity 10'!$B$17:$B$23,'Activity 10'!L$17:L$23,\"N/A\",0,1)","v":"N/A"},{"$f":"_xlfn.XLOOKUP($E4,'Activity 10'!$B$17:$B$23,'Activity 10'!N$17:N$23,\"N/A\",0,1)","v":"N/A"},{"$f":"_xlfn.XLOOKUP($E4,'Competitive Activity 1'!B9:B15,'Competitive Activity 1'!A9:A15,\"No\",0,1)","v":"No"},{"$f":"_xlfn.XLOOKUP($E4,'Competitive Activity 1'!$B$7:$B$13,'Competitive Activity 1'!C$7:C$13,\"N/A\",0,1)","v":"N/A"},{"$f":"_xlfn.XLOOKUP($E4,'Competitive Activity 1'!$B$7:$B$13,'Competitive Activity 1'!D$7:D$13,\"N/A\",0,1)","v":"N/A"},{"$f":"_xlfn.XLOOKUP($E4,'Competitive Activity 1'!$B$7:$B$13,'Competitive Activity 1'!E$7:E$13,\"N/A\",0,1)","v":"N/A"},{"$f":"_xlfn.XLOOKUP($E4,'Competitive Activity 1'!$B$7:$B$13,'Competitive Activity 1'!F$7:F$13,\"N/A\",0,1)","v":"N/A"},{"$f":"_xlfn.XLOOKUP($E4,'Competitive Activity 1'!$B$7:$B$13,'Competitive Activity 1'!G$7:G$13,\"N/A\",0,1)","v":"N/A"},{"$f":"_xlfn.XLOOKUP($E4,'Competitive Activity 1'!$B$7:$B$13,'Competitive Activity 1'!H$7:H$13,\"N/A\",0,1)","v":"N/A"},{"$f":"_xlfn.XLOOKUP($E4,'Competitive Activity 1'!$B$7:$B$13,'Competitive Activity 1'!I$7:I$13,\"N/A\",0,1)","v":"N/A"},{"$f":"_xlfn.XLOOKUP($E4,'Competitive Activity 1'!$B$7:$B$13,'Competitive Activity 1'!J$7:J$13,\"N/A\",0,1)","v":"N/A"},{"$f":"_xlfn.XLOOKUP($E4,'Competitive Activity 1'!$B$7:$B$13,'Competitive Activity 1'!K$7:K$13,\"N/A\",0,1)","v":"N/A"},{"$f":"_xlfn.XLOOKUP($E4,'Competitive Activity 1'!$B$7:$B$13,'Competitive Activity 1'!L$7:L$13,\"N/A\",0,1)","v":"N/A"},{"$f":"_xlfn.XLOOKUP($E4,'Competitive Activity 1'!$B$7:$B$13,'Competitive Activity 1'!M$7:M$13,\"N/A\",0,1)","v":"N/A"},{"$f":"_xlfn.XLOOKUP($E4,'Competitive Activity 1'!$B$7:$B$13,'Competitive Activity 1'!N$7:N$13,\"N/A\",0,1)","v":"N/A"},{"$f":"_xlfn.XLOOKUP($E4,'Competitive Activity 1'!$B$7:$B$13,'Competitive Activity 1'!O$7:O$13,\"N/A\",0,1)","v":"N/A"},{"$f":"_xlfn.XLOOKUP($E4,'Competitive Activity 1'!$B$7:$B$13,'Competitive Activity 1'!P$7:P$13,\"N/A\",0,1)","v":"N/A"},{"$f":"_xlfn.XLOOKUP($E4,'Competitive Activity 1'!$B$17:$B$23,'Competitive Activity 1'!C$17:C$23,\"N/A\",0,1)","v":"N/A"},{"$f":"_xlfn.XLOOKUP($E4,'Competitive Activity 1'!$B$17:$B$23,'Competitive Activity 1'!D$17:D$23,\"N/A\",0,1)","v":"N/A"},{"$f":"_xlfn.XLOOKUP($E4,'Competitive Activity 1'!$B$17:$B$23,'Competitive Activity 1'!E$17:E$23,\"N/A\",0,1)","v":"N/A"},{"$f":"_xlfn.XLOOKUP($E4,'Competitive Activity 1'!$B$17:$B$23,'Competitive Activity 1'!F$17:F$23,\"N/A\",0,1)","v":"N/A"},{"$f":"_xlfn.XLOOKUP($E4,'Competitive Activity 1'!$B$17:$B$23,'Competitive Activity 1'!G$17:G$23,\"N/A\",0,1)","v":"N/A"},{"$f":"_xlfn.XLOOKUP($E4,'Competitive Activity 1'!$B$17:$B$23,'Competitive Activity 1'!H$17:H$23,\"N/A\",0,1)","v":"N/A"},{"$f":"_xlfn.XLOOKUP($E4,'Competitive Activity 1'!$B$17:$B$23,'Competitive Activity 1'!I$17:I$23,\"N/A\",0,1)","v":"N/A"},{"$f":"_xlfn.XLOOKUP($E4,'Competitive Activity 1'!$B$17:$B$23,'Competitive Activity 1'!J$17:J$23,\"N/A\",0,1)","v":"N/A"},{"$f":"_xlfn.XLOOKUP($E4,'Competitive Activity 1'!$B$17:$B$23,'Competitive Activity 1'!K$17:K$23,\"N/A\",0,1)","v":"N/A"},{"$f":"_xlfn.XLOOKUP($E4,'Competitive Activity 1'!$B$17:$B$23,'Competitive Activity 1'!M$17:M$23,\"N/A\",0,1)","v":"N/A"},{"$f":"_xlfn.XLOOKUP($E4,'Competitive Activity 1'!$B$17:$B$23,'Competitive Activity 1'!N$17:N$23,\"N/A\",0,1)","v":"N/A"},{"$f":"_xlfn.XLOOKUP($E4,'Competitive Activity 1'!$B$17:$B$23,'Competitive Activity 1'!P$17:P$23,\"N/A\",0,1)","v":"N/A"},{"$f":"_xlfn.XLOOKUP($E4,'Competitive Activity 2'!$B$7:$B$13,'Competitive Activity 2'!$A$7:$A$13,\"No\",0,1)","v":"No"},{"$f":"_xlfn.XLOOKUP($E4,'Competitive Activity 2'!$B$7:$B$13,'Competitive Activity 2'!C$7:C$13,\"N/A\",0,1)","v":"N/A"},{"$f":"_xlfn.XLOOKUP($E4,'Competitive Activity 2'!$B$7:$B$13,'Competitive Activity 2'!D$7:D$13,\"N/A\",0,1)","v":"N/A"},{"$f":"_xlfn.XLOOKUP($E4,'Competitive Activity 2'!$B$7:$B$13,'Competitive Activity 2'!E$7:E$13,\"N/A\",0,1)","v":"N/A"},{"$f":"_xlfn.XLOOKUP($E4,'Competitive Activity 2'!$B$7:$B$13,'Competitive Activity 2'!F$7:F$13,\"N/A\",0,1)","v":"N/A"},{"$f":"_xlfn.XLOOKUP($E4,'Competitive Activity 2'!$B$7:$B$13,'Competitive Activity 2'!G$7:G$13,\"N/A\",0,1)","v":"N/A"},{"$f":"_xlfn.XLOOKUP($E4,'Competitive Activity 2'!$B$7:$B$13,'Competitive Activity 2'!H$7:H$13,\"N/A\",0,1)","v":"N/A"},{"$f":"_xlfn.XLOOKUP($E4,'Competitive Activity 2'!$B$7:$B$13,'Competitive Activity 2'!I$7:I$13,\"N/A\",0,1)","v":"N/A"},{"$f":"_xlfn.XLOOKUP($E4,'Competitive Activity 2'!$B$7:$B$13,'Competitive Activity 2'!J$7:J$13,\"N/A\",0,1)","v":"N/A"},{"$f":"_xlfn.XLOOKUP($E4,'Competitive Activity 2'!$B$7:$B$13,'Competitive Activity 2'!K$7:K$13,\"N/A\",0,1)","v":"N/A"},{"$f":"_xlfn.XLOOKUP($E4,'Competitive Activity 2'!$B$7:$B$13,'Competitive Activity 2'!L$7:L$13,\"N/A\",0,1)","v":"N/A"},{"$f":"_xlfn.XLOOKUP($E4,'Competitive Activity 2'!$B$17:$B$23,'Competitive Activity 2'!C$17:C$23,\"N/A\",0,1)","v":"N/A"},{"$f":"_xlfn.XLOOKUP($E4,'Competitive Activity 2'!$B$17:$B$23,'Competitive Activity 2'!D$17:D$23,\"N/A\",0,1)","v":"N/A"},{"$f":"_xlfn.XLOOKUP($E4,'Competitive Activity 2'!$B$17:$B$23,'Competitive Activity 2'!E$17:E$23,\"N/A\",0,1)","v":"N/A"},{"$f":"_xlfn.XLOOKUP($E4,'Competitive Activity 2'!$B$17:$B$23,'Competitive Activity 2'!F$17:F$23,\"N/A\",0,1)","v":"N/A"},{"$f":"_xlfn.XLOOKUP($E4,'Competitive Activity 2'!$B$17:$B$23,'Competitive Activity 2'!G$17:G$23,\"N/A\",0,1)","v":"N/A"},{"$f":"_xlfn.XLOOKUP($E4,'Competitive Activity 2'!$B$17:$B$23,'Competitive Activity 2'!H$17:H$23,\"N/A\",0,1)","v":"N/A"},{"$f":"_xlfn.XLOOKUP($E4,'Competitive Activity 2'!$B$17:$B$23,'Competitive Activity 2'!I$17:I$23,\"N/A\",0,1)","v":"N/A"},{"$f":"_xlfn.XLOOKUP($E4,'Competitive Activity 2'!$B$17:$B$23,'Competitive Activity 2'!J$17:J$23,\"N/A\",0,1)","v":"N/A"},{"$f":"_xlfn.XLOOKUP($E4,'Competitive Activity 2'!$B$17:$B$23,'Competitive Activity 2'!K$17:K$23,\"N/A\",0,1)","v":"N/A"},{"$f":"_xlfn.XLOOKUP($E4,'Competitive Activity 2'!$B$17:$B$23,'Competitive Activity 2'!L$17:L$23,\"N/A\",0,1)","v":"N/A"},{"$f":"_xlfn.XLOOKUP($E4,'Competitive Activity 2'!$B$17:$B$23,'Competitive Activity 2'!M$17:M$23,\"N/A\",0,1)","v":"N/A"},{"$f":"_xlfn.XLOOKUP($E4,'Competitive Activity 2'!$B$27:$B$33,'Competitive Activity 2'!C$27:C$33,\"N/A\",0,1)","v":"N/A"},{"$f":"_xlfn.XLOOKUP($E4,'Competitive Activity 2'!$B$27:$B$33,'Competitive Activity 2'!D$27:D$33,\"N/A\",0,1)","v":"N/A"},{"$f":"_xlfn.XLOOKUP($E4,'Competitive Activity 2'!$B$27:$B$33,'Competitive Activity 2'!E$27:E$33,\"N/A\",0,1)","v":"N/A"},{"$f":"_xlfn.XLOOKUP($E4,'Competitive Activity 2'!$B$27:$B$33,'Competitive Activity 2'!F$27:F$33,\"N/A\",0,1)","v":"N/A"},{"$f":"_xlfn.XLOOKUP($E4,'Competitive Activity 2'!$B$27:$B$33,'Competitive Activity 2'!G$27:G$33,\"N/A\",0,1)","v":"N/A"},{"$f":"_xlfn.XLOOKUP($E4,'Competitive Activity 2'!$B$27:$B$33,'Competitive Activity 2'!H$27:H$33,\"N/A\",0,1)","v":"N/A"},{"$f":"_xlfn.XLOOKUP($E4,'Competitive Activity 2'!$B$27:$B$33,'Competitive Activity 2'!I$27:I$33,\"N/A\",0,1)","v":"N/A"},{"$f":"_xlfn.XLOOKUP($E4,'Competitive Activity 2'!$B$27:$B$33,'Competitive Activity 2'!J$27:J$33,\"N/A\",0,1)","v":"N/A"},{"$f":"_xlfn.XLOOKUP($E4,'Competitive Activity 2'!$B$27:$B$33,'Competitive Activity 2'!L$27:L$33,\"N/A\",0,1)","v":"N/A"}]
[{"$f":"'1-Cover Sheet'!$C$8","v":0},{"$f":"'1-Cover Sheet'!$F$8","v":"Select One"},{"$f":"'Summary Sheet'!$D$8","v":0},{"$f":"'Summary Sheet'!$D$10","v":0},{"$f":"'3-Financial Summary'!A15","v":0},{"$f":"'3-Financial Summary'!B15","v":0},{"$f":"'3-Financial Summary'!C15","v":0},{"$f":"'3-Financial Summary'!D15","v":0},{"$f":"'3-Financial Summary'!E15","v":0},{"$f":"VLOOKUP(E5,'Summary Sheet'!$A$23:$L$34,11,FALSE)","v":"N/A"},{"$f":"VLOOKUP(E5,'Summary Sheet'!$A$23:$L$34,12,FALSE)","v":"N/A"},{"$f":"'3-Financial Summary'!F15","v":0},{"$f":"'3-Financial Summary'!G15","v":"00:00:00"},{"$f":"'3-Financial Summary'!H15","v":0},{"$f":"_xlfn.XLOOKUP($E5,'Activity 1'!$B$7:$B$13,'Activity 1'!$A$7:$A$13,\"No\",0,1)","v":"No"},{"$f":"_xlfn.XLOOKUP($E5,'Activity 1'!$B$7:$B$13,'Activity 1'!C10:C16,\"N/A\",0,1)","v":"N/A"},{"$f":"_xlfn.XLOOKUP($E5,'Activity 1'!$B$7:$B$13,'Activity 1'!D10:D16,\"N/A\",0,1)","v":"N/A"},{"$f":"_xlfn.XLOOKUP($E5,'Activity 1'!$B$7:$B$13,'Activity 1'!E$7:E$13,\"N/A\",0,1)","v":"N/A"},{"$f":"_xlfn.XLOOKUP($E5,'Activity 1'!$B$7:$B$13,'Activity 1'!F$7:F$13,\"N/A\",0,1)","v":"N/A"},{"$f":"_xlfn.XLOOKUP($E5,'Activity 1'!$B$7:$B$13,'Activity 1'!G$7:G$13,\"N/A\",0,1)","v":"N/A"},{"$f":"_xlfn.XLOOKUP($E5,'Activity 1'!$B$7:$B$13,'Activity 1'!H$7:H$13,\"N/A\",0,1)","v":"N/A"},{"$f":"_xlfn.XLOOKUP($E5,'Activity 1'!$B$7:$B$13,'Activity 1'!I$7:I$13,\"N/A\",0,1)","v":"N/A"},{"$f":"_xlfn.XLOOKUP($E5,'Activity 1'!$B$7:$B$13,'Activity 1'!J$7:J$13,\"N/A\",0,1)","v":"N/A"},{"$f":"_xlfn.XLOOKUP($E5,'Activity 1'!$B$7:$B$13,'Activity 1'!K$7:K$13,\"N/A\",0,1)","v":"N/A"},{"$f":"_xlfn.XLOOKUP($E5,'Activity 1'!$B$7:$B$13,'Activity 1'!L$7:L$13,\"N/A\",0,1)","v":"N/A"},{"$f":"_xlfn.XLOOKUP($E5,'Activity 1'!$B$7:$B$13,'Activity 1'!M$7:M$13,\"N/A\",0,1)","v":"N/A"},{"$f":"_xlfn.XLOOKUP($E5,'Activity 1'!$B$7:$B$13,'Activity 1'!N$7:N$13,\"N/A\",0,1)","v":"N/A"},{"$f":"_xlfn.XLOOKUP($E5,'Activity 1'!$B$7:$B$13,'Activity 1'!O$7:O$13,\"N/A\",0,1)","v":"N/A"},{"$f":"_xlfn.XLOOKUP($E5,'Activity 1'!$B$7:$B$13,'Activity 1'!P$7:P$13,\"N/A\",0,1)","v":"N/A"},{"$f":"_xlfn.XLOOKUP($E5,'Activity 1'!$B$7:$B$13,'Activity 1'!Q$7:Q$13,\"N/A\",0,1)","v":"N/A"},{"$f":"_xlfn.XLOOKUP($E5,'Activity 1'!$B$17:$B$23,'Activity 1'!C$17:C$23,\"N/A\",0,1)","v":"N/A"},{"$f":"_xlfn.XLOOKUP($E5,'Activity 1'!$B$17:$B$23,'Activity 1'!D$17:D$23,\"N/A\",0,1)","v":"N/A"},{"$f":"_xlfn.XLOOKUP($E5,'Activity 1'!$B$17:$B$23,'Activity 1'!E$17:E$23,\"N/A\",0,1)","v":"N/A"},{"$f":"_xlfn.XLOOKUP($E5,'Activity 1'!$B$17:$B$23,'Activity 1'!F$17:F$23,\"N/A\",0,1)","v":"N/A"},{"$f":"_xlfn.XLOOKUP($E5,'Activity 1'!$B$17:$B$23,'Activity 1'!G$17:G$23,\"N/A\",0,1)","v":"N/A"},{"$f":"_xlfn.XLOOKUP($E5,'Activity 1'!$B$17:$B$23,'Activity 1'!H$17:H$23,\"N/A\",0,1)","v":"N/A"},{"$f":"_xlfn.XLOOKUP($E5,'Activity 1'!$B$17:$B$23,'Activity 1'!I$17:I$23,\"N/A\",0,1)","v":"N/A"},{"$f":"_xlfn.XLOOKUP($E5,'Activity 1'!$B$17:$B$23,'Activity 1'!J$17:J$23,\"N/A\",0,1)","v":"N/A"},{"$f":"_xlfn.XLOOKUP($E5,'Activity 1'!$B$17:$B$23,'Activity 1'!K$17:K$23,\"N/A\",0,1)","v":"N/A"},{"$f":"_xlfn.XLOOKUP($E5,'Activity 1'!$B$17:$B$23,'Activity 1'!L$17:L$23,\"N/A\",0,1)","v":"N/A"},{"$f":"_xlfn.XLOOKUP($E5,'Activity 1'!$B$17:$B$23,'Activity 1'!M$17:M$23,\"N/A\",0,1)","v":"N/A"},{"$f":"_xlfn.XLOOKUP($E5,'Activity 1'!$B$17:$B$23,'Activity 1'!O$17:O$23,\"N/A\",0,1)","v":"N/A"},{"$f":"_xlfn.XLOOKUP($E5,'Activity 1'!$B$17:$B$23,'Activity 1'!Q$17:Q$23,\"N/A\",0,1)","v":"N/A"},{"$f":"_xlfn.XLOOKUP($E5,'Activity 2'!$B$7:$B$13,'Activity 2'!A$7:A$13,\"No\",0)","v":"No"},{"$f":"_xlfn.XLOOKUP($E5,'Activity 2'!$B$7:$B$13,'Activity 2'!C$7:C$13,\"N/A\",0,1)","v":"N/A"},{"$f":"_xlfn.XLOOKUP($E5,'Activity 2'!$B$7:$B$13,'Activity 2'!D$7:D$13,\"N/A\",0,1)","v":"N/A"},{"$f":"_xlfn.XLOOKUP($E5,'Activity 2'!$B$7:$B$13,'Activity 2'!E$7:E$13,\"N/A\",0,1)","v":"N/A"},{"$f":"_xlfn.XLOOKUP($E5,'Activity 2'!$B$7:$B$13,'Activity 2'!F$7:F$13,\"N/A\",0,1)","v":"N/A"},{"$f":"_xlfn.XLOOKUP($E5,'Activity 2'!$B$7:$B$13,'Activity 2'!G$7:G$13,\"N/A\",0,1)","v":"N/A"},{"$f":"_xlfn.XLOOKUP($E5,'Activity 2'!$B$7:$B$13,'Activity 2'!H$7:H$13,\"N/A\",0,1)","v":"N/A"},{"$f":"_xlfn.XLOOKUP($E5,'Activity 2'!$B$7:$B$13,'Activity 2'!I$7:I$13,\"N/A\",0,1)","v":"N/A"},{"$f":"_xlfn.XLOOKUP($E5,'Activity 2'!$B$7:$B$13,'Activity 2'!J$7:J$13,\"N/A\",0,1)","v":"N/A"},{"$f":"_xlfn.XLOOKUP($E5,'Activity 2'!$B$7:$B$13,'Activity 2'!K$7:K$13,\"N/A\",0,1)","v":"N/A"},{"$f":"_xlfn.XLOOKUP($E5,'Activity 2'!$B$7:$B$13,'Activity 2'!L$7:L$13,\"N/A\",0,1)","v":"N/A"},{"$f":"_xlfn.XLOOKUP($E5,'Activity 2'!$B$7:$B$13,'Activity 2'!M$7:M$13,\"N/A\",0,1)","v":"N/A"},{"$f":"_xlfn.XLOOKUP($E5,'Activity 2'!$B$7:$B$13,'Activity 2'!N$7:N$13,\"N/A\",0,1)","v":"N/A"},{"$f":"_xlfn.XLOOKUP($E5,'Activity 2'!$B$7:$B$13,'Activity 2'!O$7:O$13,\"N/A\",0,1)","v":"N/A"},{"$f":"_xlfn.XLOOKUP($E5,'Activity 2'!$B$7:$B$13,'Activity 2'!P$7:P$13,\"N/A\",0,1)","v":"N/A"},{"$f":"_xlfn.XLOOKUP($E5,'Activity 2'!$B$7:$B$13,'Activity 2'!Q$7:Q$13,\"N/A\",0,1)","v":"N/A"},{"$f":"_xlfn.XLOOKUP($E5,'Activity 2'!$B$17:$B$23,'Activity 2'!C$17:C$23,\"N/A\",0,1)","v":"N/A"},{"$f":"_xlfn.XLOOKUP($E5,'Activity 2'!$B$17:$B$23,'Activity 2'!D$17:D$23,\"N/A\",0,1)","v":"N/A"},{"$f":"_xlfn.XLOOKUP($E5,'Activity 2'!$B$17:$B$23,'Activity 2'!E$17:E$23,\"N/A\",0,1)","v":"N/A"},{"$f":"_xlfn.XLOOKUP($E5,'Activity 2'!$B$17:$B$23,'Activity 2'!F$17:F$23,\"N/A\",0,1)","v":"N/A"},{"$f":"_xlfn.XLOOKUP($E5,'Activity 2'!$B$17:$B$23,'Activity 2'!G$17:G$23,\"N/A\",0,1)","v":"N/A"},{"$f":"_xlfn.XLOOKUP($E5,'Activity 2'!$B$17:$B$23,'Activity 2'!H$17:H$23,\"N/A\",0,1)","v":"N/A"},{"$f":"_xlfn.XLOOKUP($E5,'Activity 2'!$B$17:$B$23,'Activity 2'!I$17:I$23,\"N/A\",0,1)","v":"N/A"},{"$f":"_xlfn.XLOOKUP($E5,'Activity 2'!$B$17:$B$23,'Activity 2'!J$17:J$23,\"N/A\",0,1)","v":"N/A"},{"$f":"_xlfn.XLOOKUP($E5,'Activity 2'!$B$17:$B$23,'Activity 2'!K$17:K$23,\"N/A\",0,1)","v":"N/A"},{"$f":"_xlfn.XLOOKUP($E5,'Activity 2'!$B$17:$B$23,'Activity 2'!L$17:L$23,\"N/A\",0,1)","v":"N/A"},{"$f":"_xlfn.XLOOKUP($E5,'Activity 2'!$B$17:$B$23,'Activity 2'!M$17:M$23,\"N/A\",0,1)","v":"N/A"},{"$f":"_xlfn.XLOOKUP($E5,'Activity 2'!$B$17:$B$23,'Activity 2'!O$17:O$23,\"N/A\",0,1)","v":"N/A"},{"$f":"_xlfn.XLOOKUP($E5,'Activity 2'!$B$17:$B$23,'Activity 2'!Q$17:Q$23,\"N/A\",0,1)","v":"N/A"},{"$f":"_xlfn.XLOOKUP($E5,'Activity 3'!$B$8:$B$14,'Activity 3'!A$8:A$14,\"No\",0,1)","v":"No"},{"$f":"_xlfn.XLOOKUP($E5,'Activity 3'!$B$8:$B$14,'Activity 3'!C$8:C$14,\"N/A\",0,1)","v":"N/A"},{"$f":"_xlfn.XLOOKUP($E5,'Activity 3'!$B$8:$B$14,'Activity 3'!D$8:D$14,\"N/A\",0,1)","v":"N/A"},{"$f":"_xlfn.XLOOKUP($E5,'Activity 3'!$B$8:$B$14,'Activity 3'!E$8:E$14,\"N/A\",0,1)","v":"N/A"},{"$f":"_xlfn.XLOOKUP($E5,'Activity 3'!$B$8:$B$14,'Activity 3'!F$8:F$14,\"N/A\",0,1)","v":"N/A"},{"$f":"_xlfn.XLOOKUP($E5,'Activity 3'!$B$8:$B$14,'Activity 3'!G$8:G$14,\"N/A\",0,1)","v":"N/A"},{"$f":"_xlfn.XLOOKUP($E5,'Activity 4'!$B$8:$B$14,'Activity 4'!A11:A17,\"No\",0,1)","v":"No"},{"$f":"_xlfn.XLOOKUP($E5,'Activity 4'!$B$8:$B$14,'Activity 4'!C$8:C$14,\"N/A\",0,1)","v":"N/A"},{"$f":"_xlfn.XLOOKUP($E5,'Activity 4'!$B$8:$B$14,'Activity 4'!D$8:D$14,\"N/A\",0,1)","v":"N/A"},{"$f":"_xlfn.XLOOKUP($E5,'Activity 4'!$B$8:$B$14,'Activity 4'!G$8:G$14,\"N/A\",0,1)","v":"N/A"},{"$f":"_xlfn.XLOOKUP($E5,'Activity 5'!$B$8:$B$14,'Activity 5'!$A$8:$A$14,\"No\",0,1)","v":"No"},{"$f":"_xlfn.XLOOKUP($E5,'Activity 5'!$B$8:$B$14,'Activity 5'!C$8:C$14,\"N/A\",0,1)","v":"N/A"},{"$f":"_xlfn.XLOOKUP($E5,'Activity 5'!$B$8:$B$14,'Activity 5'!D$8:D$14,\"N/A\",0,1)","v":"N/A"},{"$f":"_xlfn.XLOOKUP($E5,'Activity 5'!$B$8:$B$14,'Activity 5'!G$8:G$14,\"N/A\",0,1)","v":"N/A"},{"$f":"_xlfn.XLOOKUP($E5,'Activity 5'!$B$8:$B$14,'Activity 5'!H$8:H$14,\"N/A\",0,1)","v":"N/A"},{"$f":"_xlfn.XLOOKUP($E5,'Activity 5'!$B$8:$B$14,'Activity 5'!I$8:I$14,\"N/A\",0,1)","v":"N/A"},{"$f":"_xlfn.XLOOKUP($E5,'Activity 5'!$B$8:$B$14,'Activity 5'!J$8:J$14,\"N/A\",0,1)","v":"N/A"},{"$f":"_xlfn.XLOOKUP($E5,'Activity 6'!$B$7:$B$13,'Activity 6'!A$7:A$13,\"No\",0,1)","v":"No"},{"$f":"_xlfn.XLOOKUP($E5,'Activity 6'!$B$7:$B$13,'Activity 6'!C$7:C$13,\"N/A\",0,1)","v":"N/A"},{"$f":"_xlfn.XLOOKUP($E5,'Activity 6'!$B$7:$B$13,'Activity 6'!D$7:D$13,\"N/A\",0,1)","v":"N/A"},{"$f":"_xlfn.XLOOKUP($E5,'Activity 6'!$B$7:$B$13,'Activity 6'!E$7:E$13,\"N/A\",0,1)","v":"N/A"},{"$f":"_xlfn.XLOOKUP($E5,'Activity 6'!$B$7:$B$13,'Activity 6'!F$7:F$13,\"N/A\",0,1)","v":"N/A"},{"$f":"_xlfn.XLOOKUP($E5,'Activity 6'!$B$7:$B$13,'Activity 6'!G$7:G$13,\"N/A\",0,1)","v":"N/A"},{"$f":"_xlfn.XLOOKUP($E5,'Activity 6'!$B$7:$B$13,'Activity 6'!H$7:H$13,\"N/A\",0,1)","v":"N/A"},{"$f":"_xlfn.XLOOKUP($E5,'Activity 6'!$B$7:$B$13,'Activity 6'!I$7:I$13,\"N/A\",0,1)","v":"N/A"},{"$f":"_xlfn.XLOOKUP($E5,'Activity 6'!$B$7:$B$13,'Activity 6'!J$7:J$13,\"N/A\",0,1)","v":"N/A"},{"$f":"_xlfn.XLOOKUP($E5,'Activity 6'!$B$7:$B$13,'Activity 6'!K$7:K$13,\"N/A\",0,1)","v":"N/A"},{"$f":"_xlfn.XLOOKUP($E5,'Activity 6'!$B$7:$B$13,'Activity 6'!L$7:L$13,\"N/A\",0,1)","v":"N/A"},{"$f":"_xlfn.XLOOKUP($E5,'Activity 6'!$B$7:$B$13,'Activity 6'!M$7:M$13,\"N/A\",0,1)","v":"N/A"},{"$f":"IF(ISNUMBER(SEARCH(\"6\",H5)),COUNTA('Activity 6'!$D$17:$E$20),\"N/A\")","v":"N/A"},{"$f":"IF(ISNUMBER(SEARCH(6,H5)),SUM('Activity 6'!G20:G23),\"N/A\")","v":"N/A"},{"$f":"_xlfn.XLOOKUP($E5,'Activity 6'!$B$23:$B$29,'Activity 6'!C$23:C$29,\"N/A\",0,1)","v":"N/A"},{"$f":"_xlfn.XLOOKUP($E5,'Activity 6'!$B$23:$B$29,'Activity 6'!D$23:D$29,\"N/A\",0,1)","v":"N/A"},{"$f":"_xlfn.XLOOKUP($E5,'Activity 6'!$B$23:$B$29,'Activity 6'!E$23:E$29,\"N/A\",0,1)","v":"N/A"},{"$f":"_xlfn.XLOOKUP($E5,'Activity 6'!$B$23:$B$29,'Activity 6'!F$23:F$29,\"N/A\",0,1)","v":"N/A"},{"$f":"_xlfn.XLOOKUP($E5,'Activity 6'!$B$23:$B$29,'Activity 6'!G$23:G$29,\"N/A\",0,1)","v":"N/A"},{"$f":"_xlfn.XLOOKUP($E5,'Activity 6'!$B$23:$B$29,'Activity 6'!H$23:H$29,\"N/A\",0,1)","v":"N/A"},{"$f":"_xlfn.XLOOKUP($E5,'Activity 6'!$B$23:$B$29,'Activity 6'!I$23:I$29,\"N/A\",0,1)","v":"N/A"},{"$f":"_xlfn.XLOOKUP($E5,'Activity 6'!$B$23:$B$29,'Activity 6'!J$23:J$29,\"N/A\",0,1)","v":"N/A"},{"$f":"_xlfn.XLOOKUP($E5,'Activity 6'!$B$23:$B$29,'Activity 6'!K$23:K$29,\"N/A\",0,1)","v":"N/A"},{"$f":"_xlfn.XLOOKUP($E5,'Activity 6'!$B$23:$B$29,'Activity 6'!L$23:L$29,\"N/A\",0,1)","v":"N/A"},{"$f":"_xlfn.XLOOKUP($E5,'Activity 6'!$B$23:$B$29,'Activity 6'!M$23:M$29,\"N/A\",0,1)","v":"N/A"},{"$f":"_xlfn.XLOOKUP($E5,'Activity 6'!$B$23:$B$29,'Activity 6'!N$23:N$29,\"N/A\",0,1)","v":"N/A"},{"$f":"_xlfn.XLOOKUP($E5,'Activity 6'!$B$33:$B$38,'Activity 6'!C$33:C$38,\"N/A\",0,1)","v":"N/A"},{"$f":"_xlfn.XLOOKUP($E5,'Activity 6'!$B$33:$B$38,'Activity 6'!D$33:D$38,\"N/A\",0,1)","v":"N/A"},{"$f":"_xlfn.XLOOKUP($E5,'Activity 6'!$B$33:$B$38,'Activity 6'!E$33:E$38,\"N/A\",0,1)","v":"N/A"},{"$f":"_xlfn.XLOOKUP($E5,'Activity 6'!$B$33:$B$38,'Activity 6'!I$33:I$38,\"N/A\",0,1)","v":"N/A"},{"$f":"_xlfn.XLOOKUP($E5,'Activity 6'!$B$33:$B$38,'Activity 6'!G$33:G$38,\"N/A\",0,1)","v":"N/A"},{"$f":"_xlfn.XLOOKUP($E5,'Activity 6'!$B$33:$B$38,'Activity 6'!H$33:H$38,\"N/A\",0,1)","v":"N/A"},{"$f":"_xlfn.XLOOKUP($E5,'Activity 6'!$B$33:$B$38,'Activity 6'!I$33:I$38,\"N/A\",0,1)","v":"N/A"},{"$f":"_xlfn.XLOOKUP($E5,'Activity 6'!$B$33:$B$38,'Activity 6'!J$33:J$38,\"N/A\",0,1)","v":"N/A"},{"$f":"_xlfn.XLOOKUP($E5,'Activity 6'!$B$33:$B$38,'Activity 6'!K$33:K$38,\"N/A\",0,1)","v":"N/A"},{"$f":"_xlfn.XLOOKUP($E5,'Activity 6'!$B$33:$B$38,'Activity 6'!M$33:M$38,\"N/A\",0,1)","v":"N/A"},{"$f":"_xlfn.XLOOKUP($E5,'Activity 7'!$B$7:$B$13,'Activity 7'!$A$7:$A$13,\"No\",0,1)","v":"No"},{"$f":"_xlfn.XLOOKUP($E5,'Activity 7'!$B$7:$B$13,'Activity 7'!C$7:C$13,\"N/A\",0,1)","v":"N/A"},{"$f":"_xlfn.XLOOKUP($E5,'Activity 7'!$B$7:$B$13,'Activity 7'!D$7:D$13,\"N/A\",0,1)","v":"N/A"},{"$f":"_xlfn.XLOOKUP($E5,'Activity 7'!$B$7:$B$13,'Activity 7'!E$7:E$13,\"N/A\",0,1)","v":"N/A"},{"$f":"_xlfn.XLOOKUP($E5,'Activity 7'!$B$7:$B$13,'Activity 7'!F$7:F$13,\"N/A\",0,1)","v":"N/A"},{"$f":"_xlfn.XLOOKUP($E5,'Activity 7'!$B$7:$B$13,'Activity 7'!G$7:G$13,\"N/A\",0,1)","v":"N/A"},{"$f":"_xlfn.XLOOKUP($E5,'Activity 7'!$B$7:$B$13,'Activity 7'!H$7:H$13,\"N/A\",0,1)","v":"N/A"},{"$f":"_xlfn.XLOOKUP($E5,'Activity 7'!$B$7:$B$13,'Activity 7'!I$7:I$13,\"N/A\",0,1)","v":"N/A"},{"$f":"_xlfn.XLOOKUP($E5,'Activity 7'!$B$7:$B$13,'Activity 7'!J$7:J$13,\"N/A\",0,1)","v":"N/A"},{"$f":"_xlfn.XLOOKUP($E5,'Activity 7'!$B$7:$B$13,'Activity 7'!K$7:K$13,\"N/A\",0,1)","v":"N/A"},{"$f":"_xlfn.XLOOKUP($E5,'Activity 7'!$B$7:$B$13,'Activity 7'!L$7:L$13,\"N/A\",0,1)","v":"N/A"},{"$f":"_xlfn.XLOOKUP($E5,'Activity 7'!$B$7:$B$13,'Activity 7'!M$7:M$13,\"N/A\",0,1)","v":"N/A"},{"$f":"_xlfn.XLOOKUP($E5,'Activity 7'!$B$17:$B$23,'Activity 7'!C$17:C$23,\"N/A\",0,1)","v":"N/A"},{"$f":"_xlfn.XLOOKUP($E5,'Activity 7'!$B$17:$B$23,'Activity 7'!D$17:D$23,\"N/A\",0,1)","v":"N/A"},{"$f":"_xlfn.XLOOKUP($E5,'Activity 7'!$B$17:$B$23,'Activity 7'!E$17:E$23,\"N/A\",0,1)","v":"N/A"},{"$f":"_xlfn.XLOOKUP($E5,'Activity 7'!$B$17:$B$23,'Activity 7'!F$17:F$23,\"N/A\",0,1)","v":"N/A"},{"$f":"_xlfn.XLOOKUP($E5,'Activity 7'!$B$17:$B$23,'Activity 7'!G$17:G$23,\"N/A\",0,1)","v":"N/A"},{"$f":"_xlfn.XLOOKUP($E5,'Activity 7'!$B$17:$B$23,'Activity 7'!H$17:H$23,\"N/A\",0,1)","v":"N/A"},{"$f":"_xlfn.XLOOKUP($E5,'Activity 7'!$B$17:$B$23,'Activity 7'!I$17:I$23,\"N/A\",0,1)","v":"N/A"},{"$f":"_xlfn.XLOOKUP($E5,'Activity 7'!$B$17:$B$23,'Activity 7'!J$17:J$23,\"N/A\",0,1)","v":"N/A"},{"$f":"_xlfn.XLOOKUP($E5,'Activity 7'!$B$17:$B$23,'Activity 7'!L$17:L$23,\"N/A\",0,1)","v":"N/A"},{"$f":"_xlfn.XLOOKUP($E5,'Activity 8'!$B$7:$B$13,'Activity 8'!A$7:A$13,\"No\",0,1)","v":"No"},{"$f":"_xlfn.XLOOKUP($E5,'Activity 8'!$B$7:$B$13,'Activity 8'!C$7:C$13,\"N/A\",0,1)","v":"N/A"},{"$f":"_xlfn.XLOOKUP($E5,'Activity 8'!$B$7:$B$13,'Activity 8'!D$7:D$13,\"N/A\",0,1)","v":"N/A"},{"$f":"_xlfn.XLOOKUP($E5,'Activity 8'!$B$7:$B$13,'Activity 8'!E$7:E$13,\"N/A\",0,1)","v":"N/A"},{"$f":"_xlfn.XLOOKUP($E5,'Activity 8'!$B$7:$B$13,'Activity 8'!F$7:F$13,\"N/A\",0,1)","v":"N/A"},{"$f":"_xlfn.XLOOKUP($E5,'Activity 8'!$B$7:$B$13,'Activity 8'!G$7:G$13,\"N/A\",0,1)","v":"N/A"},{"$f":"_xlfn.XLOOKUP($E5,'Activity 8'!$B$7:$B$13,'Activity 8'!H$7:H$13,\"N/A\",0,1)","v":"N/A"},{"$f":"_xlfn.XLOOKUP($E5,'Activity 8'!$B$7:$B$13,'Activity 8'!I$7:I$13,\"N/A\",0,1)","v":"N/A"},{"$f":"_xlfn.XLOOKUP($E5,'Activity 8'!$B$7:$B$13,'Activity 8'!J$7:J$13,\"N/A\",0,1)","v":"N/A"},{"$f":"_xlfn.XLOOKUP($E5,'Activity 8'!$B$7:$B$13,'Activity 8'!K$7:K$13,\"N/A\",0,1)","v":"N/A"},{"$f":"_xlfn.XLOOKUP($E5,'Activity 8'!$B$7:$B$13,'Activity 8'!L$7:L$13,\"N/A\",0,1)","v":"N/A"},{"$f":"_xlfn.XLOOKUP($E5,'Activity 8'!$B$7:$B$13,'Activity 8'!M$7:M$13,\"N/A\",0,1)","v":"N/A"},{"$f":"_xlfn.XLOOKUP($E5,'Activity 8'!$B$7:$B$13,'Activity 8'!N$7:N$13,\"N/A\",0,1)","v":"N/A"},{"$f":"_xlfn.XLOOKUP($E5,'Activity 8'!$B$7:$B$13,'Activity 8'!O$7:O$13,\"N/A\",0,1)","v":"N/A"},{"$f":"_xlfn.XLOOKUP($E5,'Activity 8'!$B$7:$B$13,'Activity 8'!P$7:P$13,\"N/A\",0,1)","v":"N/A"},{"$f":"_xlfn.XLOOKUP($E5,'Activity 8'!$B$17:$B$23,'Activity 8'!C$17:C$23,\"N/A\",0,1)","v":"N/A"},{"$f":"_xlfn.XLOOKUP($E5,'Activity 8'!$B$17:$B$23,'Activity 8'!D$17:D$23,\"N/A\",0,1)","v":"N/A"},{"$f":"_xlfn.XLOOKUP($E5,'Activity 8'!$B$17:$B$23,'Activity 8'!E$17:E$23,\"N/A\",0,1)","v":"N/A"},{"$f":"_xlfn.XLOOKUP($E5,'Activity 8'!$B$17:$B$23,'Activity 8'!F$17:F$23,\"N/A\",0,1)","v":"N/A"},{"$f":"_xlfn.XLOOKUP($E5,'Activity 8'!$B$17:$B$23,'Activity 8'!G$17:G$23,\"N/A\",0,1)","v":"N/A"},{"$f":"_xlfn.XLOOKUP($E5,'Activity 8'!$B$17:$B$23,'Activity 8'!H$17:H$23,\"N/A\",0,1)","v":"N/A"},{"$f":"_xlfn.XLOOKUP($E5,'Activity 8'!$B$17:$B$23,'Activity 8'!I$17:I$23,\"N/A\",0,1)","v":"N/A"},{"$f":"_xlfn.XLOOKUP($E5,'Activity 8'!$B$17:$B$23,'Activity 8'!J$17:J$23,\"N/A\",0,1)","v":"N/A"},{"$f":"_xlfn.XLOOKUP($E5,'Activity 8'!$B$17:$B$23,'Activity 8'!K$17:K$23,\"N/A\",0,1)","v":"N/A"},{"$f":"_xlfn.XLOOKUP($E5,'Activity 8'!$B$17:$B$23,'Activity 8'!L$17:L$23,\"N/A\",0,1)","v":"N/A"},{"$f":"_xlfn.XLOOKUP($E5,'Activity 8'!$B$17:$B$23,'Activity 8'!M$17:M$23,\"N/A\",0,1)","v":"N/A"},{"$f":"_xlfn.XLOOKUP($E5,'Activity 8'!$B$17:$B$23,'Activity 8'!P$17:P$23,\"N/A\",0,1)","v":"N/A"},{"$f":"_xlfn.XLOOKUP(E5,'Activity 9'!B10:B16,'Activity 9'!A10:A16,\"No\",0,1)","v":"No"},{"$f":"_xlfn.XLOOKUP($E5,'Activity 9'!$B$7:$B$13,'Activity 9'!C$7:C$13,\"N/A\",0,1)","v":"N/A"},{"$f":"_xlfn.XLOOKUP($E5,'Activity 9'!$B$7:$B$13,'Activity 9'!D$7:D$13,\"N/A\",0,1)","v":"N/A"},{"$f":"_xlfn.XLOOKUP($E5,'Activity 9'!$B$7:$B$13,'Activity 9'!E$7:E$13,\"N/A\",0,1)","v":"N/A"},{"$f":"_xlfn.XLOOKUP($E5,'Activity 9'!$B$7:$B$13,'Activity 9'!H$7:H$13,\"N/A\",0,1)","v":"N/A"},{"$f":"_xlfn.XLOOKUP($E5,'Activity 9'!$B$7:$B$13,'Activity 9'!I$7:I$13,\"N/A\",0,1)","v":"N/A"},{"$f":"_xlfn.XLOOKUP($E5,'Activity 9'!$B$7:$B$13,'Activity 9'!J$7:J$13,\"N/A\",0,1)","v":"N/A"},{"$f":"_xlfn.XLOOKUP($E5,'Activity 9'!$B$7:$B$13,'Activity 9'!K$7:K$13,\"N/A\",0,1)","v":"N/A"},{"$f":"_xlfn.XLOOKUP($E5,'Activity 9'!$B$7:$B$13,'Activity 9'!L$7:L$13,\"N/A\",0,1)","v":"N/A"},{"$f":"_xlfn.XLOOKUP($E5,'Activity 9'!$B$7:$B$13,'Activity 9'!M$7:M$13,\"N/A\",0,1)","v":"N/A"},{"$f":"_xlfn.XLOOKUP($E5,'Activity 9'!$B$7:$B$13,'Activity 9'!N$7:N$13,\"N/A\",0,1)","v":"N/A"},{"$f":"_xlfn.XLOOKUP($E5,'Activity 9'!$B$7:$B$13,'Activity 9'!O$7:O$13,\"N/A\",0,1)","v":"N/A"},{"$f":"_xlfn.XLOOKUP($E5,'Activity 9'!$B$17:$B$23,'Activity 9'!C$17:C$23,\"N/A\",0,1)","v":"N/A"},{"$f":"_xlfn.XLOOKUP($E5,'Activity 9'!$B$17:$B$23,'Activity 9'!D$17:D$23,\"N/A\",0,1)","v":"N/A"},{"$f":"_xlfn.XLOOKUP($E5,'Activity 9'!$B$17:$B$23,'Activity 9'!E$17:E$23,\"N/A\",0,1)","v":"N/A"},{"$f":"_xlfn.XLOOKUP($E5,'Activity 9'!$B$17:$B$23,'Activity 9'!F$17:F$23,\"N/A\",0,1)","v":"N/A"},{"$f":"_xlfn.XLOOKUP($E5,'Activity 9'!$B$17:$B$23,'Activity 9'!G$17:G$23,\"N/A\",0,1)","v":"N/A"},{"$f":"_xlfn.XLOOKUP($E5,'Activity 9'!$B$17:$B$23,'Activity 9'!H$17:H$23,\"N/A\",0,1)","v":"N/A"},{"$f":"_xlfn.XLOOKUP($E5,'Activity 9'!$B$17:$B$23,'Activity 9'!I$17:I$23,\"N/A\",0,1)","v":"N/A"},{"$f":"_xlfn.XLOOKUP($E5,'Activity 9'!$B$17:$B$23,'Activity 9'!J$17:J$23,\"N/A\",0,1)","v":"N/A"},{"$f":"_xlfn.XLOOKUP($E5,'Activity 9'!$B$17:$B$23,'Activity 9'!L$17:L$23,\"N/A\",0,1)","v":"N/A"},{"$f":"_xlfn.XLOOKUP($E5,'Activity 9'!$B$17:$B$23,'Activity 9'!M$17:M$23,\"N/A\",0,1)","v":"N/A"},{"$f":"_xlfn.XLOOKUP($E5,'Activity 9'!$B$17:$B$23,'Activity 9'!O$17:O$23,\"N/A\",0,1)","v":"N/A"},{"$f":"_xlfn.XLOOKUP($E5,'Activity 10'!B10:B16,'Activity 10'!A10:A16,\"No\",0,1)","v":"No"},{"$f":"_xlfn.XLOOKUP($E5,'Activity 10'!$B$7:$B$13,'Activity 10'!C$7:C$13,\"N/A\",0,1)","v":"N/A"},{"$f":"_xlfn.XLOOKUP($E5,'Activity 10'!$B$7:$B$13,'Activity 10'!D$7:D$13,\"N/A\",0,1)","v":"N/A"},{"$f":"_xlfn.XLOOKUP($E5,'Activity 10'!$B$7:$B$13,'Activity 10'!E$7:E$13,\"N/A\",0,1)","v":"N/A"},{"$f":"_xlfn.XLOOKUP($E5,'Activity 10'!$B$7:$B$13,'Activity 10'!F$7:F$13,\"N/A\",0,1)","v":"N/A"},{"$f":"_xlfn.XLOOKUP($E5,'Activity 10'!$B$7:$B$13,'Activity 10'!G$7:G$13,\"N/A\",0,1)","v":"N/A"},{"$f":"_xlfn.XLOOKUP($E5,'Activity 10'!$B$7:$B$13,'Activity 10'!H$7:H$13,\"N/A\",0,1)","v":"N/A"},{"$f":"_xlfn.XLOOKUP($E5,'Activity 10'!$B$7:$B$13,'Activity 10'!I$7:I$13,\"N/A\",0,1)","v":"N/A"},{"$f":"_xlfn.XLOOKUP($E5,'Activity 10'!$B$7:$B$13,'Activity 10'!J$7:J$13,\"N/A\",0,1)","v":"N/A"},{"$f":"_xlfn.XLOOKUP($E5,'Activity 10'!$B$7:$B$13,'Activity 10'!K$7:K$13,\"N/A\",0,1)","v":"N/A"},{"$f":"_xlfn.XLOOKUP($E5,'Activity 10'!$B$7:$B$13,'Activity 10'!L$7:L$13,\"N/A\",0,1)","v":"N/A"},{"$f":"_xlfn.XLOOKUP($E5,'Activity 10'!$B$7:$B$13,'Activity 10'!M$7:M$13,\"N/A\",0,1)","v":"N/A"},{"$f":"_xlfn.XLOOKUP($E5,'Activity 10'!$B$7:$B$13,'Activity 10'!N$7:N$13,\"N/A\",0,1)","v":"N/A"},{"$f":"_xlfn.XLOOKUP($E5,'Activity 10'!$B$7:$B$13,'Activity 10'!O$7:O$13,\"N/A\",0,1)","v":"N/A"},{"$f":"_xlfn.XLOOKUP($E5,'Activity 10'!$B$17:$B$23,'Activity 10'!C$17:C$23,\"N/A\",0,1)","v":"N/A"},{"$f":"_xlfn.XLOOKUP($E5,'Activity 10'!$B$17:$B$23,'Activity 10'!D$17:D$23,\"N/A\",0,1)","v":"N/A"},{"$f":"_xlfn.XLOOKUP($E5,'Activity 10'!$B$17:$B$23,'Activity 10'!E$17:E$23,\"N/A\",0,1)","v":"N/A"},{"$f":"_xlfn.XLOOKUP($E5,'Activity 10'!$B$17:$B$23,'Activity 10'!F$17:F$23,\"N/A\",0,1)","v":"N/A"},{"$f":"_xlfn.XLOOKUP($E5,'Activity 10'!$B$17:$B$23,'Activity 10'!G$17:G$23,\"N/A\",0,1)","v":"N/A"},{"$f":"_xlfn.XLOOKUP($E5,'Activity 10'!$B$17:$B$23,'Activity 10'!H$17:H$23,\"N/A\",0,1)","v":"N/A"},{"$f":"_xlfn.XLOOKUP($E5,'Activity 10'!$B$17:$B$23,'Activity 10'!I$17:I$23,\"N/A\",0,1)","v":"N/A"},{"$f":"_xlfn.XLOOKUP($E5,'Activity 10'!$B$17:$B$23,'Activity 10'!J$17:J$23,\"N/A\",0,1)","v":"N/A"},{"$f":"_xlfn.XLOOKUP($E5,'Activity 10'!$B$17:$B$23,'Activity 10'!K$17:K$23,\"N/A\",0,1)","v":"N/A"},{"$f":"_xlfn.XLOOKUP($E5,'Activity 10'!$B$17:$B$23,'Activity 10'!L$17:L$23,\"N/A\",0,1)","v":"N/A"},{"$f":"_xlfn.XLOOKUP($E5,'Activity 10'!$B$17:$B$23,'Activity 10'!N$17:N$23,\"N/A\",0,1)","v":"N/A"},{"$f":"_xlfn.XLOOKUP($E5,'Competitive Activity 1'!B10:B16,'Competitive Activity 1'!A10:A16,\"No\",0,1)","v":"No"},{"$f":"_xlfn.XLOOKUP($E5,'Competitive Activity 1'!$B$7:$B$13,'Competitive Activity 1'!C$7:C$13,\"N/A\",0,1)","v":"N/A"},{"$f":"_xlfn.XLOOKUP($E5,'Competitive Activity 1'!$B$7:$B$13,'Competitive Activity 1'!D$7:D$13,\"N/A\",0,1)","v":"N/A"},{"$f":"_xlfn.XLOOKUP($E5,'Competitive Activity 1'!$B$7:$B$13,'Competitive Activity 1'!E$7:E$13,\"N/A\",0,1)","v":"N/A"},{"$f":"_xlfn.XLOOKUP($E5,'Competitive Activity 1'!$B$7:$B$13,'Competitive Activity 1'!F$7:F$13,\"N/A\",0,1)","v":"N/A"},{"$f":"_xlfn.XLOOKUP($E5,'Competitive Activity 1'!$B$7:$B$13,'Competitive Activity 1'!G$7:G$13,\"N/A\",0,1)","v":"N/A"},{"$f":"_xlfn.XLOOKUP($E5,'Competitive Activity 1'!$B$7:$B$13,'Competitive Activity 1'!H$7:H$13,\"N/A\",0,1)","v":"N/A"},{"$f":"_xlfn.XLOOKUP($E5,'Competitive Activity 1'!$B$7:$B$13,'Competitive Activity 1'!I$7:I$13,\"N/A\",0,1)","v":"N/A"},{"$f":"_xlfn.XLOOKUP($E5,'Competitive Activity 1'!$B$7:$B$13,'Competitive Activity 1'!J$7:J$13,\"N/A\",0,1)","v":"N/A"},{"$f":"_xlfn.XLOOKUP($E5,'Competitive Activity 1'!$B$7:$B$13,'Competitive Activity 1'!K$7:K$13,\"N/A\",0,1)","v":"N/A"},{"$f":"_xlfn.XLOOKUP($E5,'Competitive Activity 1'!$B$7:$B$13,'Competitive Activity 1'!L$7:L$13,\"N/A\",0,1)","v":"N/A"},{"$f":"_xlfn.XLOOKUP($E5,'Competitive Activity 1'!$B$7:$B$13,'Competitive Activity 1'!M$7:M$13,\"N/A\",0,1)","v":"N/A"},{"$f":"_xlfn.XLOOKUP($E5,'Competitive Activity 1'!$B$7:$B$13,'Competitive Activity 1'!N$7:N$13,\"N/A\",0,1)","v":"N/A"},{"$f":"_xlfn.XLOOKUP($E5,'Competitive Activity 1'!$B$7:$B$13,'Competitive Activity 1'!O$7:O$13,\"N/A\",0,1)","v":"N/A"},{"$f":"_xlfn.XLOOKUP($E5,'Competitive Activity 1'!$B$7:$B$13,'Competitive Activity 1'!P$7:P$13,\"N/A\",0,1)","v":"N/A"},{"$f":"_xlfn.XLOOKUP($E5,'Competitive Activity 1'!$B$17:$B$23,'Competitive Activity 1'!C$17:C$23,\"N/A\",0,1)","v":"N/A"},{"$f":"_xlfn.XLOOKUP($E5,'Competitive Activity 1'!$B$17:$B$23,'Competitive Activity 1'!D$17:D$23,\"N/A\",0,1)","v":"N/A"},{"$f":"_xlfn.XLOOKUP($E5,'Competitive Activity 1'!$B$17:$B$23,'Competitive Activity 1'!E$17:E$23,\"N/A\",0,1)","v":"N/A"},{"$f":"_xlfn.XLOOKUP($E5,'Competitive Activity 1'!$B$17:$B$23,'Competitive Activity 1'!F$17:F$23,\"N/A\",0,1)","v":"N/A"},{"$f":"_xlfn.XLOOKUP($E5,'Competitive Activity 1'!$B$17:$B$23,'Competitive Activity 1'!G$17:G$23,\"N/A\",0,1)","v":"N/A"},{"$f":"_xlfn.XLOOKUP($E5,'Competitive Activity 1'!$B$17:$B$23,'Competitive Activity 1'!H$17:H$23,\"N/A\",0,1)","v":"N/A"},{"$f":"_xlfn.XLOOKUP($E5,'Competitive Activity 1'!$B$17:$B$23,'Competitive Activity 1'!I$17:I$23,\"N/A\",0,1)","v":"N/A"},{"$f":"_xlfn.XLOOKUP($E5,'Competitive Activity 1'!$B$17:$B$23,'Competitive Activity 1'!J$17:J$23,\"N/A\",0,1)","v":"N/A"},{"$f":"_xlfn.XLOOKUP($E5,'Competitive Activity 1'!$B$17:$B$23,'Competitive Activity 1'!K$17:K$23,\"N/A\",0,1)","v":"N/A"},{"$f":"_xlfn.XLOOKUP($E5,'Competitive Activity 1'!$B$17:$B$23,'Competitive Activity 1'!M$17:M$23,\"N/A\",0,1)","v":"N/A"},{"$f":"_xlfn.XLOOKUP($E5,'Competitive Activity 1'!$B$17:$B$23,'Competitive Activity 1'!N$17:N$23,\"N/A\",0,1)","v":"N/A"},{"$f":"_xlfn.XLOOKUP($E5,'Competitive Activity 1'!$B$17:$B$23,'Competitive Activity 1'!P$17:P$23,\"N/A\",0,1)","v":"N/A"},{"$f":"_xlfn.XLOOKUP($E5,'Competitive Activity 2'!$B$7:$B$13,'Competitive Activity 2'!$A$7:$A$13,\"No\",0,1)","v":"No"},{"$f":"_xlfn.XLOOKUP($E5,'Competitive Activity 2'!$B$7:$B$13,'Competitive Activity 2'!C$7:C$13,\"N/A\",0,1)","v":"N/A"},{"$f":"_xlfn.XLOOKUP($E5,'Competitive Activity 2'!$B$7:$B$13,'Competitive Activity 2'!D$7:D$13,\"N/A\",0,1)","v":"N/A"},{"$f":"_xlfn.XLOOKUP($E5,'Competitive Activity 2'!$B$7:$B$13,'Competitive Activity 2'!E$7:E$13,\"N/A\",0,1)","v":"N/A"},{"$f":"_xlfn.XLOOKUP($E5,'Competitive Activity 2'!$B$7:$B$13,'Competitive Activity 2'!F$7:F$13,\"N/A\",0,1)","v":"N/A"},{"$f":"_xlfn.XLOOKUP($E5,'Competitive Activity 2'!$B$7:$B$13,'Competitive Activity 2'!G$7:G$13,\"N/A\",0,1)","v":"N/A"},{"$f":"_xlfn.XLOOKUP($E5,'Competitive Activity 2'!$B$7:$B$13,'Competitive Activity 2'!H$7:H$13,\"N/A\",0,1)","v":"N/A"},{"$f":"_xlfn.XLOOKUP($E5,'Competitive Activity 2'!$B$7:$B$13,'Competitive Activity 2'!I$7:I$13,\"N/A\",0,1)","v":"N/A"},{"$f":"_xlfn.XLOOKUP($E5,'Competitive Activity 2'!$B$7:$B$13,'Competitive Activity 2'!J$7:J$13,\"N/A\",0,1)","v":"N/A"},{"$f":"_xlfn.XLOOKUP($E5,'Competitive Activity 2'!$B$7:$B$13,'Competitive Activity 2'!K$7:K$13,\"N/A\",0,1)","v":"N/A"},{"$f":"_xlfn.XLOOKUP($E5,'Competitive Activity 2'!$B$7:$B$13,'Competitive Activity 2'!L$7:L$13,\"N/A\",0,1)","v":"N/A"},{"$f":"_xlfn.XLOOKUP($E5,'Competitive Activity 2'!$B$17:$B$23,'Competitive Activity 2'!C$17:C$23,\"N/A\",0,1)","v":"N/A"},{"$f":"_xlfn.XLOOKUP($E5,'Competitive Activity 2'!$B$17:$B$23,'Competitive Activity 2'!D$17:D$23,\"N/A\",0,1)","v":"N/A"},{"$f":"_xlfn.XLOOKUP($E5,'Competitive Activity 2'!$B$17:$B$23,'Competitive Activity 2'!E$17:E$23,\"N/A\",0,1)","v":"N/A"},{"$f":"_xlfn.XLOOKUP($E5,'Competitive Activity 2'!$B$17:$B$23,'Competitive Activity 2'!F$17:F$23,\"N/A\",0,1)","v":"N/A"},{"$f":"_xlfn.XLOOKUP($E5,'Competitive Activity 2'!$B$17:$B$23,'Competitive Activity 2'!G$17:G$23,\"N/A\",0,1)","v":"N/A"},{"$f":"_xlfn.XLOOKUP($E5,'Competitive Activity 2'!$B$17:$B$23,'Competitive Activity 2'!H$17:H$23,\"N/A\",0,1)","v":"N/A"},{"$f":"_xlfn.XLOOKUP($E5,'Competitive Activity 2'!$B$17:$B$23,'Competitive Activity 2'!I$17:I$23,\"N/A\",0,1)","v":"N/A"},{"$f":"_xlfn.XLOOKUP($E5,'Competitive Activity 2'!$B$17:$B$23,'Competitive Activity 2'!J$17:J$23,\"N/A\",0,1)","v":"N/A"},{"$f":"_xlfn.XLOOKUP($E5,'Competitive Activity 2'!$B$17:$B$23,'Competitive Activity 2'!K$17:K$23,\"N/A\",0,1)","v":"N/A"},{"$f":"_xlfn.XLOOKUP($E5,'Competitive Activity 2'!$B$17:$B$23,'Competitive Activity 2'!L$17:L$23,\"N/A\",0,1)","v":"N/A"},{"$f":"_xlfn.XLOOKUP($E5,'Competitive Activity 2'!$B$17:$B$23,'Competitive Activity 2'!M$17:M$23,\"N/A\",0,1)","v":"N/A"},{"$f":"_xlfn.XLOOKUP($E5,'Competitive Activity 2'!$B$27:$B$33,'Competitive Activity 2'!C$27:C$33,\"N/A\",0,1)","v":"N/A"},{"$f":"_xlfn.XLOOKUP($E5,'Competitive Activity 2'!$B$27:$B$33,'Competitive Activity 2'!D$27:D$33,\"N/A\",0,1)","v":"N/A"},{"$f":"_xlfn.XLOOKUP($E5,'Competitive Activity 2'!$B$27:$B$33,'Competitive Activity 2'!E$27:E$33,\"N/A\",0,1)","v":"N/A"},{"$f":"_xlfn.XLOOKUP($E5,'Competitive Activity 2'!$B$27:$B$33,'Competitive Activity 2'!F$27:F$33,\"N/A\",0,1)","v":"N/A"},{"$f":"_xlfn.XLOOKUP($E5,'Competitive Activity 2'!$B$27:$B$33,'Competitive Activity 2'!G$27:G$33,\"N/A\",0,1)","v":"N/A"},{"$f":"_xlfn.XLOOKUP($E5,'Competitive Activity 2'!$B$27:$B$33,'Competitive Activity 2'!H$27:H$33,\"N/A\",0,1)","v":"N/A"},{"$f":"_xlfn.XLOOKUP($E5,'Competitive Activity 2'!$B$27:$B$33,'Competitive Activity 2'!I$27:I$33,\"N/A\",0,1)","v":"N/A"},{"$f":"_xlfn.XLOOKUP($E5,'Competitive Activity 2'!$B$27:$B$33,'Competitive Activity 2'!J$27:J$33,\"N/A\",0,1)","v":"N/A"},{"$f":"_xlfn.XLOOKUP($E5,'Competitive Activity 2'!$B$27:$B$33,'Competitive Activity 2'!L$27:L$33,\"N/A\",0,1)","v":"N/A"}]
[{"$f":"'1-Cover Sheet'!$C$8","v":0},{"$f":"'1-Cover Sheet'!$F$8","v":"Select One"},{"$f":"'Summary Sheet'!$D$8","v":0},{"$f":"'Summary Sheet'!$D$10","v":0},{"$f":"'3-Financial Summary'!A16","v":0},{"$f":"'3-Financial Summary'!B16","v":0},{"$f":"'3-Financial Summary'!C16","v":0},{"$f":"'3-Financial Summary'!D16","v":0},{"$f":"'3-Financial Summary'!E16","v":0},{"$f":"VLOOKUP(E6,'Summary Sheet'!$A$23:$L$34,11,FALSE)","v":"N/A"},{"$f":"VLOOKUP(E6,'Summary Sheet'!$A$23:$L$34,12,FALSE)","v":"N/A"},{"$f":"'3-Financial Summary'!F16","v":0},{"$f":"'3-Financial Summary'!G16","v":"00:00:00"},{"$f":"'3-Financial Summary'!H16","v":0},{"$f":"_xlfn.XLOOKUP($E6,'Activity 1'!$B$7:$B$13,'Activity 1'!$A$7:$A$13,\"No\",0,1)","v":"No"},{"$f":"_xlfn.XLOOKUP($E6,'Activity 1'!$B$7:$B$13,'Activity 1'!C11:C17,\"N/A\",0,1)","v":"N/A"},{"$f":"_xlfn.XLOOKUP($E6,'Activity 1'!$B$7:$B$13,'Activity 1'!D11:D17,\"N/A\",0,1)","v":"N/A"},{"$f":"_xlfn.XLOOKUP($E6,'Activity 1'!$B$7:$B$13,'Activity 1'!E$7:E$13,\"N/A\",0,1)","v":"N/A"},{"$f":"_xlfn.XLOOKUP($E6,'Activity 1'!$B$7:$B$13,'Activity 1'!F$7:F$13,\"N/A\",0,1)","v":"N/A"},{"$f":"_xlfn.XLOOKUP($E6,'Activity 1'!$B$7:$B$13,'Activity 1'!G$7:G$13,\"N/A\",0,1)","v":"N/A"},{"$f":"_xlfn.XLOOKUP($E6,'Activity 1'!$B$7:$B$13,'Activity 1'!H$7:H$13,\"N/A\",0,1)","v":"N/A"},{"$f":"_xlfn.XLOOKUP($E6,'Activity 1'!$B$7:$B$13,'Activity 1'!I$7:I$13,\"N/A\",0,1)","v":"N/A"},{"$f":"_xlfn.XLOOKUP($E6,'Activity 1'!$B$7:$B$13,'Activity 1'!J$7:J$13,\"N/A\",0,1)","v":"N/A"},{"$f":"_xlfn.XLOOKUP($E6,'Activity 1'!$B$7:$B$13,'Activity 1'!K$7:K$13,\"N/A\",0,1)","v":"N/A"},{"$f":"_xlfn.XLOOKUP($E6,'Activity 1'!$B$7:$B$13,'Activity 1'!L$7:L$13,\"N/A\",0,1)","v":"N/A"},{"$f":"_xlfn.XLOOKUP($E6,'Activity 1'!$B$7:$B$13,'Activity 1'!M$7:M$13,\"N/A\",0,1)","v":"N/A"},{"$f":"_xlfn.XLOOKUP($E6,'Activity 1'!$B$7:$B$13,'Activity 1'!N$7:N$13,\"N/A\",0,1)","v":"N/A"},{"$f":"_xlfn.XLOOKUP($E6,'Activity 1'!$B$7:$B$13,'Activity 1'!O$7:O$13,\"N/A\",0,1)","v":"N/A"},{"$f":"_xlfn.XLOOKUP($E6,'Activity 1'!$B$7:$B$13,'Activity 1'!P$7:P$13,\"N/A\",0,1)","v":"N/A"},{"$f":"_xlfn.XLOOKUP($E6,'Activity 1'!$B$7:$B$13,'Activity 1'!Q$7:Q$13,\"N/A\",0,1)","v":"N/A"},{"$f":"_xlfn.XLOOKUP($E6,'Activity 1'!$B$17:$B$23,'Activity 1'!C$17:C$23,\"N/A\",0,1)","v":"N/A"},{"$f":"_xlfn.XLOOKUP($E6,'Activity 1'!$B$17:$B$23,'Activity 1'!D$17:D$23,\"N/A\",0,1)","v":"N/A"},{"$f":"_xlfn.XLOOKUP($E6,'Activity 1'!$B$17:$B$23,'Activity 1'!E$17:E$23,\"N/A\",0,1)","v":"N/A"},{"$f":"_xlfn.XLOOKUP($E6,'Activity 1'!$B$17:$B$23,'Activity 1'!F$17:F$23,\"N/A\",0,1)","v":"N/A"},{"$f":"_xlfn.XLOOKUP($E6,'Activity 1'!$B$17:$B$23,'Activity 1'!G$17:G$23,\"N/A\",0,1)","v":"N/A"},{"$f":"_xlfn.XLOOKUP($E6,'Activity 1'!$B$17:$B$23,'Activity 1'!H$17:H$23,\"N/A\",0,1)","v":"N/A"},{"$f":"_xlfn.XLOOKUP($E6,'Activity 1'!$B$17:$B$23,'Activity 1'!I$17:I$23,\"N/A\",0,1)","v":"N/A"},{"$f":"_xlfn.XLOOKUP($E6,'Activity 1'!$B$17:$B$23,'Activity 1'!J$17:J$23,\"N/A\",0,1)","v":"N/A"},{"$f":"_xlfn.XLOOKUP($E6,'Activity 1'!$B$17:$B$23,'Activity 1'!K$17:K$23,\"N/A\",0,1)","v":"N/A"},{"$f":"_xlfn.XLOOKUP($E6,'Activity 1'!$B$17:$B$23,'Activity 1'!L$17:L$23,\"N/A\",0,1)","v":"N/A"},{"$f":"_xlfn.XLOOKUP($E6,'Activity 1'!$B$17:$B$23,'Activity 1'!M$17:M$23,\"N/A\",0,1)","v":"N/A"},{"$f":"_xlfn.XLOOKUP($E6,'Activity 1'!$B$17:$B$23,'Activity 1'!O$17:O$23,\"N/A\",0,1)","v":"N/A"},{"$f":"_xlfn.XLOOKUP($E6,'Activity 1'!$B$17:$B$23,'Activity 1'!Q$17:Q$23,\"N/A\",0,1)","v":"N/A"},{"$f":"_xlfn.XLOOKUP($E6,'Activity 2'!$B$7:$B$13,'Activity 2'!A$7:A$13,\"No\",0)","v":"No"},{"$f":"_xlfn.XLOOKUP($E6,'Activity 2'!$B$7:$B$13,'Activity 2'!C$7:C$13,\"N/A\",0,1)","v":"N/A"},{"$f":"_xlfn.XLOOKUP($E6,'Activity 2'!$B$7:$B$13,'Activity 2'!D$7:D$13,\"N/A\",0,1)","v":"N/A"},{"$f":"_xlfn.XLOOKUP($E6,'Activity 2'!$B$7:$B$13,'Activity 2'!E$7:E$13,\"N/A\",0,1)","v":"N/A"},{"$f":"_xlfn.XLOOKUP($E6,'Activity 2'!$B$7:$B$13,'Activity 2'!F$7:F$13,\"N/A\",0,1)","v":"N/A"},{"$f":"_xlfn.XLOOKUP($E6,'Activity 2'!$B$7:$B$13,'Activity 2'!G$7:G$13,\"N/A\",0,1)","v":"N/A"},{"$f":"_xlfn.XLOOKUP($E6,'Activity 2'!$B$7:$B$13,'Activity 2'!H$7:H$13,\"N/A\",0,1)","v":"N/A"},{"$f":"_xlfn.XLOOKUP($E6,'Activity 2'!$B$7:$B$13,'Activity 2'!I$7:I$13,\"N/A\",0,1)","v":"N/A"},{"$f":"_xlfn.XLOOKUP($E6,'Activity 2'!$B$7:$B$13,'Activity 2'!J$7:J$13,\"N/A\",0,1)","v":"N/A"},{"$f":"_xlfn.XLOOKUP($E6,'Activity 2'!$B$7:$B$13,'Activity 2'!K$7:K$13,\"N/A\",0,1)","v":"N/A"},{"$f":"_xlfn.XLOOKUP($E6,'Activity 2'!$B$7:$B$13,'Activity 2'!L$7:L$13,\"N/A\",0,1)","v":"N/A"},{"$f":"_xlfn.XLOOKUP($E6,'Activity 2'!$B$7:$B$13,'Activity 2'!M$7:M$13,\"N/A\",0,1)","v":"N/A"},{"$f":"_xlfn.XLOOKUP($E6,'Activity 2'!$B$7:$B$13,'Activity 2'!N$7:N$13,\"N/A\",0,1)","v":"N/A"},{"$f":"_xlfn.XLOOKUP($E6,'Activity 2'!$B$7:$B$13,'Activity 2'!O$7:O$13,\"N/A\",0,1)","v":"N/A"},{"$f":"_xlfn.XLOOKUP($E6,'Activity 2'!$B$7:$B$13,'Activity 2'!P$7:P$13,\"N/A\",0,1)","v":"N/A"},{"$f":"_xlfn.XLOOKUP($E6,'Activity 2'!$B$7:$B$13,'Activity 2'!Q$7:Q$13,\"N/A\",0,1)","v":"N/A"},{"$f":"_xlfn.XLOOKUP($E6,'Activity 2'!$B$17:$B$23,'Activity 2'!C$17:C$23,\"N/A\",0,1)","v":"N/A"},{"$f":"_xlfn.XLOOKUP($E6,'Activity 2'!$B$17:$B$23,'Activity 2'!D$17:D$23,\"N/A\",0,1)","v":"N/A"},{"$f":"_xlfn.XLOOKUP($E6,'Activity 2'!$B$17:$B$23,'Activity 2'!E$17:E$23,\"N/A\",0,1)","v":"N/A"},{"$f":"_xlfn.XLOOKUP($E6,'Activity 2'!$B$17:$B$23,'Activity 2'!F$17:F$23,\"N/A\",0,1)","v":"N/A"},{"$f":"_xlfn.XLOOKUP($E6,'Activity 2'!$B$17:$B$23,'Activity 2'!G$17:G$23,\"N/A\",0,1)","v":"N/A"},{"$f":"_xlfn.XLOOKUP($E6,'Activity 2'!$B$17:$B$23,'Activity 2'!H$17:H$23,\"N/A\",0,1)","v":"N/A"},{"$f":"_xlfn.XLOOKUP($E6,'Activity 2'!$B$17:$B$23,'Activity 2'!I$17:I$23,\"N/A\",0,1)","v":"N/A"},{"$f":"_xlfn.XLOOKUP($E6,'Activity 2'!$B$17:$B$23,'Activity 2'!J$17:J$23,\"N/A\",0,1)","v":"N/A"},{"$f":"_xlfn.XLOOKUP($E6,'Activity 2'!$B$17:$B$23,'Activity 2'!K$17:K$23,\"N/A\",0,1)","v":"N/A"},{"$f":"_xlfn.XLOOKUP($E6,'Activity 2'!$B$17:$B$23,'Activity 2'!L$17:L$23,\"N/A\",0,1)","v":"N/A"},{"$f":"_xlfn.XLOOKUP($E6,'Activity 2'!$B$17:$B$23,'Activity 2'!M$17:M$23,\"N/A\",0,1)","v":"N/A"},{"$f":"_xlfn.XLOOKUP($E6,'Activity 2'!$B$17:$B$23,'Activity 2'!O$17:O$23,\"N/A\",0,1)","v":"N/A"},{"$f":"_xlfn.XLOOKUP($E6,'Activity 2'!$B$17:$B$23,'Activity 2'!Q$17:Q$23,\"N/A\",0,1)","v":"N/A"},{"$f":"_xlfn.XLOOKUP($E6,'Activity 3'!$B$8:$B$14,'Activity 3'!A$8:A$14,\"No\",0,1)","v":"No"},{"$f":"_xlfn.XLOOKUP($E6,'Activity 3'!$B$8:$B$14,'Activity 3'!C$8:C$14,\"N/A\",0,1)","v":"N/A"},{"$f":"_xlfn.XLOOKUP($E6,'Activity 3'!$B$8:$B$14,'Activity 3'!D$8:D$14,\"N/A\",0,1)","v":"N/A"},{"$f":"_xlfn.XLOOKUP($E6,'Activity 3'!$B$8:$B$14,'Activity 3'!E$8:E$14,\"N/A\",0,1)","v":"N/A"},{"$f":"_xlfn.XLOOKUP($E6,'Activity 3'!$B$8:$B$14,'Activity 3'!F$8:F$14,\"N/A\",0,1)","v":"N/A"},{"$f":"_xlfn.XLOOKUP($E6,'Activity 3'!$B$8:$B$14,'Activity 3'!G$8:G$14,\"N/A\",0,1)","v":"N/A"},{"$f":"_xlfn.XLOOKUP($E6,'Activity 4'!$B$8:$B$14,'Activity 4'!A12:A18,\"No\",0,1)","v":"No"},{"$f":"_xlfn.XLOOKUP($E6,'Activity 4'!$B$8:$B$14,'Activity 4'!C$8:C$14,\"N/A\",0,1)","v":"N/A"},{"$f":"_xlfn.XLOOKUP($E6,'Activity 4'!$B$8:$B$14,'Activity 4'!D$8:D$14,\"N/A\",0,1)","v":"N/A"},{"$f":"_xlfn.XLOOKUP($E6,'Activity 4'!$B$8:$B$14,'Activity 4'!G$8:G$14,\"N/A\",0,1)","v":"N/A"},{"$f":"_xlfn.XLOOKUP($E6,'Activity 5'!$B$8:$B$14,'Activity 5'!$A$8:$A$14,\"No\",0,1)","v":"No"},{"$f":"_xlfn.XLOOKUP($E6,'Activity 5'!$B$8:$B$14,'Activity 5'!C$8:C$14,\"N/A\",0,1)","v":"N/A"},{"$f":"_xlfn.XLOOKUP($E6,'Activity 5'!$B$8:$B$14,'Activity 5'!D$8:D$14,\"N/A\",0,1)","v":"N/A"},{"$f":"_xlfn.XLOOKUP($E6,'Activity 5'!$B$8:$B$14,'Activity 5'!G$8:G$14,\"N/A\",0,1)","v":"N/A"},{"$f":"_xlfn.XLOOKUP($E6,'Activity 5'!$B$8:$B$14,'Activity 5'!H$8:H$14,\"N/A\",0,1)","v":"N/A"},{"$f":"_xlfn.XLOOKUP($E6,'Activity 5'!$B$8:$B$14,'Activity 5'!I$8:I$14,\"N/A\",0,1)","v":"N/A"},{"$f":"_xlfn.XLOOKUP($E6,'Activity 5'!$B$8:$B$14,'Activity 5'!J$8:J$14,\"N/A\",0,1)","v":"N/A"},{"$f":"_xlfn.XLOOKUP($E6,'Activity 6'!$B$7:$B$13,'Activity 6'!A$7:A$13,\"No\",0,1)","v":"No"},{"$f":"_xlfn.XLOOKUP($E6,'Activity 6'!$B$7:$B$13,'Activity 6'!C$7:C$13,\"N/A\",0,1)","v":"N/A"},{"$f":"_xlfn.XLOOKUP($E6,'Activity 6'!$B$7:$B$13,'Activity 6'!D$7:D$13,\"N/A\",0,1)","v":"N/A"},{"$f":"_xlfn.XLOOKUP($E6,'Activity 6'!$B$7:$B$13,'Activity 6'!E$7:E$13,\"N/A\",0,1)","v":"N/A"},{"$f":"_xlfn.XLOOKUP($E6,'Activity 6'!$B$7:$B$13,'Activity 6'!F$7:F$13,\"N/A\",0,1)","v":"N/A"},{"$f":"_xlfn.XLOOKUP($E6,'Activity 6'!$B$7:$B$13,'Activity 6'!G$7:G$13,\"N/A\",0,1)","v":"N/A"},{"$f":"_xlfn.XLOOKUP($E6,'Activity 6'!$B$7:$B$13,'Activity 6'!H$7:H$13,\"N/A\",0,1)","v":"N/A"},{"$f":"_xlfn.XLOOKUP($E6,'Activity 6'!$B$7:$B$13,'Activity 6'!I$7:I$13,\"N/A\",0,1)","v":"N/A"},{"$f":"_xlfn.XLOOKUP($E6,'Activity 6'!$B$7:$B$13,'Activity 6'!J$7:J$13,\"N/A\",0,1)","v":"N/A"},{"$f":"_xlfn.XLOOKUP($E6,'Activity 6'!$B$7:$B$13,'Activity 6'!K$7:K$13,\"N/A\",0,1)","v":"N/A"},{"$f":"_xlfn.XLOOKUP($E6,'Activity 6'!$B$7:$B$13,'Activity 6'!L$7:L$13,\"N/A\",0,1)","v":"N/A"},{"$f":"_xlfn.XLOOKUP($E6,'Activity 6'!$B$7:$B$13,'Activity 6'!M$7:M$13,\"N/A\",0,1)","v":"N/A"},{"$f":"IF(ISNUMBER(SEARCH(\"6\",H6)),COUNTA('Activity 6'!$D$17:$E$20),\"N/A\")","v":"N/A"},{"$f":"IF(ISNUMBER(SEARCH(6,H6)),SUM('Activity 6'!G21:G24),\"N/A\")","v":"N/A"},{"$f":"_xlfn.XLOOKUP($E6,'Activity 6'!$B$23:$B$29,'Activity 6'!C$23:C$29,\"N/A\",0,1)","v":"N/A"},{"$f":"_xlfn.XLOOKUP($E6,'Activity 6'!$B$23:$B$29,'Activity 6'!D$23:D$29,\"N/A\",0,1)","v":"N/A"},{"$f":"_xlfn.XLOOKUP($E6,'Activity 6'!$B$23:$B$29,'Activity 6'!E$23:E$29,\"N/A\",0,1)","v":"N/A"},{"$f":"_xlfn.XLOOKUP($E6,'Activity 6'!$B$23:$B$29,'Activity 6'!F$23:F$29,\"N/A\",0,1)","v":"N/A"},{"$f":"_xlfn.XLOOKUP($E6,'Activity 6'!$B$23:$B$29,'Activity 6'!G$23:G$29,\"N/A\",0,1)","v":"N/A"},{"$f":"_xlfn.XLOOKUP($E6,'Activity 6'!$B$23:$B$29,'Activity 6'!H$23:H$29,\"N/A\",0,1)","v":"N/A"},{"$f":"_xlfn.XLOOKUP($E6,'Activity 6'!$B$23:$B$29,'Activity 6'!I$23:I$29,\"N/A\",0,1)","v":"N/A"},{"$f":"_xlfn.XLOOKUP($E6,'Activity 6'!$B$23:$B$29,'Activity 6'!J$23:J$29,\"N/A\",0,1)","v":"N/A"},{"$f":"_xlfn.XLOOKUP($E6,'Activity 6'!$B$23:$B$29,'Activity 6'!K$23:K$29,\"N/A\",0,1)","v":"N/A"},{"$f":"_xlfn.XLOOKUP($E6,'Activity 6'!$B$23:$B$29,'Activity 6'!L$23:L$29,\"N/A\",0,1)","v":"N/A"},{"$f":"_xlfn.XLOOKUP($E6,'Activity 6'!$B$23:$B$29,'Activity 6'!M$23:M$29,\"N/A\",0,1)","v":"N/A"},{"$f":"_xlfn.XLOOKUP($E6,'Activity 6'!$B$23:$B$29,'Activity 6'!N$23:N$29,\"N/A\",0,1)","v":"N/A"},{"$f":"_xlfn.XLOOKUP($E6,'Activity 6'!$B$33:$B$38,'Activity 6'!C$33:C$38,\"N/A\",0,1)","v":"N/A"},{"$f":"_xlfn.XLOOKUP($E6,'Activity 6'!$B$33:$B$38,'Activity 6'!D$33:D$38,\"N/A\",0,1)","v":"N/A"},{"$f":"_xlfn.XLOOKUP($E6,'Activity 6'!$B$33:$B$38,'Activity 6'!E$33:E$38,\"N/A\",0,1)","v":"N/A"},{"$f":"_xlfn.XLOOKUP($E6,'Activity 6'!$B$33:$B$38,'Activity 6'!I$33:I$38,\"N/A\",0,1)","v":"N/A"},{"$f":"_xlfn.XLOOKUP($E6,'Activity 6'!$B$33:$B$38,'Activity 6'!G$33:G$38,\"N/A\",0,1)","v":"N/A"},{"$f":"_xlfn.XLOOKUP($E6,'Activity 6'!$B$33:$B$38,'Activity 6'!H$33:H$38,\"N/A\",0,1)","v":"N/A"},{"$f":"_xlfn.XLOOKUP($E6,'Activity 6'!$B$33:$B$38,'Activity 6'!I$33:I$38,\"N/A\",0,1)","v":"N/A"},{"$f":"_xlfn.XLOOKUP($E6,'Activity 6'!$B$33:$B$38,'Activity 6'!J$33:J$38,\"N/A\",0,1)","v":"N/A"},{"$f":"_xlfn.XLOOKUP($E6,'Activity 6'!$B$33:$B$38,'Activity 6'!K$33:K$38,\"N/A\",0,1)","v":"N/A"},{"$f":"_xlfn.XLOOKUP($E6,'Activity 6'!$B$33:$B$38,'Activity 6'!M$33:M$38,\"N/A\",0,1)","v":"N/A"},{"$f":"_xlfn.XLOOKUP($E6,'Activity 7'!$B$7:$B$13,'Activity 7'!$A$7:$A$13,\"No\",0,1)","v":"No"},{"$f":"_xlfn.XLOOKUP($E6,'Activity 7'!$B$7:$B$13,'Activity 7'!C$7:C$13,\"N/A\",0,1)","v":"N/A"},{"$f":"_xlfn.XLOOKUP($E6,'Activity 7'!$B$7:$B$13,'Activity 7'!D$7:D$13,\"N/A\",0,1)","v":"N/A"},{"$f":"_xlfn.XLOOKUP($E6,'Activity 7'!$B$7:$B$13,'Activity 7'!E$7:E$13,\"N/A\",0,1)","v":"N/A"},{"$f":"_xlfn.XLOOKUP($E6,'Activity 7'!$B$7:$B$13,'Activity 7'!F$7:F$13,\"N/A\",0,1)","v":"N/A"},{"$f":"_xlfn.XLOOKUP($E6,'Activity 7'!$B$7:$B$13,'Activity 7'!G$7:G$13,\"N/A\",0,1)","v":"N/A"},{"$f":"_xlfn.XLOOKUP($E6,'Activity 7'!$B$7:$B$13,'Activity 7'!H$7:H$13,\"N/A\",0,1)","v":"N/A"},{"$f":"_xlfn.XLOOKUP($E6,'Activity 7'!$B$7:$B$13,'Activity 7'!I$7:I$13,\"N/A\",0,1)","v":"N/A"},{"$f":"_xlfn.XLOOKUP($E6,'Activity 7'!$B$7:$B$13,'Activity 7'!J$7:J$13,\"N/A\",0,1)","v":"N/A"},{"$f":"_xlfn.XLOOKUP($E6,'Activity 7'!$B$7:$B$13,'Activity 7'!K$7:K$13,\"N/A\",0,1)","v":"N/A"},{"$f":"_xlfn.XLOOKUP($E6,'Activity 7'!$B$7:$B$13,'Activity 7'!L$7:L$13,\"N/A\",0,1)","v":"N/A"},{"$f":"_xlfn.XLOOKUP($E6,'Activity 7'!$B$7:$B$13,'Activity 7'!M$7:M$13,\"N/A\",0,1)","v":"N/A"},{"$f":"_xlfn.XLOOKUP($E6,'Activity 7'!$B$17:$B$23,'Activity 7'!C$17:C$23,\"N/A\",0,1)","v":"N/A"},{"$f":"_xlfn.XLOOKUP($E6,'Activity 7'!$B$17:$B$23,'Activity 7'!D$17:D$23,\"N/A\",0,1)","v":"N/A"},{"$f":"_xlfn.XLOOKUP($E6,'Activity 7'!$B$17:$B$23,'Activity 7'!E$17:E$23,\"N/A\",0,1)","v":"N/A"},{"$f":"_xlfn.XLOOKUP($E6,'Activity 7'!$B$17:$B$23,'Activity 7'!F$17:F$23,\"N/A\",0,1)","v":"N/A"},{"$f":"_xlfn.XLOOKUP($E6,'Activity 7'!$B$17:$B$23,'Activity 7'!G$17:G$23,\"N/A\",0,1)","v":"N/A"},{"$f":"_xlfn.XLOOKUP($E6,'Activity 7'!$B$17:$B$23,'Activity 7'!H$17:H$23,\"N/A\",0,1)","v":"N/A"},{"$f":"_xlfn.XLOOKUP($E6,'Activity 7'!$B$17:$B$23,'Activity 7'!I$17:I$23,\"N/A\",0,1)","v":"N/A"},{"$f":"_xlfn.XLOOKUP($E6,'Activity 7'!$B$17:$B$23,'Activity 7'!J$17:J$23,\"N/A\",0,1)","v":"N/A"},{"$f":"_xlfn.XLOOKUP($E6,'Activity 7'!$B$17:$B$23,'Activity 7'!L$17:L$23,\"N/A\",0,1)","v":"N/A"},{"$f":"_xlfn.XLOOKUP($E6,'Activity 8'!$B$7:$B$13,'Activity 8'!A$7:A$13,\"No\",0,1)","v":"No"},{"$f":"_xlfn.XLOOKUP($E6,'Activity 8'!$B$7:$B$13,'Activity 8'!C$7:C$13,\"N/A\",0,1)","v":"N/A"},{"$f":"_xlfn.XLOOKUP($E6,'Activity 8'!$B$7:$B$13,'Activity 8'!D$7:D$13,\"N/A\",0,1)","v":"N/A"},{"$f":"_xlfn.XLOOKUP($E6,'Activity 8'!$B$7:$B$13,'Activity 8'!E$7:E$13,\"N/A\",0,1)","v":"N/A"},{"$f":"_xlfn.XLOOKUP($E6,'Activity 8'!$B$7:$B$13,'Activity 8'!F$7:F$13,\"N/A\",0,1)","v":"N/A"},{"$f":"_xlfn.XLOOKUP($E6,'Activity 8'!$B$7:$B$13,'Activity 8'!G$7:G$13,\"N/A\",0,1)","v":"N/A"},{"$f":"_xlfn.XLOOKUP($E6,'Activity 8'!$B$7:$B$13,'Activity 8'!H$7:H$13,\"N/A\",0,1)","v":"N/A"},{"$f":"_xlfn.XLOOKUP($E6,'Activity 8'!$B$7:$B$13,'Activity 8'!I$7:I$13,\"N/A\",0,1)","v":"N/A"},{"$f":"_xlfn.XLOOKUP($E6,'Activity 8'!$B$7:$B$13,'Activity 8'!J$7:J$13,\"N/A\",0,1)","v":"N/A"},{"$f":"_xlfn.XLOOKUP($E6,'Activity 8'!$B$7:$B$13,'Activity 8'!K$7:K$13,\"N/A\",0,1)","v":"N/A"},{"$f":"_xlfn.XLOOKUP($E6,'Activity 8'!$B$7:$B$13,'Activity 8'!L$7:L$13,\"N/A\",0,1)","v":"N/A"},{"$f":"_xlfn.XLOOKUP($E6,'Activity 8'!$B$7:$B$13,'Activity 8'!M$7:M$13,\"N/A\",0,1)","v":"N/A"},{"$f":"_xlfn.XLOOKUP($E6,'Activity 8'!$B$7:$B$13,'Activity 8'!N$7:N$13,\"N/A\",0,1)","v":"N/A"},{"$f":"_xlfn.XLOOKUP($E6,'Activity 8'!$B$7:$B$13,'Activity 8'!O$7:O$13,\"N/A\",0,1)","v":"N/A"},{"$f":"_xlfn.XLOOKUP($E6,'Activity 8'!$B$7:$B$13,'Activity 8'!P$7:P$13,\"N/A\",0,1)","v":"N/A"},{"$f":"_xlfn.XLOOKUP($E6,'Activity 8'!$B$17:$B$23,'Activity 8'!C$17:C$23,\"N/A\",0,1)","v":"N/A"},{"$f":"_xlfn.XLOOKUP($E6,'Activity 8'!$B$17:$B$23,'Activity 8'!D$17:D$23,\"N/A\",0,1)","v":"N/A"},{"$f":"_xlfn.XLOOKUP($E6,'Activity 8'!$B$17:$B$23,'Activity 8'!E$17:E$23,\"N/A\",0,1)","v":"N/A"},{"$f":"_xlfn.XLOOKUP($E6,'Activity 8'!$B$17:$B$23,'Activity 8'!F$17:F$23,\"N/A\",0,1)","v":"N/A"},{"$f":"_xlfn.XLOOKUP($E6,'Activity 8'!$B$17:$B$23,'Activity 8'!G$17:G$23,\"N/A\",0,1)","v":"N/A"},{"$f":"_xlfn.XLOOKUP($E6,'Activity 8'!$B$17:$B$23,'Activity 8'!H$17:H$23,\"N/A\",0,1)","v":"N/A"},{"$f":"_xlfn.XLOOKUP($E6,'Activity 8'!$B$17:$B$23,'Activity 8'!I$17:I$23,\"N/A\",0,1)","v":"N/A"},{"$f":"_xlfn.XLOOKUP($E6,'Activity 8'!$B$17:$B$23,'Activity 8'!J$17:J$23,\"N/A\",0,1)","v":"N/A"},{"$f":"_xlfn.XLOOKUP($E6,'Activity 8'!$B$17:$B$23,'Activity 8'!K$17:K$23,\"N/A\",0,1)","v":"N/A"},{"$f":"_xlfn.XLOOKUP($E6,'Activity 8'!$B$17:$B$23,'Activity 8'!L$17:L$23,\"N/A\",0,1)","v":"N/A"},{"$f":"_xlfn.XLOOKUP($E6,'Activity 8'!$B$17:$B$23,'Activity 8'!M$17:M$23,\"N/A\",0,1)","v":"N/A"},{"$f":"_xlfn.XLOOKUP($E6,'Activity 8'!$B$17:$B$23,'Activity 8'!P$17:P$23,\"N/A\",0,1)","v":"N/A"},{"$f":"_xlfn.XLOOKUP(E6,'Activity 9'!B11:B17,'Activity 9'!A11:A17,\"No\",0,1)","v":"No"},{"$f":"_xlfn.XLOOKUP($E6,'Activity 9'!$B$7:$B$13,'Activity 9'!C$7:C$13,\"N/A\",0,1)","v":"N/A"},{"$f":"_xlfn.XLOOKUP($E6,'Activity 9'!$B$7:$B$13,'Activity 9'!D$7:D$13,\"N/A\",0,1)","v":"N/A"},{"$f":"_xlfn.XLOOKUP($E6,'Activity 9'!$B$7:$B$13,'Activity 9'!E$7:E$13,\"N/A\",0,1)","v":"N/A"},{"$f":"_xlfn.XLOOKUP($E6,'Activity 9'!$B$7:$B$13,'Activity 9'!H$7:H$13,\"N/A\",0,1)","v":"N/A"},{"$f":"_xlfn.XLOOKUP($E6,'Activity 9'!$B$7:$B$13,'Activity 9'!I$7:I$13,\"N/A\",0,1)","v":"N/A"},{"$f":"_xlfn.XLOOKUP($E6,'Activity 9'!$B$7:$B$13,'Activity 9'!J$7:J$13,\"N/A\",0,1)","v":"N/A"},{"$f":"_xlfn.XLOOKUP($E6,'Activity 9'!$B$7:$B$13,'Activity 9'!K$7:K$13,\"N/A\",0,1)","v":"N/A"},{"$f":"_xlfn.XLOOKUP($E6,'Activity 9'!$B$7:$B$13,'Activity 9'!L$7:L$13,\"N/A\",0,1)","v":"N/A"},{"$f":"_xlfn.XLOOKUP($E6,'Activity 9'!$B$7:$B$13,'Activity 9'!M$7:M$13,\"N/A\",0,1)","v":"N/A"},{"$f":"_xlfn.XLOOKUP($E6,'Activity 9'!$B$7:$B$13,'Activity 9'!N$7:N$13,\"N/A\",0,1)","v":"N/A"},{"$f":"_xlfn.XLOOKUP($E6,'Activity 9'!$B$7:$B$13,'Activity 9'!O$7:O$13,\"N/A\",0,1)","v":"N/A"},{"$f":"_xlfn.XLOOKUP($E6,'Activity 9'!$B$17:$B$23,'Activity 9'!C$17:C$23,\"N/A\",0,1)","v":"N/A"},{"$f":"_xlfn.XLOOKUP($E6,'Activity 9'!$B$17:$B$23,'Activity 9'!D$17:D$23,\"N/A\",0,1)","v":"N/A"},{"$f":"_xlfn.XLOOKUP($E6,'Activity 9'!$B$17:$B$23,'Activity 9'!E$17:E$23,\"N/A\",0,1)","v":"N/A"},{"$f":"_xlfn.XLOOKUP($E6,'Activity 9'!$B$17:$B$23,'Activity 9'!F$17:F$23,\"N/A\",0,1)","v":"N/A"},{"$f":"_xlfn.XLOOKUP($E6,'Activity 9'!$B$17:$B$23,'Activity 9'!G$17:G$23,\"N/A\",0,1)","v":"N/A"},{"$f":"_xlfn.XLOOKUP($E6,'Activity 9'!$B$17:$B$23,'Activity 9'!H$17:H$23,\"N/A\",0,1)","v":"N/A"},{"$f":"_xlfn.XLOOKUP($E6,'Activity 9'!$B$17:$B$23,'Activity 9'!I$17:I$23,\"N/A\",0,1)","v":"N/A"},{"$f":"_xlfn.XLOOKUP($E6,'Activity 9'!$B$17:$B$23,'Activity 9'!J$17:J$23,\"N/A\",0,1)","v":"N/A"},{"$f":"_xlfn.XLOOKUP($E6,'Activity 9'!$B$17:$B$23,'Activity 9'!L$17:L$23,\"N/A\",0,1)","v":"N/A"},{"$f":"_xlfn.XLOOKUP($E6,'Activity 9'!$B$17:$B$23,'Activity 9'!M$17:M$23,\"N/A\",0,1)","v":"N/A"},{"$f":"_xlfn.XLOOKUP($E6,'Activity 9'!$B$17:$B$23,'Activity 9'!O$17:O$23,\"N/A\",0,1)","v":"N/A"},{"$f":"_xlfn.XLOOKUP($E6,'Activity 10'!B11:B17,'Activity 10'!A11:A17,\"No\",0,1)","v":"No"},{"$f":"_xlfn.XLOOKUP($E6,'Activity 10'!$B$7:$B$13,'Activity 10'!C$7:C$13,\"N/A\",0,1)","v":"N/A"},{"$f":"_xlfn.XLOOKUP($E6,'Activity 10'!$B$7:$B$13,'Activity 10'!D$7:D$13,\"N/A\",0,1)","v":"N/A"},{"$f":"_xlfn.XLOOKUP($E6,'Activity 10'!$B$7:$B$13,'Activity 10'!E$7:E$13,\"N/A\",0,1)","v":"N/A"},{"$f":"_xlfn.XLOOKUP($E6,'Activity 10'!$B$7:$B$13,'Activity 10'!F$7:F$13,\"N/A\",0,1)","v":"N/A"},{"$f":"_xlfn.XLOOKUP($E6,'Activity 10'!$B$7:$B$13,'Activity 10'!G$7:G$13,\"N/A\",0,1)","v":"N/A"},{"$f":"_xlfn.XLOOKUP($E6,'Activity 10'!$B$7:$B$13,'Activity 10'!H$7:H$13,\"N/A\",0,1)","v":"N/A"},{"$f":"_xlfn.XLOOKUP($E6,'Activity 10'!$B$7:$B$13,'Activity 10'!I$7:I$13,\"N/A\",0,1)","v":"N/A"},{"$f":"_xlfn.XLOOKUP($E6,'Activity 10'!$B$7:$B$13,'Activity 10'!J$7:J$13,\"N/A\",0,1)","v":"N/A"},{"$f":"_xlfn.XLOOKUP($E6,'Activity 10'!$B$7:$B$13,'Activity 10'!K$7:K$13,\"N/A\",0,1)","v":"N/A"},{"$f":"_xlfn.XLOOKUP($E6,'Activity 10'!$B$7:$B$13,'Activity 10'!L$7:L$13,\"N/A\",0,1)","v":"N/A"},{"$f":"_xlfn.XLOOKUP($E6,'Activity 10'!$B$7:$B$13,'Activity 10'!M$7:M$13,\"N/A\",0,1)","v":"N/A"},{"$f":"_xlfn.XLOOKUP($E6,'Activity 10'!$B$7:$B$13,'Activity 10'!N$7:N$13,\"N/A\",0,1)","v":"N/A"},{"$f":"_xlfn.XLOOKUP($E6,'Activity 10'!$B$7:$B$13,'Activity 10'!O$7:O$13,\"N/A\",0,1)","v":"N/A"},{"$f":"_xlfn.XLOOKUP($E6,'Activity 10'!$B$17:$B$23,'Activity 10'!C$17:C$23,\"N/A\",0,1)","v":"N/A"},{"$f":"_xlfn.XLOOKUP($E6,'Activity 10'!$B$17:$B$23,'Activity 10'!D$17:D$23,\"N/A\",0,1)","v":"N/A"},{"$f":"_xlfn.XLOOKUP($E6,'Activity 10'!$B$17:$B$23,'Activity 10'!E$17:E$23,\"N/A\",0,1)","v":"N/A"},{"$f":"_xlfn.XLOOKUP($E6,'Activity 10'!$B$17:$B$23,'Activity 10'!F$17:F$23,\"N/A\",0,1)","v":"N/A"},{"$f":"_xlfn.XLOOKUP($E6,'Activity 10'!$B$17:$B$23,'Activity 10'!G$17:G$23,\"N/A\",0,1)","v":"N/A"},{"$f":"_xlfn.XLOOKUP($E6,'Activity 10'!$B$17:$B$23,'Activity 10'!H$17:H$23,\"N/A\",0,1)","v":"N/A"},{"$f":"_xlfn.XLOOKUP($E6,'Activity 10'!$B$17:$B$23,'Activity 10'!I$17:I$23,\"N/A\",0,1)","v":"N/A"},{"$f":"_xlfn.XLOOKUP($E6,'Activity 10'!$B$17:$B$23,'Activity 10'!J$17:J$23,\"N/A\",0,1)","v":"N/A"},{"$f":"_xlfn.XLOOKUP($E6,'Activity 10'!$B$17:$B$23,'Activity 10'!K$17:K$23,\"N/A\",0,1)","v":"N/A"},{"$f":"_xlfn.XLOOKUP($E6,'Activity 10'!$B$17:$B$23,'Activity 10'!L$17:L$23,\"N/A\",0,1)","v":"N/A"},{"$f":"_xlfn.XLOOKUP($E6,'Activity 10'!$B$17:$B$23,'Activity 10'!N$17:N$23,\"N/A\",0,1)","v":"N/A"},{"$f":"_xlfn.XLOOKUP($E6,'Competitive Activity 1'!B11:B17,'Competitive Activity 1'!A11:A17,\"No\",0,1)","v":"No"},{"$f":"_xlfn.XLOOKUP($E6,'Competitive Activity 1'!$B$7:$B$13,'Competitive Activity 1'!C$7:C$13,\"N/A\",0,1)","v":"N/A"},{"$f":"_xlfn.XLOOKUP($E6,'Competitive Activity 1'!$B$7:$B$13,'Competitive Activity 1'!D$7:D$13,\"N/A\",0,1)","v":"N/A"},{"$f":"_xlfn.XLOOKUP($E6,'Competitive Activity 1'!$B$7:$B$13,'Competitive Activity 1'!E$7:E$13,\"N/A\",0,1)","v":"N/A"},{"$f":"_xlfn.XLOOKUP($E6,'Competitive Activity 1'!$B$7:$B$13,'Competitive Activity 1'!F$7:F$13,\"N/A\",0,1)","v":"N/A"},{"$f":"_xlfn.XLOOKUP($E6,'Competitive Activity 1'!$B$7:$B$13,'Competitive Activity 1'!G$7:G$13,\"N/A\",0,1)","v":"N/A"},{"$f":"_xlfn.XLOOKUP($E6,'Competitive Activity 1'!$B$7:$B$13,'Competitive Activity 1'!H$7:H$13,\"N/A\",0,1)","v":"N/A"},{"$f":"_xlfn.XLOOKUP($E6,'Competitive Activity 1'!$B$7:$B$13,'Competitive Activity 1'!I$7:I$13,\"N/A\",0,1)","v":"N/A"},{"$f":"_xlfn.XLOOKUP($E6,'Competitive Activity 1'!$B$7:$B$13,'Competitive Activity 1'!J$7:J$13,\"N/A\",0,1)","v":"N/A"},{"$f":"_xlfn.XLOOKUP($E6,'Competitive Activity 1'!$B$7:$B$13,'Competitive Activity 1'!K$7:K$13,\"N/A\",0,1)","v":"N/A"},{"$f":"_xlfn.XLOOKUP($E6,'Competitive Activity 1'!$B$7:$B$13,'Competitive Activity 1'!L$7:L$13,\"N/A\",0,1)","v":"N/A"},{"$f":"_xlfn.XLOOKUP($E6,'Competitive Activity 1'!$B$7:$B$13,'Competitive Activity 1'!M$7:M$13,\"N/A\",0,1)","v":"N/A"},{"$f":"_xlfn.XLOOKUP($E6,'Competitive Activity 1'!$B$7:$B$13,'Competitive Activity 1'!N$7:N$13,\"N/A\",0,1)","v":"N/A"},{"$f":"_xlfn.XLOOKUP($E6,'Competitive Activity 1'!$B$7:$B$13,'Competitive Activity 1'!O$7:O$13,\"N/A\",0,1)","v":"N/A"},{"$f":"_xlfn.XLOOKUP($E6,'Competitive Activity 1'!$B$7:$B$13,'Competitive Activity 1'!P$7:P$13,\"N/A\",0,1)","v":"N/A"},{"$f":"_xlfn.XLOOKUP($E6,'Competitive Activity 1'!$B$17:$B$23,'Competitive Activity 1'!C$17:C$23,\"N/A\",0,1)","v":"N/A"},{"$f":"_xlfn.XLOOKUP($E6,'Competitive Activity 1'!$B$17:$B$23,'Competitive Activity 1'!D$17:D$23,\"N/A\",0,1)","v":"N/A"},{"$f":"_xlfn.XLOOKUP($E6,'Competitive Activity 1'!$B$17:$B$23,'Competitive Activity 1'!E$17:E$23,\"N/A\",0,1)","v":"N/A"},{"$f":"_xlfn.XLOOKUP($E6,'Competitive Activity 1'!$B$17:$B$23,'Competitive Activity 1'!F$17:F$23,\"N/A\",0,1)","v":"N/A"},{"$f":"_xlfn.XLOOKUP($E6,'Competitive Activity 1'!$B$17:$B$23,'Competitive Activity 1'!G$17:G$23,\"N/A\",0,1)","v":"N/A"},{"$f":"_xlfn.XLOOKUP($E6,'Competitive Activity 1'!$B$17:$B$23,'Competitive Activity 1'!H$17:H$23,\"N/A\",0,1)","v":"N/A"},{"$f":"_xlfn.XLOOKUP($E6,'Competitive Activity 1'!$B$17:$B$23,'Competitive Activity 1'!I$17:I$23,\"N/A\",0,1)","v":"N/A"},{"$f":"_xlfn.XLOOKUP($E6,'Competitive Activity 1'!$B$17:$B$23,'Competitive Activity 1'!J$17:J$23,\"N/A\",0,1)","v":"N/A"},{"$f":"_xlfn.XLOOKUP($E6,'Competitive Activity 1'!$B$17:$B$23,'Competitive Activity 1'!K$17:K$23,\"N/A\",0,1)","v":"N/A"},{"$f":"_xlfn.XLOOKUP($E6,'Competitive Activity 1'!$B$17:$B$23,'Competitive Activity 1'!M$17:M$23,\"N/A\",0,1)","v":"N/A"},{"$f":"_xlfn.XLOOKUP($E6,'Competitive Activity 1'!$B$17:$B$23,'Competitive Activity 1'!N$17:N$23,\"N/A\",0,1)","v":"N/A"},{"$f":"_xlfn.XLOOKUP($E6,'Competitive Activity 1'!$B$17:$B$23,'Competitive Activity 1'!P$17:P$23,\"N/A\",0,1)","v":"N/A"},{"$f":"_xlfn.XLOOKUP($E6,'Competitive Activity 2'!$B$7:$B$13,'Competitive Activity 2'!$A$7:$A$13,\"No\",0,1)","v":"No"},{"$f":"_xlfn.XLOOKUP($E6,'Competitive Activity 2'!$B$7:$B$13,'Competitive Activity 2'!C$7:C$13,\"N/A\",0,1)","v":"N/A"},{"$f":"_xlfn.XLOOKUP($E6,'Competitive Activity 2'!$B$7:$B$13,'Competitive Activity 2'!D$7:D$13,\"N/A\",0,1)","v":"N/A"},{"$f":"_xlfn.XLOOKUP($E6,'Competitive Activity 2'!$B$7:$B$13,'Competitive Activity 2'!E$7:E$13,\"N/A\",0,1)","v":"N/A"},{"$f":"_xlfn.XLOOKUP($E6,'Competitive Activity 2'!$B$7:$B$13,'Competitive Activity 2'!F$7:F$13,\"N/A\",0,1)","v":"N/A"},{"$f":"_xlfn.XLOOKUP($E6,'Competitive Activity 2'!$B$7:$B$13,'Competitive Activity 2'!G$7:G$13,\"N/A\",0,1)","v":"N/A"},{"$f":"_xlfn.XLOOKUP($E6,'Competitive Activity 2'!$B$7:$B$13,'Competitive Activity 2'!H$7:H$13,\"N/A\",0,1)","v":"N/A"},{"$f":"_xlfn.XLOOKUP($E6,'Competitive Activity 2'!$B$7:$B$13,'Competitive Activity 2'!I$7:I$13,\"N/A\",0,1)","v":"N/A"},{"$f":"_xlfn.XLOOKUP($E6,'Competitive Activity 2'!$B$7:$B$13,'Competitive Activity 2'!J$7:J$13,\"N/A\",0,1)","v":"N/A"},{"$f":"_xlfn.XLOOKUP($E6,'Competitive Activity 2'!$B$7:$B$13,'Competitive Activity 2'!K$7:K$13,\"N/A\",0,1)","v":"N/A"},{"$f":"_xlfn.XLOOKUP($E6,'Competitive Activity 2'!$B$7:$B$13,'Competitive Activity 2'!L$7:L$13,\"N/A\",0,1)","v":"N/A"},{"$f":"_xlfn.XLOOKUP($E6,'Competitive Activity 2'!$B$17:$B$23,'Competitive Activity 2'!C$17:C$23,\"N/A\",0,1)","v":"N/A"},{"$f":"_xlfn.XLOOKUP($E6,'Competitive Activity 2'!$B$17:$B$23,'Competitive Activity 2'!D$17:D$23,\"N/A\",0,1)","v":"N/A"},{"$f":"_xlfn.XLOOKUP($E6,'Competitive Activity 2'!$B$17:$B$23,'Competitive Activity 2'!E$17:E$23,\"N/A\",0,1)","v":"N/A"},{"$f":"_xlfn.XLOOKUP($E6,'Competitive Activity 2'!$B$17:$B$23,'Competitive Activity 2'!F$17:F$23,\"N/A\",0,1)","v":"N/A"},{"$f":"_xlfn.XLOOKUP($E6,'Competitive Activity 2'!$B$17:$B$23,'Competitive Activity 2'!G$17:G$23,\"N/A\",0,1)","v":"N/A"},{"$f":"_xlfn.XLOOKUP($E6,'Competitive Activity 2'!$B$17:$B$23,'Competitive Activity 2'!H$17:H$23,\"N/A\",0,1)","v":"N/A"},{"$f":"_xlfn.XLOOKUP($E6,'Competitive Activity 2'!$B$17:$B$23,'Competitive Activity 2'!I$17:I$23,\"N/A\",0,1)","v":"N/A"},{"$f":"_xlfn.XLOOKUP($E6,'Competitive Activity 2'!$B$17:$B$23,'Competitive Activity 2'!J$17:J$23,\"N/A\",0,1)","v":"N/A"},{"$f":"_xlfn.XLOOKUP($E6,'Competitive Activity 2'!$B$17:$B$23,'Competitive Activity 2'!K$17:K$23,\"N/A\",0,1)","v":"N/A"},{"$f":"_xlfn.XLOOKUP($E6,'Competitive Activity 2'!$B$17:$B$23,'Competitive Activity 2'!L$17:L$23,\"N/A\",0,1)","v":"N/A"},{"$f":"_xlfn.XLOOKUP($E6,'Competitive Activity 2'!$B$17:$B$23,'Competitive Activity 2'!M$17:M$23,\"N/A\",0,1)","v":"N/A"},{"$f":"_xlfn.XLOOKUP($E6,'Competitive Activity 2'!$B$27:$B$33,'Competitive Activity 2'!C$27:C$33,\"N/A\",0,1)","v":"N/A"},{"$f":"_xlfn.XLOOKUP($E6,'Competitive Activity 2'!$B$27:$B$33,'Competitive Activity 2'!D$27:D$33,\"N/A\",0,1)","v":"N/A"},{"$f":"_xlfn.XLOOKUP($E6,'Competitive Activity 2'!$B$27:$B$33,'Competitive Activity 2'!E$27:E$33,\"N/A\",0,1)","v":"N/A"},{"$f":"_xlfn.XLOOKUP($E6,'Competitive Activity 2'!$B$27:$B$33,'Competitive Activity 2'!F$27:F$33,\"N/A\",0,1)","v":"N/A"},{"$f":"_xlfn.XLOOKUP($E6,'Competitive Activity 2'!$B$27:$B$33,'Competitive Activity 2'!G$27:G$33,\"N/A\",0,1)","v":"N/A"},{"$f":"_xlfn.XLOOKUP($E6,'Competitive Activity 2'!$B$27:$B$33,'Competitive Activity 2'!H$27:H$33,\"N/A\",0,1)","v":"N/A"},{"$f":"_xlfn.XLOOKUP($E6,'Competitive Activity 2'!$B$27:$B$33,'Competitive Activity 2'!I$27:I$33,\"N/A\",0,1)","v":"N/A"},{"$f":"_xlfn.XLOOKUP($E6,'Competitive Activity 2'!$B$27:$B$33,'Competitive Activity 2'!J$27:J$33,\"N/A\",0,1)","v":"N/A"},{"$f":"_xlfn.XLOOKUP($E6,'Competitive Activity 2'!$B$27:$B$33,'Competitive Activity 2'!L$27:L$33,\"N/A\",0,1)","v":"N/A"}]
[{"$f":"'1-Cover Sheet'!$C$8","v":0},{"$f":"'1-Cover Sheet'!$F$8","v":"Select One"},{"$f":"'Summary Sheet'!$D$8","v":0},{"$f":"'Summary Sheet'!$D$10","v":0},{"$f":"'3-Financial Summary'!A17","v":0},{"$f":"'3-Financial Summary'!B17","v":0},{"$f":"'3-Financial Summary'!C17","v":0},{"$f":"'3-Financial Summary'!D17","v":0},{"$f":"'3-Financial Summary'!E17","v":0},{"$f":"VLOOKUP(E7,'Summary Sheet'!$A$23:$L$34,11,FALSE)","v":"N/A"},{"$f":"VLOOKUP(E7,'Summary Sheet'!$A$23:$L$34,12,FALSE)","v":"N/A"},{"$f":"'3-Financial Summary'!F17","v":0},{"$f":"'3-Financial Summary'!G17","v":"00:00:00"},{"$f":"'3-Financial Summary'!H17","v":0},{"$f":"_xlfn.XLOOKUP($E7,'Activity 1'!$B$7:$B$13,'Activity 1'!$A$7:$A$13,\"No\",0,1)","v":"No"},{"$f":"_xlfn.XLOOKUP($E7,'Activity 1'!$B$7:$B$13,'Activity 1'!C12:C18,\"N/A\",0,1)","v":"N/A"},{"$f":"_xlfn.XLOOKUP($E7,'Activity 1'!$B$7:$B$13,'Activity 1'!D12:D18,\"N/A\",0,1)","v":"N/A"},{"$f":"_xlfn.XLOOKUP($E7,'Activity 1'!$B$7:$B$13,'Activity 1'!E$7:E$13,\"N/A\",0,1)","v":"N/A"},{"$f":"_xlfn.XLOOKUP($E7,'Activity 1'!$B$7:$B$13,'Activity 1'!F$7:F$13,\"N/A\",0,1)","v":"N/A"},{"$f":"_xlfn.XLOOKUP($E7,'Activity 1'!$B$7:$B$13,'Activity 1'!G$7:G$13,\"N/A\",0,1)","v":"N/A"},{"$f":"_xlfn.XLOOKUP($E7,'Activity 1'!$B$7:$B$13,'Activity 1'!H$7:H$13,\"N/A\",0,1)","v":"N/A"},{"$f":"_xlfn.XLOOKUP($E7,'Activity 1'!$B$7:$B$13,'Activity 1'!I$7:I$13,\"N/A\",0,1)","v":"N/A"},{"$f":"_xlfn.XLOOKUP($E7,'Activity 1'!$B$7:$B$13,'Activity 1'!J$7:J$13,\"N/A\",0,1)","v":"N/A"},{"$f":"_xlfn.XLOOKUP($E7,'Activity 1'!$B$7:$B$13,'Activity 1'!K$7:K$13,\"N/A\",0,1)","v":"N/A"},{"$f":"_xlfn.XLOOKUP($E7,'Activity 1'!$B$7:$B$13,'Activity 1'!L$7:L$13,\"N/A\",0,1)","v":"N/A"},{"$f":"_xlfn.XLOOKUP($E7,'Activity 1'!$B$7:$B$13,'Activity 1'!M$7:M$13,\"N/A\",0,1)","v":"N/A"},{"$f":"_xlfn.XLOOKUP($E7,'Activity 1'!$B$7:$B$13,'Activity 1'!N$7:N$13,\"N/A\",0,1)","v":"N/A"},{"$f":"_xlfn.XLOOKUP($E7,'Activity 1'!$B$7:$B$13,'Activity 1'!O$7:O$13,\"N/A\",0,1)","v":"N/A"},{"$f":"_xlfn.XLOOKUP($E7,'Activity 1'!$B$7:$B$13,'Activity 1'!P$7:P$13,\"N/A\",0,1)","v":"N/A"},{"$f":"_xlfn.XLOOKUP($E7,'Activity 1'!$B$7:$B$13,'Activity 1'!Q$7:Q$13,\"N/A\",0,1)","v":"N/A"},{"$f":"_xlfn.XLOOKUP($E7,'Activity 1'!$B$17:$B$23,'Activity 1'!C$17:C$23,\"N/A\",0,1)","v":"N/A"},{"$f":"_xlfn.XLOOKUP($E7,'Activity 1'!$B$17:$B$23,'Activity 1'!D$17:D$23,\"N/A\",0,1)","v":"N/A"},{"$f":"_xlfn.XLOOKUP($E7,'Activity 1'!$B$17:$B$23,'Activity 1'!E$17:E$23,\"N/A\",0,1)","v":"N/A"},{"$f":"_xlfn.XLOOKUP($E7,'Activity 1'!$B$17:$B$23,'Activity 1'!F$17:F$23,\"N/A\",0,1)","v":"N/A"},{"$f":"_xlfn.XLOOKUP($E7,'Activity 1'!$B$17:$B$23,'Activity 1'!G$17:G$23,\"N/A\",0,1)","v":"N/A"},{"$f":"_xlfn.XLOOKUP($E7,'Activity 1'!$B$17:$B$23,'Activity 1'!H$17:H$23,\"N/A\",0,1)","v":"N/A"},{"$f":"_xlfn.XLOOKUP($E7,'Activity 1'!$B$17:$B$23,'Activity 1'!I$17:I$23,\"N/A\",0,1)","v":"N/A"},{"$f":"_xlfn.XLOOKUP($E7,'Activity 1'!$B$17:$B$23,'Activity 1'!J$17:J$23,\"N/A\",0,1)","v":"N/A"},{"$f":"_xlfn.XLOOKUP($E7,'Activity 1'!$B$17:$B$23,'Activity 1'!K$17:K$23,\"N/A\",0,1)","v":"N/A"},{"$f":"_xlfn.XLOOKUP($E7,'Activity 1'!$B$17:$B$23,'Activity 1'!L$17:L$23,\"N/A\",0,1)","v":"N/A"},{"$f":"_xlfn.XLOOKUP($E7,'Activity 1'!$B$17:$B$23,'Activity 1'!M$17:M$23,\"N/A\",0,1)","v":"N/A"},{"$f":"_xlfn.XLOOKUP($E7,'Activity 1'!$B$17:$B$23,'Activity 1'!O$17:O$23,\"N/A\",0,1)","v":"N/A"},{"$f":"_xlfn.XLOOKUP($E7,'Activity 1'!$B$17:$B$23,'Activity 1'!Q$17:Q$23,\"N/A\",0,1)","v":"N/A"},{"$f":"_xlfn.XLOOKUP($E7,'Activity 2'!$B$7:$B$13,'Activity 2'!A$7:A$13,\"No\",0)","v":"No"},{"$f":"_xlfn.XLOOKUP($E7,'Activity 2'!$B$7:$B$13,'Activity 2'!C$7:C$13,\"N/A\",0,1)","v":"N/A"},{"$f":"_xlfn.XLOOKUP($E7,'Activity 2'!$B$7:$B$13,'Activity 2'!D$7:D$13,\"N/A\",0,1)","v":"N/A"},{"$f":"_xlfn.XLOOKUP($E7,'Activity 2'!$B$7:$B$13,'Activity 2'!E$7:E$13,\"N/A\",0,1)","v":"N/A"},{"$f":"_xlfn.XLOOKUP($E7,'Activity 2'!$B$7:$B$13,'Activity 2'!F$7:F$13,\"N/A\",0,1)","v":"N/A"},{"$f":"_xlfn.XLOOKUP($E7,'Activity 2'!$B$7:$B$13,'Activity 2'!G$7:G$13,\"N/A\",0,1)","v":"N/A"},{"$f":"_xlfn.XLOOKUP($E7,'Activity 2'!$B$7:$B$13,'Activity 2'!H$7:H$13,\"N/A\",0,1)","v":"N/A"},{"$f":"_xlfn.XLOOKUP($E7,'Activity 2'!$B$7:$B$13,'Activity 2'!I$7:I$13,\"N/A\",0,1)","v":"N/A"},{"$f":"_xlfn.XLOOKUP($E7,'Activity 2'!$B$7:$B$13,'Activity 2'!J$7:J$13,\"N/A\",0,1)","v":"N/A"},{"$f":"_xlfn.XLOOKUP($E7,'Activity 2'!$B$7:$B$13,'Activity 2'!K$7:K$13,\"N/A\",0,1)","v":"N/A"},{"$f":"_xlfn.XLOOKUP($E7,'Activity 2'!$B$7:$B$13,'Activity 2'!L$7:L$13,\"N/A\",0,1)","v":"N/A"},{"$f":"_xlfn.XLOOKUP($E7,'Activity 2'!$B$7:$B$13,'Activity 2'!M$7:M$13,\"N/A\",0,1)","v":"N/A"},{"$f":"_xlfn.XLOOKUP($E7,'Activity 2'!$B$7:$B$13,'Activity 2'!N$7:N$13,\"N/A\",0,1)","v":"N/A"},{"$f":"_xlfn.XLOOKUP($E7,'Activity 2'!$B$7:$B$13,'Activity 2'!O$7:O$13,\"N/A\",0,1)","v":"N/A"},{"$f":"_xlfn.XLOOKUP($E7,'Activity 2'!$B$7:$B$13,'Activity 2'!P$7:P$13,\"N/A\",0,1)","v":"N/A"},{"$f":"_xlfn.XLOOKUP($E7,'Activity 2'!$B$7:$B$13,'Activity 2'!Q$7:Q$13,\"N/A\",0,1)","v":"N/A"},{"$f":"_xlfn.XLOOKUP($E7,'Activity 2'!$B$17:$B$23,'Activity 2'!C$17:C$23,\"N/A\",0,1)","v":"N/A"},{"$f":"_xlfn.XLOOKUP($E7,'Activity 2'!$B$17:$B$23,'Activity 2'!D$17:D$23,\"N/A\",0,1)","v":"N/A"},{"$f":"_xlfn.XLOOKUP($E7,'Activity 2'!$B$17:$B$23,'Activity 2'!E$17:E$23,\"N/A\",0,1)","v":"N/A"},{"$f":"_xlfn.XLOOKUP($E7,'Activity 2'!$B$17:$B$23,'Activity 2'!F$17:F$23,\"N/A\",0,1)","v":"N/A"},{"$f":"_xlfn.XLOOKUP($E7,'Activity 2'!$B$17:$B$23,'Activity 2'!G$17:G$23,\"N/A\",0,1)","v":"N/A"},{"$f":"_xlfn.XLOOKUP($E7,'Activity 2'!$B$17:$B$23,'Activity 2'!H$17:H$23,\"N/A\",0,1)","v":"N/A"},{"$f":"_xlfn.XLOOKUP($E7,'Activity 2'!$B$17:$B$23,'Activity 2'!I$17:I$23,\"N/A\",0,1)","v":"N/A"},{"$f":"_xlfn.XLOOKUP($E7,'Activity 2'!$B$17:$B$23,'Activity 2'!J$17:J$23,\"N/A\",0,1)","v":"N/A"},{"$f":"_xlfn.XLOOKUP($E7,'Activity 2'!$B$17:$B$23,'Activity 2'!K$17:K$23,\"N/A\",0,1)","v":"N/A"},{"$f":"_xlfn.XLOOKUP($E7,'Activity 2'!$B$17:$B$23,'Activity 2'!L$17:L$23,\"N/A\",0,1)","v":"N/A"},{"$f":"_xlfn.XLOOKUP($E7,'Activity 2'!$B$17:$B$23,'Activity 2'!M$17:M$23,\"N/A\",0,1)","v":"N/A"},{"$f":"_xlfn.XLOOKUP($E7,'Activity 2'!$B$17:$B$23,'Activity 2'!O$17:O$23,\"N/A\",0,1)","v":"N/A"},{"$f":"_xlfn.XLOOKUP($E7,'Activity 2'!$B$17:$B$23,'Activity 2'!Q$17:Q$23,\"N/A\",0,1)","v":"N/A"},{"$f":"_xlfn.XLOOKUP($E7,'Activity 3'!$B$8:$B$14,'Activity 3'!A$8:A$14,\"No\",0,1)","v":"No"},{"$f":"_xlfn.XLOOKUP($E7,'Activity 3'!$B$8:$B$14,'Activity 3'!C$8:C$14,\"N/A\",0,1)","v":"N/A"},{"$f":"_xlfn.XLOOKUP($E7,'Activity 3'!$B$8:$B$14,'Activity 3'!D$8:D$14,\"N/A\",0,1)","v":"N/A"},{"$f":"_xlfn.XLOOKUP($E7,'Activity 3'!$B$8:$B$14,'Activity 3'!E$8:E$14,\"N/A\",0,1)","v":"N/A"},{"$f":"_xlfn.XLOOKUP($E7,'Activity 3'!$B$8:$B$14,'Activity 3'!F$8:F$14,\"N/A\",0,1)","v":"N/A"},{"$f":"_xlfn.XLOOKUP($E7,'Activity 3'!$B$8:$B$14,'Activity 3'!G$8:G$14,\"N/A\",0,1)","v":"N/A"},{"$f":"_xlfn.XLOOKUP($E7,'Activity 4'!$B$8:$B$14,'Activity 4'!A13:A19,\"No\",0,1)","v":"No"},{"$f":"_xlfn.XLOOKUP($E7,'Activity 4'!$B$8:$B$14,'Activity 4'!C$8:C$14,\"N/A\",0,1)","v":"N/A"},{"$f":"_xlfn.XLOOKUP($E7,'Activity 4'!$B$8:$B$14,'Activity 4'!D$8:D$14,\"N/A\",0,1)","v":"N/A"},{"$f":"_xlfn.XLOOKUP($E7,'Activity 4'!$B$8:$B$14,'Activity 4'!G$8:G$14,\"N/A\",0,1)","v":"N/A"},{"$f":"_xlfn.XLOOKUP($E7,'Activity 5'!$B$8:$B$14,'Activity 5'!$A$8:$A$14,\"No\",0,1)","v":"No"},{"$f":"_xlfn.XLOOKUP($E7,'Activity 5'!$B$8:$B$14,'Activity 5'!C$8:C$14,\"N/A\",0,1)","v":"N/A"},{"$f":"_xlfn.XLOOKUP($E7,'Activity 5'!$B$8:$B$14,'Activity 5'!D$8:D$14,\"N/A\",0,1)","v":"N/A"},{"$f":"_xlfn.XLOOKUP($E7,'Activity 5'!$B$8:$B$14,'Activity 5'!G$8:G$14,\"N/A\",0,1)","v":"N/A"},{"$f":"_xlfn.XLOOKUP($E7,'Activity 5'!$B$8:$B$14,'Activity 5'!H$8:H$14,\"N/A\",0,1)","v":"N/A"},{"$f":"_xlfn.XLOOKUP($E7,'Activity 5'!$B$8:$B$14,'Activity 5'!I$8:I$14,\"N/A\",0,1)","v":"N/A"},{"$f":"_xlfn.XLOOKUP($E7,'Activity 5'!$B$8:$B$14,'Activity 5'!J$8:J$14,\"N/A\",0,1)","v":"N/A"},{"$f":"_xlfn.XLOOKUP($E7,'Activity 6'!$B$7:$B$13,'Activity 6'!A$7:A$13,\"No\",0,1)","v":"No"},{"$f":"_xlfn.XLOOKUP($E7,'Activity 6'!$B$7:$B$13,'Activity 6'!C$7:C$13,\"N/A\",0,1)","v":"N/A"},{"$f":"_xlfn.XLOOKUP($E7,'Activity 6'!$B$7:$B$13,'Activity 6'!D$7:D$13,\"N/A\",0,1)","v":"N/A"},{"$f":"_xlfn.XLOOKUP($E7,'Activity 6'!$B$7:$B$13,'Activity 6'!E$7:E$13,\"N/A\",0,1)","v":"N/A"},{"$f":"_xlfn.XLOOKUP($E7,'Activity 6'!$B$7:$B$13,'Activity 6'!F$7:F$13,\"N/A\",0,1)","v":"N/A"},{"$f":"_xlfn.XLOOKUP($E7,'Activity 6'!$B$7:$B$13,'Activity 6'!G$7:G$13,\"N/A\",0,1)","v":"N/A"},{"$f":"_xlfn.XLOOKUP($E7,'Activity 6'!$B$7:$B$13,'Activity 6'!H$7:H$13,\"N/A\",0,1)","v":"N/A"},{"$f":"_xlfn.XLOOKUP($E7,'Activity 6'!$B$7:$B$13,'Activity 6'!I$7:I$13,\"N/A\",0,1)","v":"N/A"},{"$f":"_xlfn.XLOOKUP($E7,'Activity 6'!$B$7:$B$13,'Activity 6'!J$7:J$13,\"N/A\",0,1)","v":"N/A"},{"$f":"_xlfn.XLOOKUP($E7,'Activity 6'!$B$7:$B$13,'Activity 6'!K$7:K$13,\"N/A\",0,1)","v":"N/A"},{"$f":"_xlfn.XLOOKUP($E7,'Activity 6'!$B$7:$B$13,'Activity 6'!L$7:L$13,\"N/A\",0,1)","v":"N/A"},{"$f":"_xlfn.XLOOKUP($E7,'Activity 6'!$B$7:$B$13,'Activity 6'!M$7:M$13,\"N/A\",0,1)","v":"N/A"},{"$f":"IF(ISNUMBER(SEARCH(\"6\",H7)),COUNTA('Activity 6'!$D$17:$E$20),\"N/A\")","v":"N/A"},{"$f":"IF(ISNUMBER(SEARCH(6,H7)),SUM('Activity 6'!G22:G25),\"N/A\")","v":"N/A"},{"$f":"_xlfn.XLOOKUP($E7,'Activity 6'!$B$23:$B$29,'Activity 6'!C$23:C$29,\"N/A\",0,1)","v":"N/A"},{"$f":"_xlfn.XLOOKUP($E7,'Activity 6'!$B$23:$B$29,'Activity 6'!D$23:D$29,\"N/A\",0,1)","v":"N/A"},{"$f":"_xlfn.XLOOKUP($E7,'Activity 6'!$B$23:$B$29,'Activity 6'!E$23:E$29,\"N/A\",0,1)","v":"N/A"},{"$f":"_xlfn.XLOOKUP($E7,'Activity 6'!$B$23:$B$29,'Activity 6'!F$23:F$29,\"N/A\",0,1)","v":"N/A"},{"$f":"_xlfn.XLOOKUP($E7,'Activity 6'!$B$23:$B$29,'Activity 6'!G$23:G$29,\"N/A\",0,1)","v":"N/A"},{"$f":"_xlfn.XLOOKUP($E7,'Activity 6'!$B$23:$B$29,'Activity 6'!H$23:H$29,\"N/A\",0,1)","v":"N/A"},{"$f":"_xlfn.XLOOKUP($E7,'Activity 6'!$B$23:$B$29,'Activity 6'!I$23:I$29,\"N/A\",0,1)","v":"N/A"},{"$f":"_xlfn.XLOOKUP($E7,'Activity 6'!$B$23:$B$29,'Activity 6'!J$23:J$29,\"N/A\",0,1)","v":"N/A"},{"$f":"_xlfn.XLOOKUP($E7,'Activity 6'!$B$23:$B$29,'Activity 6'!K$23:K$29,\"N/A\",0,1)","v":"N/A"},{"$f":"_xlfn.XLOOKUP($E7,'Activity 6'!$B$23:$B$29,'Activity 6'!L$23:L$29,\"N/A\",0,1)","v":"N/A"},{"$f":"_xlfn.XLOOKUP($E7,'Activity 6'!$B$23:$B$29,'Activity 6'!M$23:M$29,\"N/A\",0,1)","v":"N/A"},{"$f":"_xlfn.XLOOKUP($E7,'Activity 6'!$B$23:$B$29,'Activity 6'!N$23:N$29,\"N/A\",0,1)","v":"N/A"},{"$f":"_xlfn.XLOOKUP($E7,'Activity 6'!$B$33:$B$38,'Activity 6'!C$33:C$38,\"N/A\",0,1)","v":"N/A"},{"$f":"_xlfn.XLOOKUP($E7,'Activity 6'!$B$33:$B$38,'Activity 6'!D$33:D$38,\"N/A\",0,1)","v":"N/A"},{"$f":"_xlfn.XLOOKUP($E7,'Activity 6'!$B$33:$B$38,'Activity 6'!E$33:E$38,\"N/A\",0,1)","v":"N/A"},{"$f":"_xlfn.XLOOKUP($E7,'Activity 6'!$B$33:$B$38,'Activity 6'!I$33:I$38,\"N/A\",0,1)","v":"N/A"},{"$f":"_xlfn.XLOOKUP($E7,'Activity 6'!$B$33:$B$38,'Activity 6'!G$33:G$38,\"N/A\",0,1)","v":"N/A"},{"$f":"_xlfn.XLOOKUP($E7,'Activity 6'!$B$33:$B$38,'Activity 6'!H$33:H$38,\"N/A\",0,1)","v":"N/A"},{"$f":"_xlfn.XLOOKUP($E7,'Activity 6'!$B$33:$B$38,'Activity 6'!I$33:I$38,\"N/A\",0,1)","v":"N/A"},{"$f":"_xlfn.XLOOKUP($E7,'Activity 6'!$B$33:$B$38,'Activity 6'!J$33:J$38,\"N/A\",0,1)","v":"N/A"},{"$f":"_xlfn.XLOOKUP($E7,'Activity 6'!$B$33:$B$38,'Activity 6'!K$33:K$38,\"N/A\",0,1)","v":"N/A"},{"$f":"_xlfn.XLOOKUP($E7,'Activity 6'!$B$33:$B$38,'Activity 6'!M$33:M$38,\"N/A\",0,1)","v":"N/A"},{"$f":"_xlfn.XLOOKUP($E7,'Activity 7'!$B$7:$B$13,'Activity 7'!$A$7:$A$13,\"No\",0,1)","v":"No"},{"$f":"_xlfn.XLOOKUP($E7,'Activity 7'!$B$7:$B$13,'Activity 7'!C$7:C$13,\"N/A\",0,1)","v":"N/A"},{"$f":"_xlfn.XLOOKUP($E7,'Activity 7'!$B$7:$B$13,'Activity 7'!D$7:D$13,\"N/A\",0,1)","v":"N/A"},{"$f":"_xlfn.XLOOKUP($E7,'Activity 7'!$B$7:$B$13,'Activity 7'!E$7:E$13,\"N/A\",0,1)","v":"N/A"},{"$f":"_xlfn.XLOOKUP($E7,'Activity 7'!$B$7:$B$13,'Activity 7'!F$7:F$13,\"N/A\",0,1)","v":"N/A"},{"$f":"_xlfn.XLOOKUP($E7,'Activity 7'!$B$7:$B$13,'Activity 7'!G$7:G$13,\"N/A\",0,1)","v":"N/A"},{"$f":"_xlfn.XLOOKUP($E7,'Activity 7'!$B$7:$B$13,'Activity 7'!H$7:H$13,\"N/A\",0,1)","v":"N/A"},{"$f":"_xlfn.XLOOKUP($E7,'Activity 7'!$B$7:$B$13,'Activity 7'!I$7:I$13,\"N/A\",0,1)","v":"N/A"},{"$f":"_xlfn.XLOOKUP($E7,'Activity 7'!$B$7:$B$13,'Activity 7'!J$7:J$13,\"N/A\",0,1)","v":"N/A"},{"$f":"_xlfn.XLOOKUP($E7,'Activity 7'!$B$7:$B$13,'Activity 7'!K$7:K$13,\"N/A\",0,1)","v":"N/A"},{"$f":"_xlfn.XLOOKUP($E7,'Activity 7'!$B$7:$B$13,'Activity 7'!L$7:L$13,\"N/A\",0,1)","v":"N/A"},{"$f":"_xlfn.XLOOKUP($E7,'Activity 7'!$B$7:$B$13,'Activity 7'!M$7:M$13,\"N/A\",0,1)","v":"N/A"},{"$f":"_xlfn.XLOOKUP($E7,'Activity 7'!$B$17:$B$23,'Activity 7'!C$17:C$23,\"N/A\",0,1)","v":"N/A"},{"$f":"_xlfn.XLOOKUP($E7,'Activity 7'!$B$17:$B$23,'Activity 7'!D$17:D$23,\"N/A\",0,1)","v":"N/A"},{"$f":"_xlfn.XLOOKUP($E7,'Activity 7'!$B$17:$B$23,'Activity 7'!E$17:E$23,\"N/A\",0,1)","v":"N/A"},{"$f":"_xlfn.XLOOKUP($E7,'Activity 7'!$B$17:$B$23,'Activity 7'!F$17:F$23,\"N/A\",0,1)","v":"N/A"},{"$f":"_xlfn.XLOOKUP($E7,'Activity 7'!$B$17:$B$23,'Activity 7'!G$17:G$23,\"N/A\",0,1)","v":"N/A"},{"$f":"_xlfn.XLOOKUP($E7,'Activity 7'!$B$17:$B$23,'Activity 7'!H$17:H$23,\"N/A\",0,1)","v":"N/A"},{"$f":"_xlfn.XLOOKUP($E7,'Activity 7'!$B$17:$B$23,'Activity 7'!I$17:I$23,\"N/A\",0,1)","v":"N/A"},{"$f":"_xlfn.XLOOKUP($E7,'Activity 7'!$B$17:$B$23,'Activity 7'!J$17:J$23,\"N/A\",0,1)","v":"N/A"},{"$f":"_xlfn.XLOOKUP($E7,'Activity 7'!$B$17:$B$23,'Activity 7'!L$17:L$23,\"N/A\",0,1)","v":"N/A"},{"$f":"_xlfn.XLOOKUP($E7,'Activity 8'!$B$7:$B$13,'Activity 8'!A$7:A$13,\"No\",0,1)","v":"No"},{"$f":"_xlfn.XLOOKUP($E7,'Activity 8'!$B$7:$B$13,'Activity 8'!C$7:C$13,\"N/A\",0,1)","v":"N/A"},{"$f":"_xlfn.XLOOKUP($E7,'Activity 8'!$B$7:$B$13,'Activity 8'!D$7:D$13,\"N/A\",0,1)","v":"N/A"},{"$f":"_xlfn.XLOOKUP($E7,'Activity 8'!$B$7:$B$13,'Activity 8'!E$7:E$13,\"N/A\",0,1)","v":"N/A"},{"$f":"_xlfn.XLOOKUP($E7,'Activity 8'!$B$7:$B$13,'Activity 8'!F$7:F$13,\"N/A\",0,1)","v":"N/A"},{"$f":"_xlfn.XLOOKUP($E7,'Activity 8'!$B$7:$B$13,'Activity 8'!G$7:G$13,\"N/A\",0,1)","v":"N/A"},{"$f":"_xlfn.XLOOKUP($E7,'Activity 8'!$B$7:$B$13,'Activity 8'!H$7:H$13,\"N/A\",0,1)","v":"N/A"},{"$f":"_xlfn.XLOOKUP($E7,'Activity 8'!$B$7:$B$13,'Activity 8'!I$7:I$13,\"N/A\",0,1)","v":"N/A"},{"$f":"_xlfn.XLOOKUP($E7,'Activity 8'!$B$7:$B$13,'Activity 8'!J$7:J$13,\"N/A\",0,1)","v":"N/A"},{"$f":"_xlfn.XLOOKUP($E7,'Activity 8'!$B$7:$B$13,'Activity 8'!K$7:K$13,\"N/A\",0,1)","v":"N/A"},{"$f":"_xlfn.XLOOKUP($E7,'Activity 8'!$B$7:$B$13,'Activity 8'!L$7:L$13,\"N/A\",0,1)","v":"N/A"},{"$f":"_xlfn.XLOOKUP($E7,'Activity 8'!$B$7:$B$13,'Activity 8'!M$7:M$13,\"N/A\",0,1)","v":"N/A"},{"$f":"_xlfn.XLOOKUP($E7,'Activity 8'!$B$7:$B$13,'Activity 8'!N$7:N$13,\"N/A\",0,1)","v":"N/A"},{"$f":"_xlfn.XLOOKUP($E7,'Activity 8'!$B$7:$B$13,'Activity 8'!O$7:O$13,\"N/A\",0,1)","v":"N/A"},{"$f":"_xlfn.XLOOKUP($E7,'Activity 8'!$B$7:$B$13,'Activity 8'!P$7:P$13,\"N/A\",0,1)","v":"N/A"},{"$f":"_xlfn.XLOOKUP($E7,'Activity 8'!$B$17:$B$23,'Activity 8'!C$17:C$23,\"N/A\",0,1)","v":"N/A"},{"$f":"_xlfn.XLOOKUP($E7,'Activity 8'!$B$17:$B$23,'Activity 8'!D$17:D$23,\"N/A\",0,1)","v":"N/A"},{"$f":"_xlfn.XLOOKUP($E7,'Activity 8'!$B$17:$B$23,'Activity 8'!E$17:E$23,\"N/A\",0,1)","v":"N/A"},{"$f":"_xlfn.XLOOKUP($E7,'Activity 8'!$B$17:$B$23,'Activity 8'!F$17:F$23,\"N/A\",0,1)","v":"N/A"},{"$f":"_xlfn.XLOOKUP($E7,'Activity 8'!$B$17:$B$23,'Activity 8'!G$17:G$23,\"N/A\",0,1)","v":"N/A"},{"$f":"_xlfn.XLOOKUP($E7,'Activity 8'!$B$17:$B$23,'Activity 8'!H$17:H$23,\"N/A\",0,1)","v":"N/A"},{"$f":"_xlfn.XLOOKUP($E7,'Activity 8'!$B$17:$B$23,'Activity 8'!I$17:I$23,\"N/A\",0,1)","v":"N/A"},{"$f":"_xlfn.XLOOKUP($E7,'Activity 8'!$B$17:$B$23,'Activity 8'!J$17:J$23,\"N/A\",0,1)","v":"N/A"},{"$f":"_xlfn.XLOOKUP($E7,'Activity 8'!$B$17:$B$23,'Activity 8'!K$17:K$23,\"N/A\",0,1)","v":"N/A"},{"$f":"_xlfn.XLOOKUP($E7,'Activity 8'!$B$17:$B$23,'Activity 8'!L$17:L$23,\"N/A\",0,1)","v":"N/A"},{"$f":"_xlfn.XLOOKUP($E7,'Activity 8'!$B$17:$B$23,'Activity 8'!M$17:M$23,\"N/A\",0,1)","v":"N/A"},{"$f":"_xlfn.XLOOKUP($E7,'Activity 8'!$B$17:$B$23,'Activity 8'!P$17:P$23,\"N/A\",0,1)","v":"N/A"},{"$f":"_xlfn.XLOOKUP(E7,'Activity 9'!B12:B18,'Activity 9'!A12:A18,\"No\",0,1)","v":"No"},{"$f":"_xlfn.XLOOKUP($E7,'Activity 9'!$B$7:$B$13,'Activity 9'!C$7:C$13,\"N/A\",0,1)","v":"N/A"},{"$f":"_xlfn.XLOOKUP($E7,'Activity 9'!$B$7:$B$13,'Activity 9'!D$7:D$13,\"N/A\",0,1)","v":"N/A"},{"$f":"_xlfn.XLOOKUP($E7,'Activity 9'!$B$7:$B$13,'Activity 9'!E$7:E$13,\"N/A\",0,1)","v":"N/A"},{"$f":"_xlfn.XLOOKUP($E7,'Activity 9'!$B$7:$B$13,'Activity 9'!H$7:H$13,\"N/A\",0,1)","v":"N/A"},{"$f":"_xlfn.XLOOKUP($E7,'Activity 9'!$B$7:$B$13,'Activity 9'!I$7:I$13,\"N/A\",0,1)","v":"N/A"},{"$f":"_xlfn.XLOOKUP($E7,'Activity 9'!$B$7:$B$13,'Activity 9'!J$7:J$13,\"N/A\",0,1)","v":"N/A"},{"$f":"_xlfn.XLOOKUP($E7,'Activity 9'!$B$7:$B$13,'Activity 9'!K$7:K$13,\"N/A\",0,1)","v":"N/A"},{"$f":"_xlfn.XLOOKUP($E7,'Activity 9'!$B$7:$B$13,'Activity 9'!L$7:L$13,\"N/A\",0,1)","v":"N/A"},{"$f":"_xlfn.XLOOKUP($E7,'Activity 9'!$B$7:$B$13,'Activity 9'!M$7:M$13,\"N/A\",0,1)","v":"N/A"},{"$f":"_xlfn.XLOOKUP($E7,'Activity 9'!$B$7:$B$13,'Activity 9'!N$7:N$13,\"N/A\",0,1)","v":"N/A"},{"$f":"_xlfn.XLOOKUP($E7,'Activity 9'!$B$7:$B$13,'Activity 9'!O$7:O$13,\"N/A\",0,1)","v":"N/A"},{"$f":"_xlfn.XLOOKUP($E7,'Activity 9'!$B$17:$B$23,'Activity 9'!C$17:C$23,\"N/A\",0,1)","v":"N/A"},{"$f":"_xlfn.XLOOKUP($E7,'Activity 9'!$B$17:$B$23,'Activity 9'!D$17:D$23,\"N/A\",0,1)","v":"N/A"},{"$f":"_xlfn.XLOOKUP($E7,'Activity 9'!$B$17:$B$23,'Activity 9'!E$17:E$23,\"N/A\",0,1)","v":"N/A"},{"$f":"_xlfn.XLOOKUP($E7,'Activity 9'!$B$17:$B$23,'Activity 9'!F$17:F$23,\"N/A\",0,1)","v":"N/A"},{"$f":"_xlfn.XLOOKUP($E7,'Activity 9'!$B$17:$B$23,'Activity 9'!G$17:G$23,\"N/A\",0,1)","v":"N/A"},{"$f":"_xlfn.XLOOKUP($E7,'Activity 9'!$B$17:$B$23,'Activity 9'!H$17:H$23,\"N/A\",0,1)","v":"N/A"},{"$f":"_xlfn.XLOOKUP($E7,'Activity 9'!$B$17:$B$23,'Activity 9'!I$17:I$23,\"N/A\",0,1)","v":"N/A"},{"$f":"_xlfn.XLOOKUP($E7,'Activity 9'!$B$17:$B$23,'Activity 9'!J$17:J$23,\"N/A\",0,1)","v":"N/A"},{"$f":"_xlfn.XLOOKUP($E7,'Activity 9'!$B$17:$B$23,'Activity 9'!L$17:L$23,\"N/A\",0,1)","v":"N/A"},{"$f":"_xlfn.XLOOKUP($E7,'Activity 9'!$B$17:$B$23,'Activity 9'!M$17:M$23,\"N/A\",0,1)","v":"N/A"},{"$f":"_xlfn.XLOOKUP($E7,'Activity 9'!$B$17:$B$23,'Activity 9'!O$17:O$23,\"N/A\",0,1)","v":"N/A"},{"$f":"_xlfn.XLOOKUP($E7,'Activity 10'!B12:B18,'Activity 10'!A12:A18,\"No\",0,1)","v":"No"},{"$f":"_xlfn.XLOOKUP($E7,'Activity 10'!$B$7:$B$13,'Activity 10'!C$7:C$13,\"N/A\",0,1)","v":"N/A"},{"$f":"_xlfn.XLOOKUP($E7,'Activity 10'!$B$7:$B$13,'Activity 10'!D$7:D$13,\"N/A\",0,1)","v":"N/A"},{"$f":"_xlfn.XLOOKUP($E7,'Activity 10'!$B$7:$B$13,'Activity 10'!E$7:E$13,\"N/A\",0,1)","v":"N/A"},{"$f":"_xlfn.XLOOKUP($E7,'Activity 10'!$B$7:$B$13,'Activity 10'!F$7:F$13,\"N/A\",0,1)","v":"N/A"},{"$f":"_xlfn.XLOOKUP($E7,'Activity 10'!$B$7:$B$13,'Activity 10'!G$7:G$13,\"N/A\",0,1)","v":"N/A"},{"$f":"_xlfn.XLOOKUP($E7,'Activity 10'!$B$7:$B$13,'Activity 10'!H$7:H$13,\"N/A\",0,1)","v":"N/A"},{"$f":"_xlfn.XLOOKUP($E7,'Activity 10'!$B$7:$B$13,'Activity 10'!I$7:I$13,\"N/A\",0,1)","v":"N/A"},{"$f":"_xlfn.XLOOKUP($E7,'Activity 10'!$B$7:$B$13,'Activity 10'!J$7:J$13,\"N/A\",0,1)","v":"N/A"},{"$f":"_xlfn.XLOOKUP($E7,'Activity 10'!$B$7:$B$13,'Activity 10'!K$7:K$13,\"N/A\",0,1)","v":"N/A"},{"$f":"_xlfn.XLOOKUP($E7,'Activity 10'!$B$7:$B$13,'Activity 10'!L$7:L$13,\"N/A\",0,1)","v":"N/A"},{"$f":"_xlfn.XLOOKUP($E7,'Activity 10'!$B$7:$B$13,'Activity 10'!M$7:M$13,\"N/A\",0,1)","v":"N/A"},{"$f":"_xlfn.XLOOKUP($E7,'Activity 10'!$B$7:$B$13,'Activity 10'!N$7:N$13,\"N/A\",0,1)","v":"N/A"},{"$f":"_xlfn.XLOOKUP($E7,'Activity 10'!$B$7:$B$13,'Activity 10'!O$7:O$13,\"N/A\",0,1)","v":"N/A"},{"$f":"_xlfn.XLOOKUP($E7,'Activity 10'!$B$17:$B$23,'Activity 10'!C$17:C$23,\"N/A\",0,1)","v":"N/A"},{"$f":"_xlfn.XLOOKUP($E7,'Activity 10'!$B$17:$B$23,'Activity 10'!D$17:D$23,\"N/A\",0,1)","v":"N/A"},{"$f":"_xlfn.XLOOKUP($E7,'Activity 10'!$B$17:$B$23,'Activity 10'!E$17:E$23,\"N/A\",0,1)","v":"N/A"},{"$f":"_xlfn.XLOOKUP($E7,'Activity 10'!$B$17:$B$23,'Activity 10'!F$17:F$23,\"N/A\",0,1)","v":"N/A"},{"$f":"_xlfn.XLOOKUP($E7,'Activity 10'!$B$17:$B$23,'Activity 10'!G$17:G$23,\"N/A\",0,1)","v":"N/A"},{"$f":"_xlfn.XLOOKUP($E7,'Activity 10'!$B$17:$B$23,'Activity 10'!H$17:H$23,\"N/A\",0,1)","v":"N/A"},{"$f":"_xlfn.XLOOKUP($E7,'Activity 10'!$B$17:$B$23,'Activity 10'!I$17:I$23,\"N/A\",0,1)","v":"N/A"},{"$f":"_xlfn.XLOOKUP($E7,'Activity 10'!$B$17:$B$23,'Activity 10'!J$17:J$23,\"N/A\",0,1)","v":"N/A"},{"$f":"_xlfn.XLOOKUP($E7,'Activity 10'!$B$17:$B$23,'Activity 10'!K$17:K$23,\"N/A\",0,1)","v":"N/A"},{"$f":"_xlfn.XLOOKUP($E7,'Activity 10'!$B$17:$B$23,'Activity 10'!L$17:L$23,\"N/A\",0,1)","v":"N/A"},{"$f":"_xlfn.XLOOKUP($E7,'Activity 10'!$B$17:$B$23,'Activity 10'!N$17:N$23,\"N/A\",0,1)","v":"N/A"},{"$f":"_xlfn.XLOOKUP($E7,'Competitive Activity 1'!B12:B18,'Competitive Activity 1'!A12:A18,\"No\",0,1)","v":"No"},{"$f":"_xlfn.XLOOKUP($E7,'Competitive Activity 1'!$B$7:$B$13,'Competitive Activity 1'!C$7:C$13,\"N/A\",0,1)","v":"N/A"},{"$f":"_xlfn.XLOOKUP($E7,'Competitive Activity 1'!$B$7:$B$13,'Competitive Activity 1'!D$7:D$13,\"N/A\",0,1)","v":"N/A"},{"$f":"_xlfn.XLOOKUP($E7,'Competitive Activity 1'!$B$7:$B$13,'Competitive Activity 1'!E$7:E$13,\"N/A\",0,1)","v":"N/A"},{"$f":"_xlfn.XLOOKUP($E7,'Competitive Activity 1'!$B$7:$B$13,'Competitive Activity 1'!F$7:F$13,\"N/A\",0,1)","v":"N/A"},{"$f":"_xlfn.XLOOKUP($E7,'Competitive Activity 1'!$B$7:$B$13,'Competitive Activity 1'!G$7:G$13,\"N/A\",0,1)","v":"N/A"},{"$f":"_xlfn.XLOOKUP($E7,'Competitive Activity 1'!$B$7:$B$13,'Competitive Activity 1'!H$7:H$13,\"N/A\",0,1)","v":"N/A"},{"$f":"_xlfn.XLOOKUP($E7,'Competitive Activity 1'!$B$7:$B$13,'Competitive Activity 1'!I$7:I$13,\"N/A\",0,1)","v":"N/A"},{"$f":"_xlfn.XLOOKUP($E7,'Competitive Activity 1'!$B$7:$B$13,'Competitive Activity 1'!J$7:J$13,\"N/A\",0,1)","v":"N/A"},{"$f":"_xlfn.XLOOKUP($E7,'Competitive Activity 1'!$B$7:$B$13,'Competitive Activity 1'!K$7:K$13,\"N/A\",0,1)","v":"N/A"},{"$f":"_xlfn.XLOOKUP($E7,'Competitive Activity 1'!$B$7:$B$13,'Competitive Activity 1'!L$7:L$13,\"N/A\",0,1)","v":"N/A"},{"$f":"_xlfn.XLOOKUP($E7,'Competitive Activity 1'!$B$7:$B$13,'Competitive Activity 1'!M$7:M$13,\"N/A\",0,1)","v":"N/A"},{"$f":"_xlfn.XLOOKUP($E7,'Competitive Activity 1'!$B$7:$B$13,'Competitive Activity 1'!N$7:N$13,\"N/A\",0,1)","v":"N/A"},{"$f":"_xlfn.XLOOKUP($E7,'Competitive Activity 1'!$B$7:$B$13,'Competitive Activity 1'!O$7:O$13,\"N/A\",0,1)","v":"N/A"},{"$f":"_xlfn.XLOOKUP($E7,'Competitive Activity 1'!$B$7:$B$13,'Competitive Activity 1'!P$7:P$13,\"N/A\",0,1)","v":"N/A"},{"$f":"_xlfn.XLOOKUP($E7,'Competitive Activity 1'!$B$17:$B$23,'Competitive Activity 1'!C$17:C$23,\"N/A\",0,1)","v":"N/A"},{"$f":"_xlfn.XLOOKUP($E7,'Competitive Activity 1'!$B$17:$B$23,'Competitive Activity 1'!D$17:D$23,\"N/A\",0,1)","v":"N/A"},{"$f":"_xlfn.XLOOKUP($E7,'Competitive Activity 1'!$B$17:$B$23,'Competitive Activity 1'!E$17:E$23,\"N/A\",0,1)","v":"N/A"},{"$f":"_xlfn.XLOOKUP($E7,'Competitive Activity 1'!$B$17:$B$23,'Competitive Activity 1'!F$17:F$23,\"N/A\",0,1)","v":"N/A"},{"$f":"_xlfn.XLOOKUP($E7,'Competitive Activity 1'!$B$17:$B$23,'Competitive Activity 1'!G$17:G$23,\"N/A\",0,1)","v":"N/A"},{"$f":"_xlfn.XLOOKUP($E7,'Competitive Activity 1'!$B$17:$B$23,'Competitive Activity 1'!H$17:H$23,\"N/A\",0,1)","v":"N/A"},{"$f":"_xlfn.XLOOKUP($E7,'Competitive Activity 1'!$B$17:$B$23,'Competitive Activity 1'!I$17:I$23,\"N/A\",0,1)","v":"N/A"},{"$f":"_xlfn.XLOOKUP($E7,'Competitive Activity 1'!$B$17:$B$23,'Competitive Activity 1'!J$17:J$23,\"N/A\",0,1)","v":"N/A"},{"$f":"_xlfn.XLOOKUP($E7,'Competitive Activity 1'!$B$17:$B$23,'Competitive Activity 1'!K$17:K$23,\"N/A\",0,1)","v":"N/A"},{"$f":"_xlfn.XLOOKUP($E7,'Competitive Activity 1'!$B$17:$B$23,'Competitive Activity 1'!M$17:M$23,\"N/A\",0,1)","v":"N/A"},{"$f":"_xlfn.XLOOKUP($E7,'Competitive Activity 1'!$B$17:$B$23,'Competitive Activity 1'!N$17:N$23,\"N/A\",0,1)","v":"N/A"},{"$f":"_xlfn.XLOOKUP($E7,'Competitive Activity 1'!$B$17:$B$23,'Competitive Activity 1'!P$17:P$23,\"N/A\",0,1)","v":"N/A"},{"$f":"_xlfn.XLOOKUP($E7,'Competitive Activity 2'!$B$7:$B$13,'Competitive Activity 2'!$A$7:$A$13,\"No\",0,1)","v":"No"},{"$f":"_xlfn.XLOOKUP($E7,'Competitive Activity 2'!$B$7:$B$13,'Competitive Activity 2'!C$7:C$13,\"N/A\",0,1)","v":"N/A"},{"$f":"_xlfn.XLOOKUP($E7,'Competitive Activity 2'!$B$7:$B$13,'Competitive Activity 2'!D$7:D$13,\"N/A\",0,1)","v":"N/A"},{"$f":"_xlfn.XLOOKUP($E7,'Competitive Activity 2'!$B$7:$B$13,'Competitive Activity 2'!E$7:E$13,\"N/A\",0,1)","v":"N/A"},{"$f":"_xlfn.XLOOKUP($E7,'Competitive Activity 2'!$B$7:$B$13,'Competitive Activity 2'!F$7:F$13,\"N/A\",0,1)","v":"N/A"},{"$f":"_xlfn.XLOOKUP($E7,'Competitive Activity 2'!$B$7:$B$13,'Competitive Activity 2'!G$7:G$13,\"N/A\",0,1)","v":"N/A"},{"$f":"_xlfn.XLOOKUP($E7,'Competitive Activity 2'!$B$7:$B$13,'Competitive Activity 2'!H$7:H$13,\"N/A\",0,1)","v":"N/A"},{"$f":"_xlfn.XLOOKUP($E7,'Competitive Activity 2'!$B$7:$B$13,'Competitive Activity 2'!I$7:I$13,\"N/A\",0,1)","v":"N/A"},{"$f":"_xlfn.XLOOKUP($E7,'Competitive Activity 2'!$B$7:$B$13,'Competitive Activity 2'!J$7:J$13,\"N/A\",0,1)","v":"N/A"},{"$f":"_xlfn.XLOOKUP($E7,'Competitive Activity 2'!$B$7:$B$13,'Competitive Activity 2'!K$7:K$13,\"N/A\",0,1)","v":"N/A"},{"$f":"_xlfn.XLOOKUP($E7,'Competitive Activity 2'!$B$7:$B$13,'Competitive Activity 2'!L$7:L$13,\"N/A\",0,1)","v":"N/A"},{"$f":"_xlfn.XLOOKUP($E7,'Competitive Activity 2'!$B$17:$B$23,'Competitive Activity 2'!C$17:C$23,\"N/A\",0,1)","v":"N/A"},{"$f":"_xlfn.XLOOKUP($E7,'Competitive Activity 2'!$B$17:$B$23,'Competitive Activity 2'!D$17:D$23,\"N/A\",0,1)","v":"N/A"},{"$f":"_xlfn.XLOOKUP($E7,'Competitive Activity 2'!$B$17:$B$23,'Competitive Activity 2'!E$17:E$23,\"N/A\",0,1)","v":"N/A"},{"$f":"_xlfn.XLOOKUP($E7,'Competitive Activity 2'!$B$17:$B$23,'Competitive Activity 2'!F$17:F$23,\"N/A\",0,1)","v":"N/A"},{"$f":"_xlfn.XLOOKUP($E7,'Competitive Activity 2'!$B$17:$B$23,'Competitive Activity 2'!G$17:G$23,\"N/A\",0,1)","v":"N/A"},{"$f":"_xlfn.XLOOKUP($E7,'Competitive Activity 2'!$B$17:$B$23,'Competitive Activity 2'!H$17:H$23,\"N/A\",0,1)","v":"N/A"},{"$f":"_xlfn.XLOOKUP($E7,'Competitive Activity 2'!$B$17:$B$23,'Competitive Activity 2'!I$17:I$23,\"N/A\",0,1)","v":"N/A"},{"$f":"_xlfn.XLOOKUP($E7,'Competitive Activity 2'!$B$17:$B$23,'Competitive Activity 2'!J$17:J$23,\"N/A\",0,1)","v":"N/A"},{"$f":"_xlfn.XLOOKUP($E7,'Competitive Activity 2'!$B$17:$B$23,'Competitive Activity 2'!K$17:K$23,\"N/A\",0,1)","v":"N/A"},{"$f":"_xlfn.XLOOKUP($E7,'Competitive Activity 2'!$B$17:$B$23,'Competitive Activity 2'!L$17:L$23,\"N/A\",0,1)","v":"N/A"},{"$f":"_xlfn.XLOOKUP($E7,'Competitive Activity 2'!$B$17:$B$23,'Competitive Activity 2'!M$17:M$23,\"N/A\",0,1)","v":"N/A"},{"$f":"_xlfn.XLOOKUP($E7,'Competitive Activity 2'!$B$27:$B$33,'Competitive Activity 2'!C$27:C$33,\"N/A\",0,1)","v":"N/A"},{"$f":"_xlfn.XLOOKUP($E7,'Competitive Activity 2'!$B$27:$B$33,'Competitive Activity 2'!D$27:D$33,\"N/A\",0,1)","v":"N/A"},{"$f":"_xlfn.XLOOKUP($E7,'Competitive Activity 2'!$B$27:$B$33,'Competitive Activity 2'!E$27:E$33,\"N/A\",0,1)","v":"N/A"},{"$f":"_xlfn.XLOOKUP($E7,'Competitive Activity 2'!$B$27:$B$33,'Competitive Activity 2'!F$27:F$33,\"N/A\",0,1)","v":"N/A"},{"$f":"_xlfn.XLOOKUP($E7,'Competitive Activity 2'!$B$27:$B$33,'Competitive Activity 2'!G$27:G$33,\"N/A\",0,1)","v":"N/A"},{"$f":"_xlfn.XLOOKUP($E7,'Competitive Activity 2'!$B$27:$B$33,'Competitive Activity 2'!H$27:H$33,\"N/A\",0,1)","v":"N/A"},{"$f":"_xlfn.XLOOKUP($E7,'Competitive Activity 2'!$B$27:$B$33,'Competitive Activity 2'!I$27:I$33,\"N/A\",0,1)","v":"N/A"},{"$f":"_xlfn.XLOOKUP($E7,'Competitive Activity 2'!$B$27:$B$33,'Competitive Activity 2'!J$27:J$33,\"N/A\",0,1)","v":"N/A"},{"$f":"_xlfn.XLOOKUP($E7,'Competitive Activity 2'!$B$27:$B$33,'Competitive Activity 2'!L$27:L$33,\"N/A\",0,1)","v":"N/A"}]
[{"$f":"'1-Cover Sheet'!$C$8","v":0},{"$f":"'1-Cover Sheet'!$F$8","v":"Select One"},{"$f":"'Summary Sheet'!$D$8","v":0},{"$f":"'Summary Sheet'!$D$10","v":0},{"$f":"'3-Financial Summary'!A18","v":0},{"$f":"'3-Financial Summary'!B18","v":0},{"$f":"'3-Financial Summary'!C18","v":0},{"$f":"'3-Financial Summary'!D18","v":0},{"$f":"'3-Financial Summary'!E18","v":0},{"$f":"VLOOKUP(E8,'Summary Sheet'!$A$23:$L$34,11,FALSE)","v":"N/A"},{"$f":"VLOOKUP(E8,'Summary Sheet'!$A$23:$L$34,12,FALSE)","v":"N/A"},{"$f":"'3-Financial Summary'!F18","v":0},{"$f":"'3-Financial Summary'!G18","v":"00:00:00"},{"$f":"'3-Financial Summary'!H18","v":0},{"$f":"_xlfn.XLOOKUP($E8,'Activity 1'!$B$7:$B$13,'Activity 1'!$A$7:$A$13,\"No\",0,1)","v":"No"},{"$f":"_xlfn.XLOOKUP($E8,'Activity 1'!$B$7:$B$13,'Activity 1'!C13:C19,\"N/A\",0,1)","v":"N/A"},{"$f":"_xlfn.XLOOKUP($E8,'Activity 1'!$B$7:$B$13,'Activity 1'!D13:D19,\"N/A\",0,1)","v":"N/A"},{"$f":"_xlfn.XLOOKUP($E8,'Activity 1'!$B$7:$B$13,'Activity 1'!E$7:E$13,\"N/A\",0,1)","v":"N/A"},{"$f":"_xlfn.XLOOKUP($E8,'Activity 1'!$B$7:$B$13,'Activity 1'!F$7:F$13,\"N/A\",0,1)","v":"N/A"},{"$f":"_xlfn.XLOOKUP($E8,'Activity 1'!$B$7:$B$13,'Activity 1'!G$7:G$13,\"N/A\",0,1)","v":"N/A"},{"$f":"_xlfn.XLOOKUP($E8,'Activity 1'!$B$7:$B$13,'Activity 1'!H$7:H$13,\"N/A\",0,1)","v":"N/A"},{"$f":"_xlfn.XLOOKUP($E8,'Activity 1'!$B$7:$B$13,'Activity 1'!I$7:I$13,\"N/A\",0,1)","v":"N/A"},{"$f":"_xlfn.XLOOKUP($E8,'Activity 1'!$B$7:$B$13,'Activity 1'!J$7:J$13,\"N/A\",0,1)","v":"N/A"},{"$f":"_xlfn.XLOOKUP($E8,'Activity 1'!$B$7:$B$13,'Activity 1'!K$7:K$13,\"N/A\",0,1)","v":"N/A"},{"$f":"_xlfn.XLOOKUP($E8,'Activity 1'!$B$7:$B$13,'Activity 1'!L$7:L$13,\"N/A\",0,1)","v":"N/A"},{"$f":"_xlfn.XLOOKUP($E8,'Activity 1'!$B$7:$B$13,'Activity 1'!M$7:M$13,\"N/A\",0,1)","v":"N/A"},{"$f":"_xlfn.XLOOKUP($E8,'Activity 1'!$B$7:$B$13,'Activity 1'!N$7:N$13,\"N/A\",0,1)","v":"N/A"},{"$f":"_xlfn.XLOOKUP($E8,'Activity 1'!$B$7:$B$13,'Activity 1'!O$7:O$13,\"N/A\",0,1)","v":"N/A"},{"$f":"_xlfn.XLOOKUP($E8,'Activity 1'!$B$7:$B$13,'Activity 1'!P$7:P$13,\"N/A\",0,1)","v":"N/A"},{"$f":"_xlfn.XLOOKUP($E8,'Activity 1'!$B$7:$B$13,'Activity 1'!Q$7:Q$13,\"N/A\",0,1)","v":"N/A"},{"$f":"_xlfn.XLOOKUP($E8,'Activity 1'!$B$17:$B$23,'Activity 1'!C$17:C$23,\"N/A\",0,1)","v":"N/A"},{"$f":"_xlfn.XLOOKUP($E8,'Activity 1'!$B$17:$B$23,'Activity 1'!D$17:D$23,\"N/A\",0,1)","v":"N/A"},{"$f":"_xlfn.XLOOKUP($E8,'Activity 1'!$B$17:$B$23,'Activity 1'!E$17:E$23,\"N/A\",0,1)","v":"N/A"},{"$f":"_xlfn.XLOOKUP($E8,'Activity 1'!$B$17:$B$23,'Activity 1'!F$17:F$23,\"N/A\",0,1)","v":"N/A"},{"$f":"_xlfn.XLOOKUP($E8,'Activity 1'!$B$17:$B$23,'Activity 1'!G$17:G$23,\"N/A\",0,1)","v":"N/A"},{"$f":"_xlfn.XLOOKUP($E8,'Activity 1'!$B$17:$B$23,'Activity 1'!H$17:H$23,\"N/A\",0,1)","v":"N/A"},{"$f":"_xlfn.XLOOKUP($E8,'Activity 1'!$B$17:$B$23,'Activity 1'!I$17:I$23,\"N/A\",0,1)","v":"N/A"},{"$f":"_xlfn.XLOOKUP($E8,'Activity 1'!$B$17:$B$23,'Activity 1'!J$17:J$23,\"N/A\",0,1)","v":"N/A"},{"$f":"_xlfn.XLOOKUP($E8,'Activity 1'!$B$17:$B$23,'Activity 1'!K$17:K$23,\"N/A\",0,1)","v":"N/A"},{"$f":"_xlfn.XLOOKUP($E8,'Activity 1'!$B$17:$B$23,'Activity 1'!L$17:L$23,\"N/A\",0,1)","v":"N/A"},{"$f":"_xlfn.XLOOKUP($E8,'Activity 1'!$B$17:$B$23,'Activity 1'!M$17:M$23,\"N/A\",0,1)","v":"N/A"},{"$f":"_xlfn.XLOOKUP($E8,'Activity 1'!$B$17:$B$23,'Activity 1'!O$17:O$23,\"N/A\",0,1)","v":"N/A"},{"$f":"_xlfn.XLOOKUP($E8,'Activity 1'!$B$17:$B$23,'Activity 1'!Q$17:Q$23,\"N/A\",0,1)","v":"N/A"},{"$f":"_xlfn.XLOOKUP($E8,'Activity 2'!$B$7:$B$13,'Activity 2'!A$7:A$13,\"No\",0)","v":"No"},{"$f":"_xlfn.XLOOKUP($E8,'Activity 2'!$B$7:$B$13,'Activity 2'!C$7:C$13,\"N/A\",0,1)","v":"N/A"},{"$f":"_xlfn.XLOOKUP($E8,'Activity 2'!$B$7:$B$13,'Activity 2'!D$7:D$13,\"N/A\",0,1)","v":"N/A"},{"$f":"_xlfn.XLOOKUP($E8,'Activity 2'!$B$7:$B$13,'Activity 2'!E$7:E$13,\"N/A\",0,1)","v":"N/A"},{"$f":"_xlfn.XLOOKUP($E8,'Activity 2'!$B$7:$B$13,'Activity 2'!F$7:F$13,\"N/A\",0,1)","v":"N/A"},{"$f":"_xlfn.XLOOKUP($E8,'Activity 2'!$B$7:$B$13,'Activity 2'!G$7:G$13,\"N/A\",0,1)","v":"N/A"},{"$f":"_xlfn.XLOOKUP($E8,'Activity 2'!$B$7:$B$13,'Activity 2'!H$7:H$13,\"N/A\",0,1)","v":"N/A"},{"$f":"_xlfn.XLOOKUP($E8,'Activity 2'!$B$7:$B$13,'Activity 2'!I$7:I$13,\"N/A\",0,1)","v":"N/A"},{"$f":"_xlfn.XLOOKUP($E8,'Activity 2'!$B$7:$B$13,'Activity 2'!J$7:J$13,\"N/A\",0,1)","v":"N/A"},{"$f":"_xlfn.XLOOKUP($E8,'Activity 2'!$B$7:$B$13,'Activity 2'!K$7:K$13,\"N/A\",0,1)","v":"N/A"},{"$f":"_xlfn.XLOOKUP($E8,'Activity 2'!$B$7:$B$13,'Activity 2'!L$7:L$13,\"N/A\",0,1)","v":"N/A"},{"$f":"_xlfn.XLOOKUP($E8,'Activity 2'!$B$7:$B$13,'Activity 2'!M$7:M$13,\"N/A\",0,1)","v":"N/A"},{"$f":"_xlfn.XLOOKUP($E8,'Activity 2'!$B$7:$B$13,'Activity 2'!N$7:N$13,\"N/A\",0,1)","v":"N/A"},{"$f":"_xlfn.XLOOKUP($E8,'Activity 2'!$B$7:$B$13,'Activity 2'!O$7:O$13,\"N/A\",0,1)","v":"N/A"},{"$f":"_xlfn.XLOOKUP($E8,'Activity 2'!$B$7:$B$13,'Activity 2'!P$7:P$13,\"N/A\",0,1)","v":"N/A"},{"$f":"_xlfn.XLOOKUP($E8,'Activity 2'!$B$7:$B$13,'Activity 2'!Q$7:Q$13,\"N/A\",0,1)","v":"N/A"},{"$f":"_xlfn.XLOOKUP($E8,'Activity 2'!$B$17:$B$23,'Activity 2'!C$17:C$23,\"N/A\",0,1)","v":"N/A"},{"$f":"_xlfn.XLOOKUP($E8,'Activity 2'!$B$17:$B$23,'Activity 2'!D$17:D$23,\"N/A\",0,1)","v":"N/A"},{"$f":"_xlfn.XLOOKUP($E8,'Activity 2'!$B$17:$B$23,'Activity 2'!E$17:E$23,\"N/A\",0,1)","v":"N/A"},{"$f":"_xlfn.XLOOKUP($E8,'Activity 2'!$B$17:$B$23,'Activity 2'!F$17:F$23,\"N/A\",0,1)","v":"N/A"},{"$f":"_xlfn.XLOOKUP($E8,'Activity 2'!$B$17:$B$23,'Activity 2'!G$17:G$23,\"N/A\",0,1)","v":"N/A"},{"$f":"_xlfn.XLOOKUP($E8,'Activity 2'!$B$17:$B$23,'Activity 2'!H$17:H$23,\"N/A\",0,1)","v":"N/A"},{"$f":"_xlfn.XLOOKUP($E8,'Activity 2'!$B$17:$B$23,'Activity 2'!I$17:I$23,\"N/A\",0,1)","v":"N/A"},{"$f":"_xlfn.XLOOKUP($E8,'Activity 2'!$B$17:$B$23,'Activity 2'!J$17:J$23,\"N/A\",0,1)","v":"N/A"},{"$f":"_xlfn.XLOOKUP($E8,'Activity 2'!$B$17:$B$23,'Activity 2'!K$17:K$23,\"N/A\",0,1)","v":"N/A"},{"$f":"_xlfn.XLOOKUP($E8,'Activity 2'!$B$17:$B$23,'Activity 2'!L$17:L$23,\"N/A\",0,1)","v":"N/A"},{"$f":"_xlfn.XLOOKUP($E8,'Activity 2'!$B$17:$B$23,'Activity 2'!M$17:M$23,\"N/A\",0,1)","v":"N/A"},{"$f":"_xlfn.XLOOKUP($E8,'Activity 2'!$B$17:$B$23,'Activity 2'!O$17:O$23,\"N/A\",0,1)","v":"N/A"},{"$f":"_xlfn.XLOOKUP($E8,'Activity 2'!$B$17:$B$23,'Activity 2'!Q$17:Q$23,\"N/A\",0,1)","v":"N/A"},{"$f":"_xlfn.XLOOKUP($E8,'Activity 3'!$B$8:$B$14,'Activity 3'!A$8:A$14,\"No\",0,1)","v":"No"},{"$f":"_xlfn.XLOOKUP($E8,'Activity 3'!$B$8:$B$14,'Activity 3'!C$8:C$14,\"N/A\",0,1)","v":"N/A"},{"$f":"_xlfn.XLOOKUP($E8,'Activity 3'!$B$8:$B$14,'Activity 3'!D$8:D$14,\"N/A\",0,1)","v":"N/A"},{"$f":"_xlfn.XLOOKUP($E8,'Activity 3'!$B$8:$B$14,'Activity 3'!E$8:E$14,\"N/A\",0,1)","v":"N/A"},{"$f":"_xlfn.XLOOKUP($E8,'Activity 3'!$B$8:$B$14,'Activity 3'!F$8:F$14,\"N/A\",0,1)","v":"N/A"},{"$f":"_xlfn.XLOOKUP($E8,'Activity 3'!$B$8:$B$14,'Activity 3'!G$8:G$14,\"N/A\",0,1)","v":"N/A"},{"$f":"_xlfn.XLOOKUP($E8,'Activity 4'!$B$8:$B$14,'Activity 4'!A14:A20,\"No\",0,1)","v":"No"},{"$f":"_xlfn.XLOOKUP($E8,'Activity 4'!$B$8:$B$14,'Activity 4'!C$8:C$14,\"N/A\",0,1)","v":"N/A"},{"$f":"_xlfn.XLOOKUP($E8,'Activity 4'!$B$8:$B$14,'Activity 4'!D$8:D$14,\"N/A\",0,1)","v":"N/A"},{"$f":"_xlfn.XLOOKUP($E8,'Activity 4'!$B$8:$B$14,'Activity 4'!G$8:G$14,\"N/A\",0,1)","v":"N/A"},{"$f":"_xlfn.XLOOKUP($E8,'Activity 5'!$B$8:$B$14,'Activity 5'!$A$8:$A$14,\"No\",0,1)","v":"No"},{"$f":"_xlfn.XLOOKUP($E8,'Activity 5'!$B$8:$B$14,'Activity 5'!C$8:C$14,\"N/A\",0,1)","v":"N/A"},{"$f":"_xlfn.XLOOKUP($E8,'Activity 5'!$B$8:$B$14,'Activity 5'!D$8:D$14,\"N/A\",0,1)","v":"N/A"},{"$f":"_xlfn.XLOOKUP($E8,'Activity 5'!$B$8:$B$14,'Activity 5'!G$8:G$14,\"N/A\",0,1)","v":"N/A"},{"$f":"_xlfn.XLOOKUP($E8,'Activity 5'!$B$8:$B$14,'Activity 5'!H$8:H$14,\"N/A\",0,1)","v":"N/A"},{"$f":"_xlfn.XLOOKUP($E8,'Activity 5'!$B$8:$B$14,'Activity 5'!I$8:I$14,\"N/A\",0,1)","v":"N/A"},{"$f":"_xlfn.XLOOKUP($E8,'Activity 5'!$B$8:$B$14,'Activity 5'!J$8:J$14,\"N/A\",0,1)","v":"N/A"},{"$f":"_xlfn.XLOOKUP($E8,'Activity 6'!$B$7:$B$13,'Activity 6'!A$7:A$13,\"No\",0,1)","v":"No"},{"$f":"_xlfn.XLOOKUP($E8,'Activity 6'!$B$7:$B$13,'Activity 6'!C$7:C$13,\"N/A\",0,1)","v":"N/A"},{"$f":"_xlfn.XLOOKUP($E8,'Activity 6'!$B$7:$B$13,'Activity 6'!D$7:D$13,\"N/A\",0,1)","v":"N/A"},{"$f":"_xlfn.XLOOKUP($E8,'Activity 6'!$B$7:$B$13,'Activity 6'!E$7:E$13,\"N/A\",0,1)","v":"N/A"},{"$f":"_xlfn.XLOOKUP($E8,'Activity 6'!$B$7:$B$13,'Activity 6'!F$7:F$13,\"N/A\",0,1)","v":"N/A"},{"$f":"_xlfn.XLOOKUP($E8,'Activity 6'!$B$7:$B$13,'Activity 6'!G$7:G$13,\"N/A\",0,1)","v":"N/A"},{"$f":"_xlfn.XLOOKUP($E8,'Activity 6'!$B$7:$B$13,'Activity 6'!H$7:H$13,\"N/A\",0,1)","v":"N/A"},{"$f":"_xlfn.XLOOKUP($E8,'Activity 6'!$B$7:$B$13,'Activity 6'!I$7:I$13,\"N/A\",0,1)","v":"N/A"},{"$f":"_xlfn.XLOOKUP($E8,'Activity 6'!$B$7:$B$13,'Activity 6'!J$7:J$13,\"N/A\",0,1)","v":"N/A"},{"$f":"_xlfn.XLOOKUP($E8,'Activity 6'!$B$7:$B$13,'Activity 6'!K$7:K$13,\"N/A\",0,1)","v":"N/A"},{"$f":"_xlfn.XLOOKUP($E8,'Activity 6'!$B$7:$B$13,'Activity 6'!L$7:L$13,\"N/A\",0,1)","v":"N/A"},{"$f":"_xlfn.XLOOKUP($E8,'Activity 6'!$B$7:$B$13,'Activity 6'!M$7:M$13,\"N/A\",0,1)","v":"N/A"},{"$f":"IF(ISNUMBER(SEARCH(\"6\",H8)),COUNTA('Activity 6'!$D$17:$E$20),\"N/A\")","v":"N/A"},{"$f":"IF(ISNUMBER(SEARCH(6,H8)),SUM('Activity 6'!G23:G26),\"N/A\")","v":"N/A"},{"$f":"_xlfn.XLOOKUP($E8,'Activity 6'!$B$23:$B$29,'Activity 6'!C$23:C$29,\"N/A\",0,1)","v":"N/A"},{"$f":"_xlfn.XLOOKUP($E8,'Activity 6'!$B$23:$B$29,'Activity 6'!D$23:D$29,\"N/A\",0,1)","v":"N/A"},{"$f":"_xlfn.XLOOKUP($E8,'Activity 6'!$B$23:$B$29,'Activity 6'!E$23:E$29,\"N/A\",0,1)","v":"N/A"},{"$f":"_xlfn.XLOOKUP($E8,'Activity 6'!$B$23:$B$29,'Activity 6'!F$23:F$29,\"N/A\",0,1)","v":"N/A"},{"$f":"_xlfn.XLOOKUP($E8,'Activity 6'!$B$23:$B$29,'Activity 6'!G$23:G$29,\"N/A\",0,1)","v":"N/A"},{"$f":"_xlfn.XLOOKUP($E8,'Activity 6'!$B$23:$B$29,'Activity 6'!H$23:H$29,\"N/A\",0,1)","v":"N/A"},{"$f":"_xlfn.XLOOKUP($E8,'Activity 6'!$B$23:$B$29,'Activity 6'!I$23:I$29,\"N/A\",0,1)","v":"N/A"},{"$f":"_xlfn.XLOOKUP($E8,'Activity 6'!$B$23:$B$29,'Activity 6'!J$23:J$29,\"N/A\",0,1)","v":"N/A"},{"$f":"_xlfn.XLOOKUP($E8,'Activity 6'!$B$23:$B$29,'Activity 6'!K$23:K$29,\"N/A\",0,1)","v":"N/A"},{"$f":"_xlfn.XLOOKUP($E8,'Activity 6'!$B$23:$B$29,'Activity 6'!L$23:L$29,\"N/A\",0,1)","v":"N/A"},{"$f":"_xlfn.XLOOKUP($E8,'Activity 6'!$B$23:$B$29,'Activity 6'!M$23:M$29,\"N/A\",0,1)","v":"N/A"},{"$f":"_xlfn.XLOOKUP($E8,'Activity 6'!$B$23:$B$29,'Activity 6'!N$23:N$29,\"N/A\",0,1)","v":"N/A"},{"$f":"_xlfn.XLOOKUP($E8,'Activity 6'!$B$33:$B$38,'Activity 6'!C$33:C$38,\"N/A\",0,1)","v":"N/A"},{"$f":"_xlfn.XLOOKUP($E8,'Activity 6'!$B$33:$B$38,'Activity 6'!D$33:D$38,\"N/A\",0,1)","v":"N/A"},{"$f":"_xlfn.XLOOKUP($E8,'Activity 6'!$B$33:$B$38,'Activity 6'!E$33:E$38,\"N/A\",0,1)","v":"N/A"},{"$f":"_xlfn.XLOOKUP($E8,'Activity 6'!$B$33:$B$38,'Activity 6'!I$33:I$38,\"N/A\",0,1)","v":"N/A"},{"$f":"_xlfn.XLOOKUP($E8,'Activity 6'!$B$33:$B$38,'Activity 6'!G$33:G$38,\"N/A\",0,1)","v":"N/A"},{"$f":"_xlfn.XLOOKUP($E8,'Activity 6'!$B$33:$B$38,'Activity 6'!H$33:H$38,\"N/A\",0,1)","v":"N/A"},{"$f":"_xlfn.XLOOKUP($E8,'Activity 6'!$B$33:$B$38,'Activity 6'!I$33:I$38,\"N/A\",0,1)","v":"N/A"},{"$f":"_xlfn.XLOOKUP($E8,'Activity 6'!$B$33:$B$38,'Activity 6'!J$33:J$38,\"N/A\",0,1)","v":"N/A"},{"$f":"_xlfn.XLOOKUP($E8,'Activity 6'!$B$33:$B$38,'Activity 6'!K$33:K$38,\"N/A\",0,1)","v":"N/A"},{"$f":"_xlfn.XLOOKUP($E8,'Activity 6'!$B$33:$B$38,'Activity 6'!M$33:M$38,\"N/A\",0,1)","v":"N/A"},{"$f":"_xlfn.XLOOKUP($E8,'Activity 7'!$B$7:$B$13,'Activity 7'!$A$7:$A$13,\"No\",0,1)","v":"No"},{"$f":"_xlfn.XLOOKUP($E8,'Activity 7'!$B$7:$B$13,'Activity 7'!C$7:C$13,\"N/A\",0,1)","v":"N/A"},{"$f":"_xlfn.XLOOKUP($E8,'Activity 7'!$B$7:$B$13,'Activity 7'!D$7:D$13,\"N/A\",0,1)","v":"N/A"},{"$f":"_xlfn.XLOOKUP($E8,'Activity 7'!$B$7:$B$13,'Activity 7'!E$7:E$13,\"N/A\",0,1)","v":"N/A"},{"$f":"_xlfn.XLOOKUP($E8,'Activity 7'!$B$7:$B$13,'Activity 7'!F$7:F$13,\"N/A\",0,1)","v":"N/A"},{"$f":"_xlfn.XLOOKUP($E8,'Activity 7'!$B$7:$B$13,'Activity 7'!G$7:G$13,\"N/A\",0,1)","v":"N/A"},{"$f":"_xlfn.XLOOKUP($E8,'Activity 7'!$B$7:$B$13,'Activity 7'!H$7:H$13,\"N/A\",0,1)","v":"N/A"},{"$f":"_xlfn.XLOOKUP($E8,'Activity 7'!$B$7:$B$13,'Activity 7'!I$7:I$13,\"N/A\",0,1)","v":"N/A"},{"$f":"_xlfn.XLOOKUP($E8,'Activity 7'!$B$7:$B$13,'Activity 7'!J$7:J$13,\"N/A\",0,1)","v":"N/A"},{"$f":"_xlfn.XLOOKUP($E8,'Activity 7'!$B$7:$B$13,'Activity 7'!K$7:K$13,\"N/A\",0,1)","v":"N/A"},{"$f":"_xlfn.XLOOKUP($E8,'Activity 7'!$B$7:$B$13,'Activity 7'!L$7:L$13,\"N/A\",0,1)","v":"N/A"},{"$f":"_xlfn.XLOOKUP($E8,'Activity 7'!$B$7:$B$13,'Activity 7'!M$7:M$13,\"N/A\",0,1)","v":"N/A"},{"$f":"_xlfn.XLOOKUP($E8,'Activity 7'!$B$17:$B$23,'Activity 7'!C$17:C$23,\"N/A\",0,1)","v":"N/A"},{"$f":"_xlfn.XLOOKUP($E8,'Activity 7'!$B$17:$B$23,'Activity 7'!D$17:D$23,\"N/A\",0,1)","v":"N/A"},{"$f":"_xlfn.XLOOKUP($E8,'Activity 7'!$B$17:$B$23,'Activity 7'!E$17:E$23,\"N/A\",0,1)","v":"N/A"},{"$f":"_xlfn.XLOOKUP($E8,'Activity 7'!$B$17:$B$23,'Activity 7'!F$17:F$23,\"N/A\",0,1)","v":"N/A"},{"$f":"_xlfn.XLOOKUP($E8,'Activity 7'!$B$17:$B$23,'Activity 7'!G$17:G$23,\"N/A\",0,1)","v":"N/A"},{"$f":"_xlfn.XLOOKUP($E8,'Activity 7'!$B$17:$B$23,'Activity 7'!H$17:H$23,\"N/A\",0,1)","v":"N/A"},{"$f":"_xlfn.XLOOKUP($E8,'Activity 7'!$B$17:$B$23,'Activity 7'!I$17:I$23,\"N/A\",0,1)","v":"N/A"},{"$f":"_xlfn.XLOOKUP($E8,'Activity 7'!$B$17:$B$23,'Activity 7'!J$17:J$23,\"N/A\",0,1)","v":"N/A"},{"$f":"_xlfn.XLOOKUP($E8,'Activity 7'!$B$17:$B$23,'Activity 7'!L$17:L$23,\"N/A\",0,1)","v":"N/A"},{"$f":"_xlfn.XLOOKUP($E8,'Activity 8'!$B$7:$B$13,'Activity 8'!A$7:A$13,\"No\",0,1)","v":"No"},{"$f":"_xlfn.XLOOKUP($E8,'Activity 8'!$B$7:$B$13,'Activity 8'!C$7:C$13,\"N/A\",0,1)","v":"N/A"},{"$f":"_xlfn.XLOOKUP($E8,'Activity 8'!$B$7:$B$13,'Activity 8'!D$7:D$13,\"N/A\",0,1)","v":"N/A"},{"$f":"_xlfn.XLOOKUP($E8,'Activity 8'!$B$7:$B$13,'Activity 8'!E$7:E$13,\"N/A\",0,1)","v":"N/A"},{"$f":"_xlfn.XLOOKUP($E8,'Activity 8'!$B$7:$B$13,'Activity 8'!F$7:F$13,\"N/A\",0,1)","v":"N/A"},{"$f":"_xlfn.XLOOKUP($E8,'Activity 8'!$B$7:$B$13,'Activity 8'!G$7:G$13,\"N/A\",0,1)","v":"N/A"},{"$f":"_xlfn.XLOOKUP($E8,'Activity 8'!$B$7:$B$13,'Activity 8'!H$7:H$13,\"N/A\",0,1)","v":"N/A"},{"$f":"_xlfn.XLOOKUP($E8,'Activity 8'!$B$7:$B$13,'Activity 8'!I$7:I$13,\"N/A\",0,1)","v":"N/A"},{"$f":"_xlfn.XLOOKUP($E8,'Activity 8'!$B$7:$B$13,'Activity 8'!J$7:J$13,\"N/A\",0,1)","v":"N/A"},{"$f":"_xlfn.XLOOKUP($E8,'Activity 8'!$B$7:$B$13,'Activity 8'!K$7:K$13,\"N/A\",0,1)","v":"N/A"},{"$f":"_xlfn.XLOOKUP($E8,'Activity 8'!$B$7:$B$13,'Activity 8'!L$7:L$13,\"N/A\",0,1)","v":"N/A"},{"$f":"_xlfn.XLOOKUP($E8,'Activity 8'!$B$7:$B$13,'Activity 8'!M$7:M$13,\"N/A\",0,1)","v":"N/A"},{"$f":"_xlfn.XLOOKUP($E8,'Activity 8'!$B$7:$B$13,'Activity 8'!N$7:N$13,\"N/A\",0,1)","v":"N/A"},{"$f":"_xlfn.XLOOKUP($E8,'Activity 8'!$B$7:$B$13,'Activity 8'!O$7:O$13,\"N/A\",0,1)","v":"N/A"},{"$f":"_xlfn.XLOOKUP($E8,'Activity 8'!$B$7:$B$13,'Activity 8'!P$7:P$13,\"N/A\",0,1)","v":"N/A"},{"$f":"_xlfn.XLOOKUP($E8,'Activity 8'!$B$17:$B$23,'Activity 8'!C$17:C$23,\"N/A\",0,1)","v":"N/A"},{"$f":"_xlfn.XLOOKUP($E8,'Activity 8'!$B$17:$B$23,'Activity 8'!D$17:D$23,\"N/A\",0,1)","v":"N/A"},{"$f":"_xlfn.XLOOKUP($E8,'Activity 8'!$B$17:$B$23,'Activity 8'!E$17:E$23,\"N/A\",0,1)","v":"N/A"},{"$f":"_xlfn.XLOOKUP($E8,'Activity 8'!$B$17:$B$23,'Activity 8'!F$17:F$23,\"N/A\",0,1)","v":"N/A"},{"$f":"_xlfn.XLOOKUP($E8,'Activity 8'!$B$17:$B$23,'Activity 8'!G$17:G$23,\"N/A\",0,1)","v":"N/A"},{"$f":"_xlfn.XLOOKUP($E8,'Activity 8'!$B$17:$B$23,'Activity 8'!H$17:H$23,\"N/A\",0,1)","v":"N/A"},{"$f":"_xlfn.XLOOKUP($E8,'Activity 8'!$B$17:$B$23,'Activity 8'!I$17:I$23,\"N/A\",0,1)","v":"N/A"},{"$f":"_xlfn.XLOOKUP($E8,'Activity 8'!$B$17:$B$23,'Activity 8'!J$17:J$23,\"N/A\",0,1)","v":"N/A"},{"$f":"_xlfn.XLOOKUP($E8,'Activity 8'!$B$17:$B$23,'Activity 8'!K$17:K$23,\"N/A\",0,1)","v":"N/A"},{"$f":"_xlfn.XLOOKUP($E8,'Activity 8'!$B$17:$B$23,'Activity 8'!L$17:L$23,\"N/A\",0,1)","v":"N/A"},{"$f":"_xlfn.XLOOKUP($E8,'Activity 8'!$B$17:$B$23,'Activity 8'!M$17:M$23,\"N/A\",0,1)","v":"N/A"},{"$f":"_xlfn.XLOOKUP($E8,'Activity 8'!$B$17:$B$23,'Activity 8'!P$17:P$23,\"N/A\",0,1)","v":"N/A"},{"$f":"_xlfn.XLOOKUP(E8,'Activity 9'!B13:B19,'Activity 9'!A13:A19,\"No\",0,1)","v":"No"},{"$f":"_xlfn.XLOOKUP($E8,'Activity 9'!$B$7:$B$13,'Activity 9'!C$7:C$13,\"N/A\",0,1)","v":"N/A"},{"$f":"_xlfn.XLOOKUP($E8,'Activity 9'!$B$7:$B$13,'Activity 9'!D$7:D$13,\"N/A\",0,1)","v":"N/A"},{"$f":"_xlfn.XLOOKUP($E8,'Activity 9'!$B$7:$B$13,'Activity 9'!E$7:E$13,\"N/A\",0,1)","v":"N/A"},{"$f":"_xlfn.XLOOKUP($E8,'Activity 9'!$B$7:$B$13,'Activity 9'!H$7:H$13,\"N/A\",0,1)","v":"N/A"},{"$f":"_xlfn.XLOOKUP($E8,'Activity 9'!$B$7:$B$13,'Activity 9'!I$7:I$13,\"N/A\",0,1)","v":"N/A"},{"$f":"_xlfn.XLOOKUP($E8,'Activity 9'!$B$7:$B$13,'Activity 9'!J$7:J$13,\"N/A\",0,1)","v":"N/A"},{"$f":"_xlfn.XLOOKUP($E8,'Activity 9'!$B$7:$B$13,'Activity 9'!K$7:K$13,\"N/A\",0,1)","v":"N/A"},{"$f":"_xlfn.XLOOKUP($E8,'Activity 9'!$B$7:$B$13,'Activity 9'!L$7:L$13,\"N/A\",0,1)","v":"N/A"},{"$f":"_xlfn.XLOOKUP($E8,'Activity 9'!$B$7:$B$13,'Activity 9'!M$7:M$13,\"N/A\",0,1)","v":"N/A"},{"$f":"_xlfn.XLOOKUP($E8,'Activity 9'!$B$7:$B$13,'Activity 9'!N$7:N$13,\"N/A\",0,1)","v":"N/A"},{"$f":"_xlfn.XLOOKUP($E8,'Activity 9'!$B$7:$B$13,'Activity 9'!O$7:O$13,\"N/A\",0,1)","v":"N/A"},{"$f":"_xlfn.XLOOKUP($E8,'Activity 9'!$B$17:$B$23,'Activity 9'!C$17:C$23,\"N/A\",0,1)","v":"N/A"},{"$f":"_xlfn.XLOOKUP($E8,'Activity 9'!$B$17:$B$23,'Activity 9'!D$17:D$23,\"N/A\",0,1)","v":"N/A"},{"$f":"_xlfn.XLOOKUP($E8,'Activity 9'!$B$17:$B$23,'Activity 9'!E$17:E$23,\"N/A\",0,1)","v":"N/A"},{"$f":"_xlfn.XLOOKUP($E8,'Activity 9'!$B$17:$B$23,'Activity 9'!F$17:F$23,\"N/A\",0,1)","v":"N/A"},{"$f":"_xlfn.XLOOKUP($E8,'Activity 9'!$B$17:$B$23,'Activity 9'!G$17:G$23,\"N/A\",0,1)","v":"N/A"},{"$f":"_xlfn.XLOOKUP($E8,'Activity 9'!$B$17:$B$23,'Activity 9'!H$17:H$23,\"N/A\",0,1)","v":"N/A"},{"$f":"_xlfn.XLOOKUP($E8,'Activity 9'!$B$17:$B$23,'Activity 9'!I$17:I$23,\"N/A\",0,1)","v":"N/A"},{"$f":"_xlfn.XLOOKUP($E8,'Activity 9'!$B$17:$B$23,'Activity 9'!J$17:J$23,\"N/A\",0,1)","v":"N/A"},{"$f":"_xlfn.XLOOKUP($E8,'Activity 9'!$B$17:$B$23,'Activity 9'!L$17:L$23,\"N/A\",0,1)","v":"N/A"},{"$f":"_xlfn.XLOOKUP($E8,'Activity 9'!$B$17:$B$23,'Activity 9'!M$17:M$23,\"N/A\",0,1)","v":"N/A"},{"$f":"_xlfn.XLOOKUP($E8,'Activity 9'!$B$17:$B$23,'Activity 9'!O$17:O$23,\"N/A\",0,1)","v":"N/A"},{"$f":"_xlfn.XLOOKUP($E8,'Activity 10'!B13:B19,'Activity 10'!A13:A19,\"No\",0,1)","v":"No"},{"$f":"_xlfn.XLOOKUP($E8,'Activity 10'!$B$7:$B$13,'Activity 10'!C$7:C$13,\"N/A\",0,1)","v":"N/A"},{"$f":"_xlfn.XLOOKUP($E8,'Activity 10'!$B$7:$B$13,'Activity 10'!D$7:D$13,\"N/A\",0,1)","v":"N/A"},{"$f":"_xlfn.XLOOKUP($E8,'Activity 10'!$B$7:$B$13,'Activity 10'!E$7:E$13,\"N/A\",0,1)","v":"N/A"},{"$f":"_xlfn.XLOOKUP($E8,'Activity 10'!$B$7:$B$13,'Activity 10'!F$7:F$13,\"N/A\",0,1)","v":"N/A"},{"$f":"_xlfn.XLOOKUP($E8,'Activity 10'!$B$7:$B$13,'Activity 10'!G$7:G$13,\"N/A\",0,1)","v":"N/A"},{"$f":"_xlfn.XLOOKUP($E8,'Activity 10'!$B$7:$B$13,'Activity 10'!H$7:H$13,\"N/A\",0,1)","v":"N/A"},{"$f":"_xlfn.XLOOKUP($E8,'Activity 10'!$B$7:$B$13,'Activity 10'!I$7:I$13,\"N/A\",0,1)","v":"N/A"},{"$f":"_xlfn.XLOOKUP($E8,'Activity 10'!$B$7:$B$13,'Activity 10'!J$7:J$13,\"N/A\",0,1)","v":"N/A"},{"$f":"_xlfn.XLOOKUP($E8,'Activity 10'!$B$7:$B$13,'Activity 10'!K$7:K$13,\"N/A\",0,1)","v":"N/A"},{"$f":"_xlfn.XLOOKUP($E8,'Activity 10'!$B$7:$B$13,'Activity 10'!L$7:L$13,\"N/A\",0,1)","v":"N/A"},{"$f":"_xlfn.XLOOKUP($E8,'Activity 10'!$B$7:$B$13,'Activity 10'!M$7:M$13,\"N/A\",0,1)","v":"N/A"},{"$f":"_xlfn.XLOOKUP($E8,'Activity 10'!$B$7:$B$13,'Activity 10'!N$7:N$13,\"N/A\",0,1)","v":"N/A"},{"$f":"_xlfn.XLOOKUP($E8,'Activity 10'!$B$7:$B$13,'Activity 10'!O$7:O$13,\"N/A\",0,1)","v":"N/A"},{"$f":"_xlfn.XLOOKUP($E8,'Activity 10'!$B$17:$B$23,'Activity 10'!C$17:C$23,\"N/A\",0,1)","v":"N/A"},{"$f":"_xlfn.XLOOKUP($E8,'Activity 10'!$B$17:$B$23,'Activity 10'!D$17:D$23,\"N/A\",0,1)","v":"N/A"},{"$f":"_xlfn.XLOOKUP($E8,'Activity 10'!$B$17:$B$23,'Activity 10'!E$17:E$23,\"N/A\",0,1)","v":"N/A"},{"$f":"_xlfn.XLOOKUP($E8,'Activity 10'!$B$17:$B$23,'Activity 10'!F$17:F$23,\"N/A\",0,1)","v":"N/A"},{"$f":"_xlfn.XLOOKUP($E8,'Activity 10'!$B$17:$B$23,'Activity 10'!G$17:G$23,\"N/A\",0,1)","v":"N/A"},{"$f":"_xlfn.XLOOKUP($E8,'Activity 10'!$B$17:$B$23,'Activity 10'!H$17:H$23,\"N/A\",0,1)","v":"N/A"},{"$f":"_xlfn.XLOOKUP($E8,'Activity 10'!$B$17:$B$23,'Activity 10'!I$17:I$23,\"N/A\",0,1)","v":"N/A"},{"$f":"_xlfn.XLOOKUP($E8,'Activity 10'!$B$17:$B$23,'Activity 10'!J$17:J$23,\"N/A\",0,1)","v":"N/A"},{"$f":"_xlfn.XLOOKUP($E8,'Activity 10'!$B$17:$B$23,'Activity 10'!K$17:K$23,\"N/A\",0,1)","v":"N/A"},{"$f":"_xlfn.XLOOKUP($E8,'Activity 10'!$B$17:$B$23,'Activity 10'!L$17:L$23,\"N/A\",0,1)","v":"N/A"},{"$f":"_xlfn.XLOOKUP($E8,'Activity 10'!$B$17:$B$23,'Activity 10'!N$17:N$23,\"N/A\",0,1)","v":"N/A"},{"$f":"_xlfn.XLOOKUP($E8,'Competitive Activity 1'!B13:B19,'Competitive Activity 1'!A13:A19,\"No\",0,1)","v":"No"},{"$f":"_xlfn.XLOOKUP($E8,'Competitive Activity 1'!$B$7:$B$13,'Competitive Activity 1'!C$7:C$13,\"N/A\",0,1)","v":"N/A"},{"$f":"_xlfn.XLOOKUP($E8,'Competitive Activity 1'!$B$7:$B$13,'Competitive Activity 1'!D$7:D$13,\"N/A\",0,1)","v":"N/A"},{"$f":"_xlfn.XLOOKUP($E8,'Competitive Activity 1'!$B$7:$B$13,'Competitive Activity 1'!E$7:E$13,\"N/A\",0,1)","v":"N/A"},{"$f":"_xlfn.XLOOKUP($E8,'Competitive Activity 1'!$B$7:$B$13,'Competitive Activity 1'!F$7:F$13,\"N/A\",0,1)","v":"N/A"},{"$f":"_xlfn.XLOOKUP($E8,'Competitive Activity 1'!$B$7:$B$13,'Competitive Activity 1'!G$7:G$13,\"N/A\",0,1)","v":"N/A"},{"$f":"_xlfn.XLOOKUP($E8,'Competitive Activity 1'!$B$7:$B$13,'Competitive Activity 1'!H$7:H$13,\"N/A\",0,1)","v":"N/A"},{"$f":"_xlfn.XLOOKUP($E8,'Competitive Activity 1'!$B$7:$B$13,'Competitive Activity 1'!I$7:I$13,\"N/A\",0,1)","v":"N/A"},{"$f":"_xlfn.XLOOKUP($E8,'Competitive Activity 1'!$B$7:$B$13,'Competitive Activity 1'!J$7:J$13,\"N/A\",0,1)","v":"N/A"},{"$f":"_xlfn.XLOOKUP($E8,'Competitive Activity 1'!$B$7:$B$13,'Competitive Activity 1'!K$7:K$13,\"N/A\",0,1)","v":"N/A"},{"$f":"_xlfn.XLOOKUP($E8,'Competitive Activity 1'!$B$7:$B$13,'Competitive Activity 1'!L$7:L$13,\"N/A\",0,1)","v":"N/A"},{"$f":"_xlfn.XLOOKUP($E8,'Competitive Activity 1'!$B$7:$B$13,'Competitive Activity 1'!M$7:M$13,\"N/A\",0,1)","v":"N/A"},{"$f":"_xlfn.XLOOKUP($E8,'Competitive Activity 1'!$B$7:$B$13,'Competitive Activity 1'!N$7:N$13,\"N/A\",0,1)","v":"N/A"},{"$f":"_xlfn.XLOOKUP($E8,'Competitive Activity 1'!$B$7:$B$13,'Competitive Activity 1'!O$7:O$13,\"N/A\",0,1)","v":"N/A"},{"$f":"_xlfn.XLOOKUP($E8,'Competitive Activity 1'!$B$7:$B$13,'Competitive Activity 1'!P$7:P$13,\"N/A\",0,1)","v":"N/A"},{"$f":"_xlfn.XLOOKUP($E8,'Competitive Activity 1'!$B$17:$B$23,'Competitive Activity 1'!C$17:C$23,\"N/A\",0,1)","v":"N/A"},{"$f":"_xlfn.XLOOKUP($E8,'Competitive Activity 1'!$B$17:$B$23,'Competitive Activity 1'!D$17:D$23,\"N/A\",0,1)","v":"N/A"},{"$f":"_xlfn.XLOOKUP($E8,'Competitive Activity 1'!$B$17:$B$23,'Competitive Activity 1'!E$17:E$23,\"N/A\",0,1)","v":"N/A"},{"$f":"_xlfn.XLOOKUP($E8,'Competitive Activity 1'!$B$17:$B$23,'Competitive Activity 1'!F$17:F$23,\"N/A\",0,1)","v":"N/A"},{"$f":"_xlfn.XLOOKUP($E8,'Competitive Activity 1'!$B$17:$B$23,'Competitive Activity 1'!G$17:G$23,\"N/A\",0,1)","v":"N/A"},{"$f":"_xlfn.XLOOKUP($E8,'Competitive Activity 1'!$B$17:$B$23,'Competitive Activity 1'!H$17:H$23,\"N/A\",0,1)","v":"N/A"},{"$f":"_xlfn.XLOOKUP($E8,'Competitive Activity 1'!$B$17:$B$23,'Competitive Activity 1'!I$17:I$23,\"N/A\",0,1)","v":"N/A"},{"$f":"_xlfn.XLOOKUP($E8,'Competitive Activity 1'!$B$17:$B$23,'Competitive Activity 1'!J$17:J$23,\"N/A\",0,1)","v":"N/A"},{"$f":"_xlfn.XLOOKUP($E8,'Competitive Activity 1'!$B$17:$B$23,'Competitive Activity 1'!K$17:K$23,\"N/A\",0,1)","v":"N/A"},{"$f":"_xlfn.XLOOKUP($E8,'Competitive Activity 1'!$B$17:$B$23,'Competitive Activity 1'!M$17:M$23,\"N/A\",0,1)","v":"N/A"},{"$f":"_xlfn.XLOOKUP($E8,'Competitive Activity 1'!$B$17:$B$23,'Competitive Activity 1'!N$17:N$23,\"N/A\",0,1)","v":"N/A"},{"$f":"_xlfn.XLOOKUP($E8,'Competitive Activity 1'!$B$17:$B$23,'Competitive Activity 1'!P$17:P$23,\"N/A\",0,1)","v":"N/A"},{"$f":"_xlfn.XLOOKUP($E8,'Competitive Activity 2'!$B$7:$B$13,'Competitive Activity 2'!$A$7:$A$13,\"No\",0,1)","v":"No"},{"$f":"_xlfn.XLOOKUP($E8,'Competitive Activity 2'!$B$7:$B$13,'Competitive Activity 2'!C$7:C$13,\"N/A\",0,1)","v":"N/A"},{"$f":"_xlfn.XLOOKUP($E8,'Competitive Activity 2'!$B$7:$B$13,'Competitive Activity 2'!D$7:D$13,\"N/A\",0,1)","v":"N/A"},{"$f":"_xlfn.XLOOKUP($E8,'Competitive Activity 2'!$B$7:$B$13,'Competitive Activity 2'!E$7:E$13,\"N/A\",0,1)","v":"N/A"},{"$f":"_xlfn.XLOOKUP($E8,'Competitive Activity 2'!$B$7:$B$13,'Competitive Activity 2'!F$7:F$13,\"N/A\",0,1)","v":"N/A"},{"$f":"_xlfn.XLOOKUP($E8,'Competitive Activity 2'!$B$7:$B$13,'Competitive Activity 2'!G$7:G$13,\"N/A\",0,1)","v":"N/A"},{"$f":"_xlfn.XLOOKUP($E8,'Competitive Activity 2'!$B$7:$B$13,'Competitive Activity 2'!H$7:H$13,\"N/A\",0,1)","v":"N/A"},{"$f":"_xlfn.XLOOKUP($E8,'Competitive Activity 2'!$B$7:$B$13,'Competitive Activity 2'!I$7:I$13,\"N/A\",0,1)","v":"N/A"},{"$f":"_xlfn.XLOOKUP($E8,'Competitive Activity 2'!$B$7:$B$13,'Competitive Activity 2'!J$7:J$13,\"N/A\",0,1)","v":"N/A"},{"$f":"_xlfn.XLOOKUP($E8,'Competitive Activity 2'!$B$7:$B$13,'Competitive Activity 2'!K$7:K$13,\"N/A\",0,1)","v":"N/A"},{"$f":"_xlfn.XLOOKUP($E8,'Competitive Activity 2'!$B$7:$B$13,'Competitive Activity 2'!L$7:L$13,\"N/A\",0,1)","v":"N/A"},{"$f":"_xlfn.XLOOKUP($E8,'Competitive Activity 2'!$B$17:$B$23,'Competitive Activity 2'!C$17:C$23,\"N/A\",0,1)","v":"N/A"},{"$f":"_xlfn.XLOOKUP($E8,'Competitive Activity 2'!$B$17:$B$23,'Competitive Activity 2'!D$17:D$23,\"N/A\",0,1)","v":"N/A"},{"$f":"_xlfn.XLOOKUP($E8,'Competitive Activity 2'!$B$17:$B$23,'Competitive Activity 2'!E$17:E$23,\"N/A\",0,1)","v":"N/A"},{"$f":"_xlfn.XLOOKUP($E8,'Competitive Activity 2'!$B$17:$B$23,'Competitive Activity 2'!F$17:F$23,\"N/A\",0,1)","v":"N/A"},{"$f":"_xlfn.XLOOKUP($E8,'Competitive Activity 2'!$B$17:$B$23,'Competitive Activity 2'!G$17:G$23,\"N/A\",0,1)","v":"N/A"},{"$f":"_xlfn.XLOOKUP($E8,'Competitive Activity 2'!$B$17:$B$23,'Competitive Activity 2'!H$17:H$23,\"N/A\",0,1)","v":"N/A"},{"$f":"_xlfn.XLOOKUP($E8,'Competitive Activity 2'!$B$17:$B$23,'Competitive Activity 2'!I$17:I$23,\"N/A\",0,1)","v":"N/A"},{"$f":"_xlfn.XLOOKUP($E8,'Competitive Activity 2'!$B$17:$B$23,'Competitive Activity 2'!J$17:J$23,\"N/A\",0,1)","v":"N/A"},{"$f":"_xlfn.XLOOKUP($E8,'Competitive Activity 2'!$B$17:$B$23,'Competitive Activity 2'!K$17:K$23,\"N/A\",0,1)","v":"N/A"},{"$f":"_xlfn.XLOOKUP($E8,'Competitive Activity 2'!$B$17:$B$23,'Competitive Activity 2'!L$17:L$23,\"N/A\",0,1)","v":"N/A"},{"$f":"_xlfn.XLOOKUP($E8,'Competitive Activity 2'!$B$17:$B$23,'Competitive Activity 2'!M$17:M$23,\"N/A\",0,1)","v":"N/A"},{"$f":"_xlfn.XLOOKUP($E8,'Competitive Activity 2'!$B$27:$B$33,'Competitive Activity 2'!C$27:C$33,\"N/A\",0,1)","v":"N/A"},{"$f":"_xlfn.XLOOKUP($E8,'Competitive Activity 2'!$B$27:$B$33,'Competitive Activity 2'!D$27:D$33,\"N/A\",0,1)","v":"N/A"},{"$f":"_xlfn.XLOOKUP($E8,'Competitive Activity 2'!$B$27:$B$33,'Competitive Activity 2'!E$27:E$33,\"N/A\",0,1)","v":"N/A"},{"$f":"_xlfn.XLOOKUP($E8,'Competitive Activity 2'!$B$27:$B$33,'Competitive Activity 2'!F$27:F$33,\"N/A\",0,1)","v":"N/A"},{"$f":"_xlfn.XLOOKUP($E8,'Competitive Activity 2'!$B$27:$B$33,'Competitive Activity 2'!G$27:G$33,\"N/A\",0,1)","v":"N/A"},{"$f":"_xlfn.XLOOKUP($E8,'Competitive Activity 2'!$B$27:$B$33,'Competitive Activity 2'!H$27:H$33,\"N/A\",0,1)","v":"N/A"},{"$f":"_xlfn.XLOOKUP($E8,'Competitive Activity 2'!$B$27:$B$33,'Competitive Activity 2'!I$27:I$33,\"N/A\",0,1)","v":"N/A"},{"$f":"_xlfn.XLOOKUP($E8,'Competitive Activity 2'!$B$27:$B$33,'Competitive Activity 2'!J$27:J$33,\"N/A\",0,1)","v":"N/A"},{"$f":"_xlfn.XLOOKUP($E8,'Competitive Activity 2'!$B$27:$B$33,'Competitive Activity 2'!L$27:L$33,\"N/A\",0,1)","v":"N/A"}]
[{"$f":"'1-Cover Sheet'!$C$8","v":0},{"$f":"'1-Cover Sheet'!$F$8","v":"Select One"},{"$f":"'Summary Sheet'!$D$8","v":0},{"$f":"'Summary Sheet'!$D$10","v":0},{"$f":"'3-Financial Summary'!A19","v":0},{"$f":"'3-Financial Summary'!B19","v":0},{"$f":"'3-Financial Summary'!C19","v":0},{"$f":"'3-Financial Summary'!D19","v":0},{"$f":"'3-Financial Summary'!E19","v":0},{"$f":"VLOOKUP(E9,'Summary Sheet'!$A$23:$L$34,11,FALSE)","v":"N/A"},{"$f":"VLOOKUP(E9,'Summary Sheet'!$A$23:$L$34,12,FALSE)","v":"N/A"},{"$f":"'3-Financial Summary'!F19","v":0},{"$f":"'3-Financial Summary'!G19","v":"00:00:00"},{"$f":"'3-Financial Summary'!H19","v":0},{"$f":"_xlfn.XLOOKUP($E9,'Activity 1'!$B$7:$B$13,'Activity 1'!$A$7:$A$13,\"No\",0,1)","v":"No"},{"$f":"_xlfn.XLOOKUP($E9,'Activity 1'!$B$7:$B$13,'Activity 1'!C14:C20,\"N/A\",0,1)","v":"N/A"},{"$f":"_xlfn.XLOOKUP($E9,'Activity 1'!$B$7:$B$13,'Activity 1'!D14:D20,\"N/A\",0,1)","v":"N/A"},{"$f":"_xlfn.XLOOKUP($E9,'Activity 1'!$B$7:$B$13,'Activity 1'!E$7:E$13,\"N/A\",0,1)","v":"N/A"},{"$f":"_xlfn.XLOOKUP($E9,'Activity 1'!$B$7:$B$13,'Activity 1'!F$7:F$13,\"N/A\",0,1)","v":"N/A"},{"$f":"_xlfn.XLOOKUP($E9,'Activity 1'!$B$7:$B$13,'Activity 1'!G$7:G$13,\"N/A\",0,1)","v":"N/A"},{"$f":"_xlfn.XLOOKUP($E9,'Activity 1'!$B$7:$B$13,'Activity 1'!H$7:H$13,\"N/A\",0,1)","v":"N/A"},{"$f":"_xlfn.XLOOKUP($E9,'Activity 1'!$B$7:$B$13,'Activity 1'!I$7:I$13,\"N/A\",0,1)","v":"N/A"},{"$f":"_xlfn.XLOOKUP($E9,'Activity 1'!$B$7:$B$13,'Activity 1'!J$7:J$13,\"N/A\",0,1)","v":"N/A"},{"$f":"_xlfn.XLOOKUP($E9,'Activity 1'!$B$7:$B$13,'Activity 1'!K$7:K$13,\"N/A\",0,1)","v":"N/A"},{"$f":"_xlfn.XLOOKUP($E9,'Activity 1'!$B$7:$B$13,'Activity 1'!L$7:L$13,\"N/A\",0,1)","v":"N/A"},{"$f":"_xlfn.XLOOKUP($E9,'Activity 1'!$B$7:$B$13,'Activity 1'!M$7:M$13,\"N/A\",0,1)","v":"N/A"},{"$f":"_xlfn.XLOOKUP($E9,'Activity 1'!$B$7:$B$13,'Activity 1'!N$7:N$13,\"N/A\",0,1)","v":"N/A"},{"$f":"_xlfn.XLOOKUP($E9,'Activity 1'!$B$7:$B$13,'Activity 1'!O$7:O$13,\"N/A\",0,1)","v":"N/A"},{"$f":"_xlfn.XLOOKUP($E9,'Activity 1'!$B$7:$B$13,'Activity 1'!P$7:P$13,\"N/A\",0,1)","v":"N/A"},{"$f":"_xlfn.XLOOKUP($E9,'Activity 1'!$B$7:$B$13,'Activity 1'!Q$7:Q$13,\"N/A\",0,1)","v":"N/A"},{"$f":"_xlfn.XLOOKUP($E9,'Activity 1'!$B$17:$B$23,'Activity 1'!C$17:C$23,\"N/A\",0,1)","v":"N/A"},{"$f":"_xlfn.XLOOKUP($E9,'Activity 1'!$B$17:$B$23,'Activity 1'!D$17:D$23,\"N/A\",0,1)","v":"N/A"},{"$f":"_xlfn.XLOOKUP($E9,'Activity 1'!$B$17:$B$23,'Activity 1'!E$17:E$23,\"N/A\",0,1)","v":"N/A"},{"$f":"_xlfn.XLOOKUP($E9,'Activity 1'!$B$17:$B$23,'Activity 1'!F$17:F$23,\"N/A\",0,1)","v":"N/A"},{"$f":"_xlfn.XLOOKUP($E9,'Activity 1'!$B$17:$B$23,'Activity 1'!G$17:G$23,\"N/A\",0,1)","v":"N/A"},{"$f":"_xlfn.XLOOKUP($E9,'Activity 1'!$B$17:$B$23,'Activity 1'!H$17:H$23,\"N/A\",0,1)","v":"N/A"},{"$f":"_xlfn.XLOOKUP($E9,'Activity 1'!$B$17:$B$23,'Activity 1'!I$17:I$23,\"N/A\",0,1)","v":"N/A"},{"$f":"_xlfn.XLOOKUP($E9,'Activity 1'!$B$17:$B$23,'Activity 1'!J$17:J$23,\"N/A\",0,1)","v":"N/A"},{"$f":"_xlfn.XLOOKUP($E9,'Activity 1'!$B$17:$B$23,'Activity 1'!K$17:K$23,\"N/A\",0,1)","v":"N/A"},{"$f":"_xlfn.XLOOKUP($E9,'Activity 1'!$B$17:$B$23,'Activity 1'!L$17:L$23,\"N/A\",0,1)","v":"N/A"},{"$f":"_xlfn.XLOOKUP($E9,'Activity 1'!$B$17:$B$23,'Activity 1'!M$17:M$23,\"N/A\",0,1)","v":"N/A"},{"$f":"_xlfn.XLOOKUP($E9,'Activity 1'!$B$17:$B$23,'Activity 1'!O$17:O$23,\"N/A\",0,1)","v":"N/A"},{"$f":"_xlfn.XLOOKUP($E9,'Activity 1'!$B$17:$B$23,'Activity 1'!Q$17:Q$23,\"N/A\",0,1)","v":"N/A"},{"$f":"_xlfn.XLOOKUP($E9,'Activity 2'!$B$7:$B$13,'Activity 2'!A$7:A$13,\"No\",0)","v":"No"},{"$f":"_xlfn.XLOOKUP($E9,'Activity 2'!$B$7:$B$13,'Activity 2'!C$7:C$13,\"N/A\",0,1)","v":"N/A"},{"$f":"_xlfn.XLOOKUP($E9,'Activity 2'!$B$7:$B$13,'Activity 2'!D$7:D$13,\"N/A\",0,1)","v":"N/A"},{"$f":"_xlfn.XLOOKUP($E9,'Activity 2'!$B$7:$B$13,'Activity 2'!E$7:E$13,\"N/A\",0,1)","v":"N/A"},{"$f":"_xlfn.XLOOKUP($E9,'Activity 2'!$B$7:$B$13,'Activity 2'!F$7:F$13,\"N/A\",0,1)","v":"N/A"},{"$f":"_xlfn.XLOOKUP($E9,'Activity 2'!$B$7:$B$13,'Activity 2'!G$7:G$13,\"N/A\",0,1)","v":"N/A"},{"$f":"_xlfn.XLOOKUP($E9,'Activity 2'!$B$7:$B$13,'Activity 2'!H$7:H$13,\"N/A\",0,1)","v":"N/A"},{"$f":"_xlfn.XLOOKUP($E9,'Activity 2'!$B$7:$B$13,'Activity 2'!I$7:I$13,\"N/A\",0,1)","v":"N/A"},{"$f":"_xlfn.XLOOKUP($E9,'Activity 2'!$B$7:$B$13,'Activity 2'!J$7:J$13,\"N/A\",0,1)","v":"N/A"},{"$f":"_xlfn.XLOOKUP($E9,'Activity 2'!$B$7:$B$13,'Activity 2'!K$7:K$13,\"N/A\",0,1)","v":"N/A"},{"$f":"_xlfn.XLOOKUP($E9,'Activity 2'!$B$7:$B$13,'Activity 2'!L$7:L$13,\"N/A\",0,1)","v":"N/A"},{"$f":"_xlfn.XLOOKUP($E9,'Activity 2'!$B$7:$B$13,'Activity 2'!M$7:M$13,\"N/A\",0,1)","v":"N/A"},{"$f":"_xlfn.XLOOKUP($E9,'Activity 2'!$B$7:$B$13,'Activity 2'!N$7:N$13,\"N/A\",0,1)","v":"N/A"},{"$f":"_xlfn.XLOOKUP($E9,'Activity 2'!$B$7:$B$13,'Activity 2'!O$7:O$13,\"N/A\",0,1)","v":"N/A"},{"$f":"_xlfn.XLOOKUP($E9,'Activity 2'!$B$7:$B$13,'Activity 2'!P$7:P$13,\"N/A\",0,1)","v":"N/A"},{"$f":"_xlfn.XLOOKUP($E9,'Activity 2'!$B$7:$B$13,'Activity 2'!Q$7:Q$13,\"N/A\",0,1)","v":"N/A"},{"$f":"_xlfn.XLOOKUP($E9,'Activity 2'!$B$17:$B$23,'Activity 2'!C$17:C$23,\"N/A\",0,1)","v":"N/A"},{"$f":"_xlfn.XLOOKUP($E9,'Activity 2'!$B$17:$B$23,'Activity 2'!D$17:D$23,\"N/A\",0,1)","v":"N/A"},{"$f":"_xlfn.XLOOKUP($E9,'Activity 2'!$B$17:$B$23,'Activity 2'!E$17:E$23,\"N/A\",0,1)","v":"N/A"},{"$f":"_xlfn.XLOOKUP($E9,'Activity 2'!$B$17:$B$23,'Activity 2'!F$17:F$23,\"N/A\",0,1)","v":"N/A"},{"$f":"_xlfn.XLOOKUP($E9,'Activity 2'!$B$17:$B$23,'Activity 2'!G$17:G$23,\"N/A\",0,1)","v":"N/A"},{"$f":"_xlfn.XLOOKUP($E9,'Activity 2'!$B$17:$B$23,'Activity 2'!H$17:H$23,\"N/A\",0,1)","v":"N/A"},{"$f":"_xlfn.XLOOKUP($E9,'Activity 2'!$B$17:$B$23,'Activity 2'!I$17:I$23,\"N/A\",0,1)","v":"N/A"},{"$f":"_xlfn.XLOOKUP($E9,'Activity 2'!$B$17:$B$23,'Activity 2'!J$17:J$23,\"N/A\",0,1)","v":"N/A"},{"$f":"_xlfn.XLOOKUP($E9,'Activity 2'!$B$17:$B$23,'Activity 2'!K$17:K$23,\"N/A\",0,1)","v":"N/A"},{"$f":"_xlfn.XLOOKUP($E9,'Activity 2'!$B$17:$B$23,'Activity 2'!L$17:L$23,\"N/A\",0,1)","v":"N/A"},{"$f":"_xlfn.XLOOKUP($E9,'Activity 2'!$B$17:$B$23,'Activity 2'!M$17:M$23,\"N/A\",0,1)","v":"N/A"},{"$f":"_xlfn.XLOOKUP($E9,'Activity 2'!$B$17:$B$23,'Activity 2'!O$17:O$23,\"N/A\",0,1)","v":"N/A"},{"$f":"_xlfn.XLOOKUP($E9,'Activity 2'!$B$17:$B$23,'Activity 2'!Q$17:Q$23,\"N/A\",0,1)","v":"N/A"},{"$f":"_xlfn.XLOOKUP($E9,'Activity 3'!$B$8:$B$14,'Activity 3'!A$8:A$14,\"No\",0,1)","v":"No"},{"$f":"_xlfn.XLOOKUP($E9,'Activity 3'!$B$8:$B$14,'Activity 3'!C$8:C$14,\"N/A\",0,1)","v":"N/A"},{"$f":"_xlfn.XLOOKUP($E9,'Activity 3'!$B$8:$B$14,'Activity 3'!D$8:D$14,\"N/A\",0,1)","v":"N/A"},{"$f":"_xlfn.XLOOKUP($E9,'Activity 3'!$B$8:$B$14,'Activity 3'!E$8:E$14,\"N/A\",0,1)","v":"N/A"},{"$f":"_xlfn.XLOOKUP($E9,'Activity 3'!$B$8:$B$14,'Activity 3'!F$8:F$14,\"N/A\",0,1)","v":"N/A"},{"$f":"_xlfn.XLOOKUP($E9,'Activity 3'!$B$8:$B$14,'Activity 3'!G$8:G$14,\"N/A\",0,1)","v":"N/A"},{"$f":"_xlfn.XLOOKUP($E9,'Activity 4'!$B$8:$B$14,'Activity 4'!A15:A21,\"No\",0,1)","v":"No"},{"$f":"_xlfn.XLOOKUP($E9,'Activity 4'!$B$8:$B$14,'Activity 4'!C$8:C$14,\"N/A\",0,1)","v":"N/A"},{"$f":"_xlfn.XLOOKUP($E9,'Activity 4'!$B$8:$B$14,'Activity 4'!D$8:D$14,\"N/A\",0,1)","v":"N/A"},{"$f":"_xlfn.XLOOKUP($E9,'Activity 4'!$B$8:$B$14,'Activity 4'!G$8:G$14,\"N/A\",0,1)","v":"N/A"},{"$f":"_xlfn.XLOOKUP($E9,'Activity 5'!$B$8:$B$14,'Activity 5'!$A$8:$A$14,\"No\",0,1)","v":"No"},{"$f":"_xlfn.XLOOKUP($E9,'Activity 5'!$B$8:$B$14,'Activity 5'!C$8:C$14,\"N/A\",0,1)","v":"N/A"},{"$f":"_xlfn.XLOOKUP($E9,'Activity 5'!$B$8:$B$14,'Activity 5'!D$8:D$14,\"N/A\",0,1)","v":"N/A"},{"$f":"_xlfn.XLOOKUP($E9,'Activity 5'!$B$8:$B$14,'Activity 5'!G$8:G$14,\"N/A\",0,1)","v":"N/A"},{"$f":"_xlfn.XLOOKUP($E9,'Activity 5'!$B$8:$B$14,'Activity 5'!H$8:H$14,\"N/A\",0,1)","v":"N/A"},{"$f":"_xlfn.XLOOKUP($E9,'Activity 5'!$B$8:$B$14,'Activity 5'!I$8:I$14,\"N/A\",0,1)","v":"N/A"},{"$f":"_xlfn.XLOOKUP($E9,'Activity 5'!$B$8:$B$14,'Activity 5'!J$8:J$14,\"N/A\",0,1)","v":"N/A"},{"$f":"_xlfn.XLOOKUP($E9,'Activity 6'!$B$7:$B$13,'Activity 6'!A$7:A$13,\"No\",0,1)","v":"No"},{"$f":"_xlfn.XLOOKUP($E9,'Activity 6'!$B$7:$B$13,'Activity 6'!C$7:C$13,\"N/A\",0,1)","v":"N/A"},{"$f":"_xlfn.XLOOKUP($E9,'Activity 6'!$B$7:$B$13,'Activity 6'!D$7:D$13,\"N/A\",0,1)","v":"N/A"},{"$f":"_xlfn.XLOOKUP($E9,'Activity 6'!$B$7:$B$13,'Activity 6'!E$7:E$13,\"N/A\",0,1)","v":"N/A"},{"$f":"_xlfn.XLOOKUP($E9,'Activity 6'!$B$7:$B$13,'Activity 6'!F$7:F$13,\"N/A\",0,1)","v":"N/A"},{"$f":"_xlfn.XLOOKUP($E9,'Activity 6'!$B$7:$B$13,'Activity 6'!G$7:G$13,\"N/A\",0,1)","v":"N/A"},{"$f":"_xlfn.XLOOKUP($E9,'Activity 6'!$B$7:$B$13,'Activity 6'!H$7:H$13,\"N/A\",0,1)","v":"N/A"},{"$f":"_xlfn.XLOOKUP($E9,'Activity 6'!$B$7:$B$13,'Activity 6'!I$7:I$13,\"N/A\",0,1)","v":"N/A"},{"$f":"_xlfn.XLOOKUP($E9,'Activity 6'!$B$7:$B$13,'Activity 6'!J$7:J$13,\"N/A\",0,1)","v":"N/A"},{"$f":"_xlfn.XLOOKUP($E9,'Activity 6'!$B$7:$B$13,'Activity 6'!K$7:K$13,\"N/A\",0,1)","v":"N/A"},{"$f":"_xlfn.XLOOKUP($E9,'Activity 6'!$B$7:$B$13,'Activity 6'!L$7:L$13,\"N/A\",0,1)","v":"N/A"},{"$f":"_xlfn.XLOOKUP($E9,'Activity 6'!$B$7:$B$13,'Activity 6'!M$7:M$13,\"N/A\",0,1)","v":"N/A"},{"$f":"IF(ISNUMBER(SEARCH(\"6\",H9)),COUNTA('Activity 6'!$D$17:$E$20),\"N/A\")","v":"N/A"},{"$f":"IF(ISNUMBER(SEARCH(6,H9)),SUM('Activity 6'!G24:G27),\"N/A\")","v":"N/A"},{"$f":"_xlfn.XLOOKUP($E9,'Activity 6'!$B$23:$B$29,'Activity 6'!C$23:C$29,\"N/A\",0,1)","v":"N/A"},{"$f":"_xlfn.XLOOKUP($E9,'Activity 6'!$B$23:$B$29,'Activity 6'!D$23:D$29,\"N/A\",0,1)","v":"N/A"},{"$f":"_xlfn.XLOOKUP($E9,'Activity 6'!$B$23:$B$29,'Activity 6'!E$23:E$29,\"N/A\",0,1)","v":"N/A"},{"$f":"_xlfn.XLOOKUP($E9,'Activity 6'!$B$23:$B$29,'Activity 6'!F$23:F$29,\"N/A\",0,1)","v":"N/A"},{"$f":"_xlfn.XLOOKUP($E9,'Activity 6'!$B$23:$B$29,'Activity 6'!G$23:G$29,\"N/A\",0,1)","v":"N/A"},{"$f":"_xlfn.XLOOKUP($E9,'Activity 6'!$B$23:$B$29,'Activity 6'!H$23:H$29,\"N/A\",0,1)","v":"N/A"},{"$f":"_xlfn.XLOOKUP($E9,'Activity 6'!$B$23:$B$29,'Activity 6'!I$23:I$29,\"N/A\",0,1)","v":"N/A"},{"$f":"_xlfn.XLOOKUP($E9,'Activity 6'!$B$23:$B$29,'Activity 6'!J$23:J$29,\"N/A\",0,1)","v":"N/A"},{"$f":"_xlfn.XLOOKUP($E9,'Activity 6'!$B$23:$B$29,'Activity 6'!K$23:K$29,\"N/A\",0,1)","v":"N/A"},{"$f":"_xlfn.XLOOKUP($E9,'Activity 6'!$B$23:$B$29,'Activity 6'!L$23:L$29,\"N/A\",0,1)","v":"N/A"},{"$f":"_xlfn.XLOOKUP($E9,'Activity 6'!$B$23:$B$29,'Activity 6'!M$23:M$29,\"N/A\",0,1)","v":"N/A"},{"$f":"_xlfn.XLOOKUP($E9,'Activity 6'!$B$23:$B$29,'Activity 6'!N$23:N$29,\"N/A\",0,1)","v":"N/A"},{"$f":"_xlfn.XLOOKUP($E9,'Activity 6'!$B$33:$B$38,'Activity 6'!C$33:C$38,\"N/A\",0,1)","v":"N/A"},{"$f":"_xlfn.XLOOKUP($E9,'Activity 6'!$B$33:$B$38,'Activity 6'!D$33:D$38,\"N/A\",0,1)","v":"N/A"},{"$f":"_xlfn.XLOOKUP($E9,'Activity 6'!$B$33:$B$38,'Activity 6'!E$33:E$38,\"N/A\",0,1)","v":"N/A"},{"$f":"_xlfn.XLOOKUP($E9,'Activity 6'!$B$33:$B$38,'Activity 6'!I$33:I$38,\"N/A\",0,1)","v":"N/A"},{"$f":"_xlfn.XLOOKUP($E9,'Activity 6'!$B$33:$B$38,'Activity 6'!G$33:G$38,\"N/A\",0,1)","v":"N/A"},{"$f":"_xlfn.XLOOKUP($E9,'Activity 6'!$B$33:$B$38,'Activity 6'!H$33:H$38,\"N/A\",0,1)","v":"N/A"},{"$f":"_xlfn.XLOOKUP($E9,'Activity 6'!$B$33:$B$38,'Activity 6'!I$33:I$38,\"N/A\",0,1)","v":"N/A"},{"$f":"_xlfn.XLOOKUP($E9,'Activity 6'!$B$33:$B$38,'Activity 6'!J$33:J$38,\"N/A\",0,1)","v":"N/A"},{"$f":"_xlfn.XLOOKUP($E9,'Activity 6'!$B$33:$B$38,'Activity 6'!K$33:K$38,\"N/A\",0,1)","v":"N/A"},{"$f":"_xlfn.XLOOKUP($E9,'Activity 6'!$B$33:$B$38,'Activity 6'!M$33:M$38,\"N/A\",0,1)","v":"N/A"},{"$f":"_xlfn.XLOOKUP($E9,'Activity 7'!$B$7:$B$13,'Activity 7'!$A$7:$A$13,\"No\",0,1)","v":"No"},{"$f":"_xlfn.XLOOKUP($E9,'Activity 7'!$B$7:$B$13,'Activity 7'!C$7:C$13,\"N/A\",0,1)","v":"N/A"},{"$f":"_xlfn.XLOOKUP($E9,'Activity 7'!$B$7:$B$13,'Activity 7'!D$7:D$13,\"N/A\",0,1)","v":"N/A"},{"$f":"_xlfn.XLOOKUP($E9,'Activity 7'!$B$7:$B$13,'Activity 7'!E$7:E$13,\"N/A\",0,1)","v":"N/A"},{"$f":"_xlfn.XLOOKUP($E9,'Activity 7'!$B$7:$B$13,'Activity 7'!F$7:F$13,\"N/A\",0,1)","v":"N/A"},{"$f":"_xlfn.XLOOKUP($E9,'Activity 7'!$B$7:$B$13,'Activity 7'!G$7:G$13,\"N/A\",0,1)","v":"N/A"},{"$f":"_xlfn.XLOOKUP($E9,'Activity 7'!$B$7:$B$13,'Activity 7'!H$7:H$13,\"N/A\",0,1)","v":"N/A"},{"$f":"_xlfn.XLOOKUP($E9,'Activity 7'!$B$7:$B$13,'Activity 7'!I$7:I$13,\"N/A\",0,1)","v":"N/A"},{"$f":"_xlfn.XLOOKUP($E9,'Activity 7'!$B$7:$B$13,'Activity 7'!J$7:J$13,\"N/A\",0,1)","v":"N/A"},{"$f":"_xlfn.XLOOKUP($E9,'Activity 7'!$B$7:$B$13,'Activity 7'!K$7:K$13,\"N/A\",0,1)","v":"N/A"},{"$f":"_xlfn.XLOOKUP($E9,'Activity 7'!$B$7:$B$13,'Activity 7'!L$7:L$13,\"N/A\",0,1)","v":"N/A"},{"$f":"_xlfn.XLOOKUP($E9,'Activity 7'!$B$7:$B$13,'Activity 7'!M$7:M$13,\"N/A\",0,1)","v":"N/A"},{"$f":"_xlfn.XLOOKUP($E9,'Activity 7'!$B$17:$B$23,'Activity 7'!C$17:C$23,\"N/A\",0,1)","v":"N/A"},{"$f":"_xlfn.XLOOKUP($E9,'Activity 7'!$B$17:$B$23,'Activity 7'!D$17:D$23,\"N/A\",0,1)","v":"N/A"},{"$f":"_xlfn.XLOOKUP($E9,'Activity 7'!$B$17:$B$23,'Activity 7'!E$17:E$23,\"N/A\",0,1)","v":"N/A"},{"$f":"_xlfn.XLOOKUP($E9,'Activity 7'!$B$17:$B$23,'Activity 7'!F$17:F$23,\"N/A\",0,1)","v":"N/A"},{"$f":"_xlfn.XLOOKUP($E9,'Activity 7'!$B$17:$B$23,'Activity 7'!G$17:G$23,\"N/A\",0,1)","v":"N/A"},{"$f":"_xlfn.XLOOKUP($E9,'Activity 7'!$B$17:$B$23,'Activity 7'!H$17:H$23,\"N/A\",0,1)","v":"N/A"},{"$f":"_xlfn.XLOOKUP($E9,'Activity 7'!$B$17:$B$23,'Activity 7'!I$17:I$23,\"N/A\",0,1)","v":"N/A"},{"$f":"_xlfn.XLOOKUP($E9,'Activity 7'!$B$17:$B$23,'Activity 7'!J$17:J$23,\"N/A\",0,1)","v":"N/A"},{"$f":"_xlfn.XLOOKUP($E9,'Activity 7'!$B$17:$B$23,'Activity 7'!L$17:L$23,\"N/A\",0,1)","v":"N/A"},{"$f":"_xlfn.XLOOKUP($E9,'Activity 8'!$B$7:$B$13,'Activity 8'!A$7:A$13,\"No\",0,1)","v":"No"},{"$f":"_xlfn.XLOOKUP($E9,'Activity 8'!$B$7:$B$13,'Activity 8'!C$7:C$13,\"N/A\",0,1)","v":"N/A"},{"$f":"_xlfn.XLOOKUP($E9,'Activity 8'!$B$7:$B$13,'Activity 8'!D$7:D$13,\"N/A\",0,1)","v":"N/A"},{"$f":"_xlfn.XLOOKUP($E9,'Activity 8'!$B$7:$B$13,'Activity 8'!E$7:E$13,\"N/A\",0,1)","v":"N/A"},{"$f":"_xlfn.XLOOKUP($E9,'Activity 8'!$B$7:$B$13,'Activity 8'!F$7:F$13,\"N/A\",0,1)","v":"N/A"},{"$f":"_xlfn.XLOOKUP($E9,'Activity 8'!$B$7:$B$13,'Activity 8'!G$7:G$13,\"N/A\",0,1)","v":"N/A"},{"$f":"_xlfn.XLOOKUP($E9,'Activity 8'!$B$7:$B$13,'Activity 8'!H$7:H$13,\"N/A\",0,1)","v":"N/A"},{"$f":"_xlfn.XLOOKUP($E9,'Activity 8'!$B$7:$B$13,'Activity 8'!I$7:I$13,\"N/A\",0,1)","v":"N/A"},{"$f":"_xlfn.XLOOKUP($E9,'Activity 8'!$B$7:$B$13,'Activity 8'!J$7:J$13,\"N/A\",0,1)","v":"N/A"},{"$f":"_xlfn.XLOOKUP($E9,'Activity 8'!$B$7:$B$13,'Activity 8'!K$7:K$13,\"N/A\",0,1)","v":"N/A"},{"$f":"_xlfn.XLOOKUP($E9,'Activity 8'!$B$7:$B$13,'Activity 8'!L$7:L$13,\"N/A\",0,1)","v":"N/A"},{"$f":"_xlfn.XLOOKUP($E9,'Activity 8'!$B$7:$B$13,'Activity 8'!M$7:M$13,\"N/A\",0,1)","v":"N/A"},{"$f":"_xlfn.XLOOKUP($E9,'Activity 8'!$B$7:$B$13,'Activity 8'!N$7:N$13,\"N/A\",0,1)","v":"N/A"},{"$f":"_xlfn.XLOOKUP($E9,'Activity 8'!$B$7:$B$13,'Activity 8'!O$7:O$13,\"N/A\",0,1)","v":"N/A"},{"$f":"_xlfn.XLOOKUP($E9,'Activity 8'!$B$7:$B$13,'Activity 8'!P$7:P$13,\"N/A\",0,1)","v":"N/A"},{"$f":"_xlfn.XLOOKUP($E9,'Activity 8'!$B$17:$B$23,'Activity 8'!C$17:C$23,\"N/A\",0,1)","v":"N/A"},{"$f":"_xlfn.XLOOKUP($E9,'Activity 8'!$B$17:$B$23,'Activity 8'!D$17:D$23,\"N/A\",0,1)","v":"N/A"},{"$f":"_xlfn.XLOOKUP($E9,'Activity 8'!$B$17:$B$23,'Activity 8'!E$17:E$23,\"N/A\",0,1)","v":"N/A"},{"$f":"_xlfn.XLOOKUP($E9,'Activity 8'!$B$17:$B$23,'Activity 8'!F$17:F$23,\"N/A\",0,1)","v":"N/A"},{"$f":"_xlfn.XLOOKUP($E9,'Activity 8'!$B$17:$B$23,'Activity 8'!G$17:G$23,\"N/A\",0,1)","v":"N/A"},{"$f":"_xlfn.XLOOKUP($E9,'Activity 8'!$B$17:$B$23,'Activity 8'!H$17:H$23,\"N/A\",0,1)","v":"N/A"},{"$f":"_xlfn.XLOOKUP($E9,'Activity 8'!$B$17:$B$23,'Activity 8'!I$17:I$23,\"N/A\",0,1)","v":"N/A"},{"$f":"_xlfn.XLOOKUP($E9,'Activity 8'!$B$17:$B$23,'Activity 8'!J$17:J$23,\"N/A\",0,1)","v":"N/A"},{"$f":"_xlfn.XLOOKUP($E9,'Activity 8'!$B$17:$B$23,'Activity 8'!K$17:K$23,\"N/A\",0,1)","v":"N/A"},{"$f":"_xlfn.XLOOKUP($E9,'Activity 8'!$B$17:$B$23,'Activity 8'!L$17:L$23,\"N/A\",0,1)","v":"N/A"},{"$f":"_xlfn.XLOOKUP($E9,'Activity 8'!$B$17:$B$23,'Activity 8'!M$17:M$23,\"N/A\",0,1)","v":"N/A"},{"$f":"_xlfn.XLOOKUP($E9,'Activity 8'!$B$17:$B$23,'Activity 8'!P$17:P$23,\"N/A\",0,1)","v":"N/A"},{"$f":"_xlfn.XLOOKUP(E9,'Activity 9'!B14:B20,'Activity 9'!A14:A20,\"No\",0,1)","v":"No"},{"$f":"_xlfn.XLOOKUP($E9,'Activity 9'!$B$7:$B$13,'Activity 9'!C$7:C$13,\"N/A\",0,1)","v":"N/A"},{"$f":"_xlfn.XLOOKUP($E9,'Activity 9'!$B$7:$B$13,'Activity 9'!D$7:D$13,\"N/A\",0,1)","v":"N/A"},{"$f":"_xlfn.XLOOKUP($E9,'Activity 9'!$B$7:$B$13,'Activity 9'!E$7:E$13,\"N/A\",0,1)","v":"N/A"},{"$f":"_xlfn.XLOOKUP($E9,'Activity 9'!$B$7:$B$13,'Activity 9'!H$7:H$13,\"N/A\",0,1)","v":"N/A"},{"$f":"_xlfn.XLOOKUP($E9,'Activity 9'!$B$7:$B$13,'Activity 9'!I$7:I$13,\"N/A\",0,1)","v":"N/A"},{"$f":"_xlfn.XLOOKUP($E9,'Activity 9'!$B$7:$B$13,'Activity 9'!J$7:J$13,\"N/A\",0,1)","v":"N/A"},{"$f":"_xlfn.XLOOKUP($E9,'Activity 9'!$B$7:$B$13,'Activity 9'!K$7:K$13,\"N/A\",0,1)","v":"N/A"},{"$f":"_xlfn.XLOOKUP($E9,'Activity 9'!$B$7:$B$13,'Activity 9'!L$7:L$13,\"N/A\",0,1)","v":"N/A"},{"$f":"_xlfn.XLOOKUP($E9,'Activity 9'!$B$7:$B$13,'Activity 9'!M$7:M$13,\"N/A\",0,1)","v":"N/A"},{"$f":"_xlfn.XLOOKUP($E9,'Activity 9'!$B$7:$B$13,'Activity 9'!N$7:N$13,\"N/A\",0,1)","v":"N/A"},{"$f":"_xlfn.XLOOKUP($E9,'Activity 9'!$B$7:$B$13,'Activity 9'!O$7:O$13,\"N/A\",0,1)","v":"N/A"},{"$f":"_xlfn.XLOOKUP($E9,'Activity 9'!$B$17:$B$23,'Activity 9'!C$17:C$23,\"N/A\",0,1)","v":"N/A"},{"$f":"_xlfn.XLOOKUP($E9,'Activity 9'!$B$17:$B$23,'Activity 9'!D$17:D$23,\"N/A\",0,1)","v":"N/A"},{"$f":"_xlfn.XLOOKUP($E9,'Activity 9'!$B$17:$B$23,'Activity 9'!E$17:E$23,\"N/A\",0,1)","v":"N/A"},{"$f":"_xlfn.XLOOKUP($E9,'Activity 9'!$B$17:$B$23,'Activity 9'!F$17:F$23,\"N/A\",0,1)","v":"N/A"},{"$f":"_xlfn.XLOOKUP($E9,'Activity 9'!$B$17:$B$23,'Activity 9'!G$17:G$23,\"N/A\",0,1)","v":"N/A"},{"$f":"_xlfn.XLOOKUP($E9,'Activity 9'!$B$17:$B$23,'Activity 9'!H$17:H$23,\"N/A\",0,1)","v":"N/A"},{"$f":"_xlfn.XLOOKUP($E9,'Activity 9'!$B$17:$B$23,'Activity 9'!I$17:I$23,\"N/A\",0,1)","v":"N/A"},{"$f":"_xlfn.XLOOKUP($E9,'Activity 9'!$B$17:$B$23,'Activity 9'!J$17:J$23,\"N/A\",0,1)","v":"N/A"},{"$f":"_xlfn.XLOOKUP($E9,'Activity 9'!$B$17:$B$23,'Activity 9'!L$17:L$23,\"N/A\",0,1)","v":"N/A"},{"$f":"_xlfn.XLOOKUP($E9,'Activity 9'!$B$17:$B$23,'Activity 9'!M$17:M$23,\"N/A\",0,1)","v":"N/A"},{"$f":"_xlfn.XLOOKUP($E9,'Activity 9'!$B$17:$B$23,'Activity 9'!O$17:O$23,\"N/A\",0,1)","v":"N/A"},{"$f":"_xlfn.XLOOKUP($E9,'Activity 10'!B14:B20,'Activity 10'!A14:A20,\"No\",0,1)","v":"No"},{"$f":"_xlfn.XLOOKUP($E9,'Activity 10'!$B$7:$B$13,'Activity 10'!C$7:C$13,\"N/A\",0,1)","v":"N/A"},{"$f":"_xlfn.XLOOKUP($E9,'Activity 10'!$B$7:$B$13,'Activity 10'!D$7:D$13,\"N/A\",0,1)","v":"N/A"},{"$f":"_xlfn.XLOOKUP($E9,'Activity 10'!$B$7:$B$13,'Activity 10'!E$7:E$13,\"N/A\",0,1)","v":"N/A"},{"$f":"_xlfn.XLOOKUP($E9,'Activity 10'!$B$7:$B$13,'Activity 10'!F$7:F$13,\"N/A\",0,1)","v":"N/A"},{"$f":"_xlfn.XLOOKUP($E9,'Activity 10'!$B$7:$B$13,'Activity 10'!G$7:G$13,\"N/A\",0,1)","v":"N/A"},{"$f":"_xlfn.XLOOKUP($E9,'Activity 10'!$B$7:$B$13,'Activity 10'!H$7:H$13,\"N/A\",0,1)","v":"N/A"},{"$f":"_xlfn.XLOOKUP($E9,'Activity 10'!$B$7:$B$13,'Activity 10'!I$7:I$13,\"N/A\",0,1)","v":"N/A"},{"$f":"_xlfn.XLOOKUP($E9,'Activity 10'!$B$7:$B$13,'Activity 10'!J$7:J$13,\"N/A\",0,1)","v":"N/A"},{"$f":"_xlfn.XLOOKUP($E9,'Activity 10'!$B$7:$B$13,'Activity 10'!K$7:K$13,\"N/A\",0,1)","v":"N/A"},{"$f":"_xlfn.XLOOKUP($E9,'Activity 10'!$B$7:$B$13,'Activity 10'!L$7:L$13,\"N/A\",0,1)","v":"N/A"},{"$f":"_xlfn.XLOOKUP($E9,'Activity 10'!$B$7:$B$13,'Activity 10'!M$7:M$13,\"N/A\",0,1)","v":"N/A"},{"$f":"_xlfn.XLOOKUP($E9,'Activity 10'!$B$7:$B$13,'Activity 10'!N$7:N$13,\"N/A\",0,1)","v":"N/A"},{"$f":"_xlfn.XLOOKUP($E9,'Activity 10'!$B$7:$B$13,'Activity 10'!O$7:O$13,\"N/A\",0,1)","v":"N/A"},{"$f":"_xlfn.XLOOKUP($E9,'Activity 10'!$B$17:$B$23,'Activity 10'!C$17:C$23,\"N/A\",0,1)","v":"N/A"},{"$f":"_xlfn.XLOOKUP($E9,'Activity 10'!$B$17:$B$23,'Activity 10'!D$17:D$23,\"N/A\",0,1)","v":"N/A"},{"$f":"_xlfn.XLOOKUP($E9,'Activity 10'!$B$17:$B$23,'Activity 10'!E$17:E$23,\"N/A\",0,1)","v":"N/A"},{"$f":"_xlfn.XLOOKUP($E9,'Activity 10'!$B$17:$B$23,'Activity 10'!F$17:F$23,\"N/A\",0,1)","v":"N/A"},{"$f":"_xlfn.XLOOKUP($E9,'Activity 10'!$B$17:$B$23,'Activity 10'!G$17:G$23,\"N/A\",0,1)","v":"N/A"},{"$f":"_xlfn.XLOOKUP($E9,'Activity 10'!$B$17:$B$23,'Activity 10'!H$17:H$23,\"N/A\",0,1)","v":"N/A"},{"$f":"_xlfn.XLOOKUP($E9,'Activity 10'!$B$17:$B$23,'Activity 10'!I$17:I$23,\"N/A\",0,1)","v":"N/A"},{"$f":"_xlfn.XLOOKUP($E9,'Activity 10'!$B$17:$B$23,'Activity 10'!J$17:J$23,\"N/A\",0,1)","v":"N/A"},{"$f":"_xlfn.XLOOKUP($E9,'Activity 10'!$B$17:$B$23,'Activity 10'!K$17:K$23,\"N/A\",0,1)","v":"N/A"},{"$f":"_xlfn.XLOOKUP($E9,'Activity 10'!$B$17:$B$23,'Activity 10'!L$17:L$23,\"N/A\",0,1)","v":"N/A"},{"$f":"_xlfn.XLOOKUP($E9,'Activity 10'!$B$17:$B$23,'Activity 10'!N$17:N$23,\"N/A\",0,1)","v":"N/A"},{"$f":"_xlfn.XLOOKUP($E9,'Competitive Activity 1'!B14:B20,'Competitive Activity 1'!A14:A20,\"No\",0,1)","v":"No"},{"$f":"_xlfn.XLOOKUP($E9,'Competitive Activity 1'!$B$7:$B$13,'Competitive Activity 1'!C$7:C$13,\"N/A\",0,1)","v":"N/A"},{"$f":"_xlfn.XLOOKUP($E9,'Competitive Activity 1'!$B$7:$B$13,'Competitive Activity 1'!D$7:D$13,\"N/A\",0,1)","v":"N/A"},{"$f":"_xlfn.XLOOKUP($E9,'Competitive Activity 1'!$B$7:$B$13,'Competitive Activity 1'!E$7:E$13,\"N/A\",0,1)","v":"N/A"},{"$f":"_xlfn.XLOOKUP($E9,'Competitive Activity 1'!$B$7:$B$13,'Competitive Activity 1'!F$7:F$13,\"N/A\",0,1)","v":"N/A"},{"$f":"_xlfn.XLOOKUP($E9,'Competitive Activity 1'!$B$7:$B$13,'Competitive Activity 1'!G$7:G$13,\"N/A\",0,1)","v":"N/A"},{"$f":"_xlfn.XLOOKUP($E9,'Competitive Activity 1'!$B$7:$B$13,'Competitive Activity 1'!H$7:H$13,\"N/A\",0,1)","v":"N/A"},{"$f":"_xlfn.XLOOKUP($E9,'Competitive Activity 1'!$B$7:$B$13,'Competitive Activity 1'!I$7:I$13,\"N/A\",0,1)","v":"N/A"},{"$f":"_xlfn.XLOOKUP($E9,'Competitive Activity 1'!$B$7:$B$13,'Competitive Activity 1'!J$7:J$13,\"N/A\",0,1)","v":"N/A"},{"$f":"_xlfn.XLOOKUP($E9,'Competitive Activity 1'!$B$7:$B$13,'Competitive Activity 1'!K$7:K$13,\"N/A\",0,1)","v":"N/A"},{"$f":"_xlfn.XLOOKUP($E9,'Competitive Activity 1'!$B$7:$B$13,'Competitive Activity 1'!L$7:L$13,\"N/A\",0,1)","v":"N/A"},{"$f":"_xlfn.XLOOKUP($E9,'Competitive Activity 1'!$B$7:$B$13,'Competitive Activity 1'!M$7:M$13,\"N/A\",0,1)","v":"N/A"},{"$f":"_xlfn.XLOOKUP($E9,'Competitive Activity 1'!$B$7:$B$13,'Competitive Activity 1'!N$7:N$13,\"N/A\",0,1)","v":"N/A"},{"$f":"_xlfn.XLOOKUP($E9,'Competitive Activity 1'!$B$7:$B$13,'Competitive Activity 1'!O$7:O$13,\"N/A\",0,1)","v":"N/A"},{"$f":"_xlfn.XLOOKUP($E9,'Competitive Activity 1'!$B$7:$B$13,'Competitive Activity 1'!P$7:P$13,\"N/A\",0,1)","v":"N/A"},{"$f":"_xlfn.XLOOKUP($E9,'Competitive Activity 1'!$B$17:$B$23,'Competitive Activity 1'!C$17:C$23,\"N/A\",0,1)","v":"N/A"},{"$f":"_xlfn.XLOOKUP($E9,'Competitive Activity 1'!$B$17:$B$23,'Competitive Activity 1'!D$17:D$23,\"N/A\",0,1)","v":"N/A"},{"$f":"_xlfn.XLOOKUP($E9,'Competitive Activity 1'!$B$17:$B$23,'Competitive Activity 1'!E$17:E$23,\"N/A\",0,1)","v":"N/A"},{"$f":"_xlfn.XLOOKUP($E9,'Competitive Activity 1'!$B$17:$B$23,'Competitive Activity 1'!F$17:F$23,\"N/A\",0,1)","v":"N/A"},{"$f":"_xlfn.XLOOKUP($E9,'Competitive Activity 1'!$B$17:$B$23,'Competitive Activity 1'!G$17:G$23,\"N/A\",0,1)","v":"N/A"},{"$f":"_xlfn.XLOOKUP($E9,'Competitive Activity 1'!$B$17:$B$23,'Competitive Activity 1'!H$17:H$23,\"N/A\",0,1)","v":"N/A"},{"$f":"_xlfn.XLOOKUP($E9,'Competitive Activity 1'!$B$17:$B$23,'Competitive Activity 1'!I$17:I$23,\"N/A\",0,1)","v":"N/A"},{"$f":"_xlfn.XLOOKUP($E9,'Competitive Activity 1'!$B$17:$B$23,'Competitive Activity 1'!J$17:J$23,\"N/A\",0,1)","v":"N/A"},{"$f":"_xlfn.XLOOKUP($E9,'Competitive Activity 1'!$B$17:$B$23,'Competitive Activity 1'!K$17:K$23,\"N/A\",0,1)","v":"N/A"},{"$f":"_xlfn.XLOOKUP($E9,'Competitive Activity 1'!$B$17:$B$23,'Competitive Activity 1'!M$17:M$23,\"N/A\",0,1)","v":"N/A"},{"$f":"_xlfn.XLOOKUP($E9,'Competitive Activity 1'!$B$17:$B$23,'Competitive Activity 1'!N$17:N$23,\"N/A\",0,1)","v":"N/A"},{"$f":"_xlfn.XLOOKUP($E9,'Competitive Activity 1'!$B$17:$B$23,'Competitive Activity 1'!P$17:P$23,\"N/A\",0,1)","v":"N/A"},{"$f":"_xlfn.XLOOKUP($E9,'Competitive Activity 2'!$B$7:$B$13,'Competitive Activity 2'!$A$7:$A$13,\"No\",0,1)","v":"No"},{"$f":"_xlfn.XLOOKUP($E9,'Competitive Activity 2'!$B$7:$B$13,'Competitive Activity 2'!C$7:C$13,\"N/A\",0,1)","v":"N/A"},{"$f":"_xlfn.XLOOKUP($E9,'Competitive Activity 2'!$B$7:$B$13,'Competitive Activity 2'!D$7:D$13,\"N/A\",0,1)","v":"N/A"},{"$f":"_xlfn.XLOOKUP($E9,'Competitive Activity 2'!$B$7:$B$13,'Competitive Activity 2'!E$7:E$13,\"N/A\",0,1)","v":"N/A"},{"$f":"_xlfn.XLOOKUP($E9,'Competitive Activity 2'!$B$7:$B$13,'Competitive Activity 2'!F$7:F$13,\"N/A\",0,1)","v":"N/A"},{"$f":"_xlfn.XLOOKUP($E9,'Competitive Activity 2'!$B$7:$B$13,'Competitive Activity 2'!G$7:G$13,\"N/A\",0,1)","v":"N/A"},{"$f":"_xlfn.XLOOKUP($E9,'Competitive Activity 2'!$B$7:$B$13,'Competitive Activity 2'!H$7:H$13,\"N/A\",0,1)","v":"N/A"},{"$f":"_xlfn.XLOOKUP($E9,'Competitive Activity 2'!$B$7:$B$13,'Competitive Activity 2'!I$7:I$13,\"N/A\",0,1)","v":"N/A"},{"$f":"_xlfn.XLOOKUP($E9,'Competitive Activity 2'!$B$7:$B$13,'Competitive Activity 2'!J$7:J$13,\"N/A\",0,1)","v":"N/A"},{"$f":"_xlfn.XLOOKUP($E9,'Competitive Activity 2'!$B$7:$B$13,'Competitive Activity 2'!K$7:K$13,\"N/A\",0,1)","v":"N/A"},{"$f":"_xlfn.XLOOKUP($E9,'Competitive Activity 2'!$B$7:$B$13,'Competitive Activity 2'!L$7:L$13,\"N/A\",0,1)","v":"N/A"},{"$f":"_xlfn.XLOOKUP($E9,'Competitive Activity 2'!$B$17:$B$23,'Competitive Activity 2'!C$17:C$23,\"N/A\",0,1)","v":"N/A"},{"$f":"_xlfn.XLOOKUP($E9,'Competitive Activity 2'!$B$17:$B$23,'Competitive Activity 2'!D$17:D$23,\"N/A\",0,1)","v":"N/A"},{"$f":"_xlfn.XLOOKUP($E9,'Competitive Activity 2'!$B$17:$B$23,'Competitive Activity 2'!E$17:E$23,\"N/A\",0,1)","v":"N/A"},{"$f":"_xlfn.XLOOKUP($E9,'Competitive Activity 2'!$B$17:$B$23,'Competitive Activity 2'!F$17:F$23,\"N/A\",0,1)","v":"N/A"},{"$f":"_xlfn.XLOOKUP($E9,'Competitive Activity 2'!$B$17:$B$23,'Competitive Activity 2'!G$17:G$23,\"N/A\",0,1)","v":"N/A"},{"$f":"_xlfn.XLOOKUP($E9,'Competitive Activity 2'!$B$17:$B$23,'Competitive Activity 2'!H$17:H$23,\"N/A\",0,1)","v":"N/A"},{"$f":"_xlfn.XLOOKUP($E9,'Competitive Activity 2'!$B$17:$B$23,'Competitive Activity 2'!I$17:I$23,\"N/A\",0,1)","v":"N/A"},{"$f":"_xlfn.XLOOKUP($E9,'Competitive Activity 2'!$B$17:$B$23,'Competitive Activity 2'!J$17:J$23,\"N/A\",0,1)","v":"N/A"},{"$f":"_xlfn.XLOOKUP($E9,'Competitive Activity 2'!$B$17:$B$23,'Competitive Activity 2'!K$17:K$23,\"N/A\",0,1)","v":"N/A"},{"$f":"_xlfn.XLOOKUP($E9,'Competitive Activity 2'!$B$17:$B$23,'Competitive Activity 2'!L$17:L$23,\"N/A\",0,1)","v":"N/A"},{"$f":"_xlfn.XLOOKUP($E9,'Competitive Activity 2'!$B$17:$B$23,'Competitive Activity 2'!M$17:M$23,\"N/A\",0,1)","v":"N/A"},{"$f":"_xlfn.XLOOKUP($E9,'Competitive Activity 2'!$B$27:$B$33,'Competitive Activity 2'!C$27:C$33,\"N/A\",0,1)","v":"N/A"},{"$f":"_xlfn.XLOOKUP($E9,'Competitive Activity 2'!$B$27:$B$33,'Competitive Activity 2'!D$27:D$33,\"N/A\",0,1)","v":"N/A"},{"$f":"_xlfn.XLOOKUP($E9,'Competitive Activity 2'!$B$27:$B$33,'Competitive Activity 2'!E$27:E$33,\"N/A\",0,1)","v":"N/A"},{"$f":"_xlfn.XLOOKUP($E9,'Competitive Activity 2'!$B$27:$B$33,'Competitive Activity 2'!F$27:F$33,\"N/A\",0,1)","v":"N/A"},{"$f":"_xlfn.XLOOKUP($E9,'Competitive Activity 2'!$B$27:$B$33,'Competitive Activity 2'!G$27:G$33,\"N/A\",0,1)","v":"N/A"},{"$f":"_xlfn.XLOOKUP($E9,'Competitive Activity 2'!$B$27:$B$33,'Competitive Activity 2'!H$27:H$33,\"N/A\",0,1)","v":"N/A"},{"$f":"_xlfn.XLOOKUP($E9,'Competitive Activity 2'!$B$27:$B$33,'Competitive Activity 2'!I$27:I$33,\"N/A\",0,1)","v":"N/A"},{"$f":"_xlfn.XLOOKUP($E9,'Competitive Activity 2'!$B$27:$B$33,'Competitive Activity 2'!J$27:J$33,\"N/A\",0,1)","v":"N/A"},{"$f":"_xlfn.XLOOKUP($E9,'Competitive Activity 2'!$B$27:$B$33,'Competitive Activity 2'!L$27:L$33,\"N/A\",0,1)","v":"N/A"}]
[null,null,null,null,{"$f":"'3-Financial Summary'!A20","v":0},{"$f":"'3-Financial Summary'!B20","v":0},{"$f":"'3-Financial Summary'!C20","v":0},{"$f":"'3-Financial Summary'!D20","v":0},{"$f":"'3-Financial Summary'!E20","v":0},{"$f":"VLOOKUP(E10,'Summary Sheet'!$A$23:$L$34,11,FALSE)","v":"N/A"},{"$f":"VLOOKUP(E10,'Summary Sheet'!$A$23:$L$34,12,FALSE)","v":"N/A"},{"$f":"'3-Financial Summary'!F20","v":0},{"$f":"'3-Financial Summary'!G20","v":"00:00:00"},{"$f":"'3-Financial Summary'!H20","v":0},{"$f":"_xlfn.XLOOKUP($E10,'Activity 1'!$B$7:$B$13,'Activity 1'!$A$7:$A$13,\"No\",0,1)","v":"No"},{"$f":"_xlfn.XLOOKUP($E10,'Activity 1'!$B$7:$B$13,'Activity 1'!C15:C21,\"N/A\",0,1)","v":"N/A"},{"$f":"_xlfn.XLOOKUP($E10,'Activity 1'!$B$7:$B$13,'Activity 1'!D15:D21,\"N/A\",0,1)","v":"N/A"},{"$f":"_xlfn.XLOOKUP($E10,'Activity 1'!$B$7:$B$13,'Activity 1'!E$7:E$13,\"N/A\",0,1)","v":"N/A"},{"$f":"_xlfn.XLOOKUP($E10,'Activity 1'!$B$7:$B$13,'Activity 1'!F$7:F$13,\"N/A\",0,1)","v":"N/A"},{"$f":"_xlfn.XLOOKUP($E10,'Activity 1'!$B$7:$B$13,'Activity 1'!G$7:G$13,\"N/A\",0,1)","v":"N/A"},{"$f":"_xlfn.XLOOKUP($E10,'Activity 1'!$B$7:$B$13,'Activity 1'!H$7:H$13,\"N/A\",0,1)","v":"N/A"},{"$f":"_xlfn.XLOOKUP($E10,'Activity 1'!$B$7:$B$13,'Activity 1'!I$7:I$13,\"N/A\",0,1)","v":"N/A"},{"$f":"_xlfn.XLOOKUP($E10,'Activity 1'!$B$7:$B$13,'Activity 1'!J$7:J$13,\"N/A\",0,1)","v":"N/A"},{"$f":"_xlfn.XLOOKUP($E10,'Activity 1'!$B$7:$B$13,'Activity 1'!K$7:K$13,\"N/A\",0,1)","v":"N/A"},{"$f":"_xlfn.XLOOKUP($E10,'Activity 1'!$B$7:$B$13,'Activity 1'!L$7:L$13,\"N/A\",0,1)","v":"N/A"},{"$f":"_xlfn.XLOOKUP($E10,'Activity 1'!$B$7:$B$13,'Activity 1'!M$7:M$13,\"N/A\",0,1)","v":"N/A"},{"$f":"_xlfn.XLOOKUP($E10,'Activity 1'!$B$7:$B$13,'Activity 1'!N$7:N$13,\"N/A\",0,1)","v":"N/A"},{"$f":"_xlfn.XLOOKUP($E10,'Activity 1'!$B$7:$B$13,'Activity 1'!O$7:O$13,\"N/A\",0,1)","v":"N/A"},{"$f":"_xlfn.XLOOKUP($E10,'Activity 1'!$B$7:$B$13,'Activity 1'!P$7:P$13,\"N/A\",0,1)","v":"N/A"},{"$f":"_xlfn.XLOOKUP($E10,'Activity 1'!$B$7:$B$13,'Activity 1'!Q$7:Q$13,\"N/A\",0,1)","v":"N/A"},{"$f":"_xlfn.XLOOKUP($E10,'Activity 1'!$B$17:$B$23,'Activity 1'!C$17:C$23,\"N/A\",0,1)","v":"N/A"},{"$f":"_xlfn.XLOOKUP($E10,'Activity 1'!$B$17:$B$23,'Activity 1'!D$17:D$23,\"N/A\",0,1)","v":"N/A"},{"$f":"_xlfn.XLOOKUP($E10,'Activity 1'!$B$17:$B$23,'Activity 1'!E$17:E$23,\"N/A\",0,1)","v":"N/A"},{"$f":"_xlfn.XLOOKUP($E10,'Activity 1'!$B$17:$B$23,'Activity 1'!F$17:F$23,\"N/A\",0,1)","v":"N/A"},{"$f":"_xlfn.XLOOKUP($E10,'Activity 1'!$B$17:$B$23,'Activity 1'!G$17:G$23,\"N/A\",0,1)","v":"N/A"},{"$f":"_xlfn.XLOOKUP($E10,'Activity 1'!$B$17:$B$23,'Activity 1'!H$17:H$23,\"N/A\",0,1)","v":"N/A"},{"$f":"_xlfn.XLOOKUP($E10,'Activity 1'!$B$17:$B$23,'Activity 1'!I$17:I$23,\"N/A\",0,1)","v":"N/A"},{"$f":"_xlfn.XLOOKUP($E10,'Activity 1'!$B$17:$B$23,'Activity 1'!J$17:J$23,\"N/A\",0,1)","v":"N/A"},{"$f":"_xlfn.XLOOKUP($E10,'Activity 1'!$B$17:$B$23,'Activity 1'!K$17:K$23,\"N/A\",0,1)","v":"N/A"},{"$f":"_xlfn.XLOOKUP($E10,'Activity 1'!$B$17:$B$23,'Activity 1'!L$17:L$23,\"N/A\",0,1)","v":"N/A"},{"$f":"_xlfn.XLOOKUP($E10,'Activity 1'!$B$17:$B$23,'Activity 1'!M$17:M$23,\"N/A\",0,1)","v":"N/A"},{"$f":"_xlfn.XLOOKUP($E10,'Activity 1'!$B$17:$B$23,'Activity 1'!O$17:O$23,\"N/A\",0,1)","v":"N/A"},{"$f":"_xlfn.XLOOKUP($E10,'Activity 1'!$B$17:$B$23,'Activity 1'!Q$17:Q$23,\"N/A\",0,1)","v":"N/A"},{"$f":"_xlfn.XLOOKUP($E10,'Activity 2'!$B$7:$B$13,'Activity 2'!A$7:A$13,\"No\",0)","v":"No"},{"$f":"_xlfn.XLOOKUP($E10,'Activity 2'!$B$7:$B$13,'Activity 2'!C$7:C$13,\"N/A\",0,1)","v":"N/A"},{"$f":"_xlfn.XLOOKUP($E10,'Activity 2'!$B$7:$B$13,'Activity 2'!D$7:D$13,\"N/A\",0,1)","v":"N/A"},{"$f":"_xlfn.XLOOKUP($E10,'Activity 2'!$B$7:$B$13,'Activity 2'!E$7:E$13,\"N/A\",0,1)","v":"N/A"},{"$f":"_xlfn.XLOOKUP($E10,'Activity 2'!$B$7:$B$13,'Activity 2'!F$7:F$13,\"N/A\",0,1)","v":"N/A"},{"$f":"_xlfn.XLOOKUP($E10,'Activity 2'!$B$7:$B$13,'Activity 2'!G$7:G$13,\"N/A\",0,1)","v":"N/A"},{"$f":"_xlfn.XLOOKUP($E10,'Activity 2'!$B$7:$B$13,'Activity 2'!H$7:H$13,\"N/A\",0,1)","v":"N/A"},{"$f":"_xlfn.XLOOKUP($E10,'Activity 2'!$B$7:$B$13,'Activity 2'!I$7:I$13,\"N/A\",0,1)","v":"N/A"},{"$f":"_xlfn.XLOOKUP($E10,'Activity 2'!$B$7:$B$13,'Activity 2'!J$7:J$13,\"N/A\",0,1)","v":"N/A"},{"$f":"_xlfn.XLOOKUP($E10,'Activity 2'!$B$7:$B$13,'Activity 2'!K$7:K$13,\"N/A\",0,1)","v":"N/A"},{"$f":"_xlfn.XLOOKUP($E10,'Activity 2'!$B$7:$B$13,'Activity 2'!L$7:L$13,\"N/A\",0,1)","v":"N/A"},{"$f":"_xlfn.XLOOKUP($E10,'Activity 2'!$B$7:$B$13,'Activity 2'!M$7:M$13,\"N/A\",0,1)","v":"N/A"},{"$f":"_xlfn.XLOOKUP($E10,'Activity 2'!$B$7:$B$13,'Activity 2'!N$7:N$13,\"N/A\",0,1)","v":"N/A"},{"$f":"_xlfn.XLOOKUP($E10,'Activity 2'!$B$7:$B$13,'Activity 2'!O$7:O$13,\"N/A\",0,1)","v":"N/A"},{"$f":"_xlfn.XLOOKUP($E10,'Activity 2'!$B$7:$B$13,'Activity 2'!P$7:P$13,\"N/A\",0,1)","v":"N/A"},{"$f":"_xlfn.XLOOKUP($E10,'Activity 2'!$B$7:$B$13,'Activity 2'!Q$7:Q$13,\"N/A\",0,1)","v":"N/A"},{"$f":"_xlfn.XLOOKUP($E10,'Activity 2'!$B$17:$B$23,'Activity 2'!C$17:C$23,\"N/A\",0,1)","v":"N/A"},{"$f":"_xlfn.XLOOKUP($E10,'Activity 2'!$B$17:$B$23,'Activity 2'!D$17:D$23,\"N/A\",0,1)","v":"N/A"},{"$f":"_xlfn.XLOOKUP($E10,'Activity 2'!$B$17:$B$23,'Activity 2'!E$17:E$23,\"N/A\",0,1)","v":"N/A"},{"$f":"_xlfn.XLOOKUP($E10,'Activity 2'!$B$17:$B$23,'Activity 2'!F$17:F$23,\"N/A\",0,1)","v":"N/A"},{"$f":"_xlfn.XLOOKUP($E10,'Activity 2'!$B$17:$B$23,'Activity 2'!G$17:G$23,\"N/A\",0,1)","v":"N/A"},{"$f":"_xlfn.XLOOKUP($E10,'Activity 2'!$B$17:$B$23,'Activity 2'!H$17:H$23,\"N/A\",0,1)","v":"N/A"},{"$f":"_xlfn.XLOOKUP($E10,'Activity 2'!$B$17:$B$23,'Activity 2'!I$17:I$23,\"N/A\",0,1)","v":"N/A"},{"$f":"_xlfn.XLOOKUP($E10,'Activity 2'!$B$17:$B$23,'Activity 2'!J$17:J$23,\"N/A\",0,1)","v":"N/A"},{"$f":"_xlfn.XLOOKUP($E10,'Activity 2'!$B$17:$B$23,'Activity 2'!K$17:K$23,\"N/A\",0,1)","v":"N/A"},{"$f":"_xlfn.XLOOKUP($E10,'Activity 2'!$B$17:$B$23,'Activity 2'!L$17:L$23,\"N/A\",0,1)","v":"N/A"},{"$f":"_xlfn.XLOOKUP($E10,'Activity 2'!$B$17:$B$23,'Activity 2'!M$17:M$23,\"N/A\",0,1)","v":"N/A"},{"$f":"_xlfn.XLOOKUP($E10,'Activity 2'!$B$17:$B$23,'Activity 2'!O$17:O$23,\"N/A\",0,1)","v":"N/A"},{"$f":"_xlfn.XLOOKUP($E10,'Activity 2'!$B$17:$B$23,'Activity 2'!Q$17:Q$23,\"N/A\",0,1)","v":"N/A"},{"$f":"_xlfn.XLOOKUP($E10,'Activity 3'!$B$8:$B$14,'Activity 3'!A$8:A$14,\"No\",0,1)","v":"No"},{"$f":"_xlfn.XLOOKUP($E10,'Activity 3'!$B$8:$B$14,'Activity 3'!C$8:C$14,\"N/A\",0,1)","v":"N/A"},{"$f":"_xlfn.XLOOKUP($E10,'Activity 3'!$B$8:$B$14,'Activity 3'!D$8:D$14,\"N/A\",0,1)","v":"N/A"},{"$f":"_xlfn.XLOOKUP($E10,'Activity 3'!$B$8:$B$14,'Activity 3'!E$8:E$14,\"N/A\",0,1)","v":"N/A"},{"$f":"_xlfn.XLOOKUP($E10,'Activity 3'!$B$8:$B$14,'Activity 3'!F$8:F$14,\"N/A\",0,1)","v":"N/A"},{"$f":"_xlfn.XLOOKUP($E10,'Activity 3'!$B$8:$B$14,'Activity 3'!G$8:G$14,\"N/A\",0,1)","v":"N/A"},{"$f":"_xlfn.XLOOKUP($E10,'Activity 4'!$B$8:$B$14,'Activity 4'!A16:A22,\"No\",0,1)","v":"No"},{"$f":"_xlfn.XLOOKUP($E10,'Activity 4'!$B$8:$B$14,'Activity 4'!C$8:C$14,\"N/A\",0,1)","v":"N/A"},{"$f":"_xlfn.XLOOKUP($E10,'Activity 4'!$B$8:$B$14,'Activity 4'!D$8:D$14,\"N/A\",0,1)","v":"N/A"},{"$f":"_xlfn.XLOOKUP($E10,'Activity 4'!$B$8:$B$14,'Activity 4'!G$8:G$14,\"N/A\",0,1)","v":"N/A"},{"$f":"_xlfn.XLOOKUP($E10,'Activity 5'!$B$8:$B$14,'Activity 5'!$A$8:$A$14,\"No\",0,1)","v":"No"},{"$f":"_xlfn.XLOOKUP($E10,'Activity 5'!$B$8:$B$14,'Activity 5'!C$8:C$14,\"N/A\",0,1)","v":"N/A"},{"$f":"_xlfn.XLOOKUP($E10,'Activity 5'!$B$8:$B$14,'Activity 5'!D$8:D$14,\"N/A\",0,1)","v":"N/A"},{"$f":"_xlfn.XLOOKUP($E10,'Activity 5'!$B$8:$B$14,'Activity 5'!G$8:G$14,\"N/A\",0,1)","v":"N/A"},{"$f":"_xlfn.XLOOKUP($E10,'Activity 5'!$B$8:$B$14,'Activity 5'!H$8:H$14,\"N/A\",0,1)","v":"N/A"},{"$f":"_xlfn.XLOOKUP($E10,'Activity 5'!$B$8:$B$14,'Activity 5'!I$8:I$14,\"N/A\",0,1)","v":"N/A"},{"$f":"_xlfn.XLOOKUP($E10,'Activity 5'!$B$8:$B$14,'Activity 5'!J$8:J$14,\"N/A\",0,1)","v":"N/A"},{"$f":"_xlfn.XLOOKUP($E10,'Activity 6'!$B$7:$B$13,'Activity 6'!A$7:A$13,\"No\",0,1)","v":"No"},{"$f":"_xlfn.XLOOKUP($E10,'Activity 6'!$B$7:$B$13,'Activity 6'!C$7:C$13,\"N/A\",0,1)","v":"N/A"},{"$f":"_xlfn.XLOOKUP($E10,'Activity 6'!$B$7:$B$13,'Activity 6'!D$7:D$13,\"N/A\",0,1)","v":"N/A"},{"$f":"_xlfn.XLOOKUP($E10,'Activity 6'!$B$7:$B$13,'Activity 6'!E$7:E$13,\"N/A\",0,1)","v":"N/A"},{"$f":"_xlfn.XLOOKUP($E10,'Activity 6'!$B$7:$B$13,'Activity 6'!F$7:F$13,\"N/A\",0,1)","v":"N/A"},{"$f":"_xlfn.XLOOKUP($E10,'Activity 6'!$B$7:$B$13,'Activity 6'!G$7:G$13,\"N/A\",0,1)","v":"N/A"},{"$f":"_xlfn.XLOOKUP($E10,'Activity 6'!$B$7:$B$13,'Activity 6'!H$7:H$13,\"N/A\",0,1)","v":"N/A"},{"$f":"_xlfn.XLOOKUP($E10,'Activity 6'!$B$7:$B$13,'Activity 6'!I$7:I$13,\"N/A\",0,1)","v":"N/A"},{"$f":"_xlfn.XLOOKUP($E10,'Activity 6'!$B$7:$B$13,'Activity 6'!J$7:J$13,\"N/A\",0,1)","v":"N/A"},{"$f":"_xlfn.XLOOKUP($E10,'Activity 6'!$B$7:$B$13,'Activity 6'!K$7:K$13,\"N/A\",0,1)","v":"N/A"},{"$f":"_xlfn.XLOOKUP($E10,'Activity 6'!$B$7:$B$13,'Activity 6'!L$7:L$13,\"N/A\",0,1)","v":"N/A"},{"$f":"_xlfn.XLOOKUP($E10,'Activity 6'!$B$7:$B$13,'Activity 6'!M$7:M$13,\"N/A\",0,1)","v":"N/A"},{"$f":"IF(ISNUMBER(SEARCH(\"6\",H10)),COUNTA('Activity 6'!$D$17:$E$20),\"N/A\")","v":"N/A"},{"$f":"IF(ISNUMBER(SEARCH(6,H10)),SUM('Activity 6'!G25:G28),\"N/A\")","v":"N/A"},{"$f":"_xlfn.XLOOKUP($E10,'Activity 6'!$B$23:$B$29,'Activity 6'!C$23:C$29,\"N/A\",0,1)","v":"N/A"},{"$f":"_xlfn.XLOOKUP($E10,'Activity 6'!$B$23:$B$29,'Activity 6'!D$23:D$29,\"N/A\",0,1)","v":"N/A"},{"$f":"_xlfn.XLOOKUP($E10,'Activity 6'!$B$23:$B$29,'Activity 6'!E$23:E$29,\"N/A\",0,1)","v":"N/A"},{"$f":"_xlfn.XLOOKUP($E10,'Activity 6'!$B$23:$B$29,'Activity 6'!F$23:F$29,\"N/A\",0,1)","v":"N/A"},{"$f":"_xlfn.XLOOKUP($E10,'Activity 6'!$B$23:$B$29,'Activity 6'!G$23:G$29,\"N/A\",0,1)","v":"N/A"},{"$f":"_xlfn.XLOOKUP($E10,'Activity 6'!$B$23:$B$29,'Activity 6'!H$23:H$29,\"N/A\",0,1)","v":"N/A"},{"$f":"_xlfn.XLOOKUP($E10,'Activity 6'!$B$23:$B$29,'Activity 6'!I$23:I$29,\"N/A\",0,1)","v":"N/A"},{"$f":"_xlfn.XLOOKUP($E10,'Activity 6'!$B$23:$B$29,'Activity 6'!J$23:J$29,\"N/A\",0,1)","v":"N/A"},{"$f":"_xlfn.XLOOKUP($E10,'Activity 6'!$B$23:$B$29,'Activity 6'!K$23:K$29,\"N/A\",0,1)","v":"N/A"},{"$f":"_xlfn.XLOOKUP($E10,'Activity 6'!$B$23:$B$29,'Activity 6'!L$23:L$29,\"N/A\",0,1)","v":"N/A"},{"$f":"_xlfn.XLOOKUP($E10,'Activity 6'!$B$23:$B$29,'Activity 6'!M$23:M$29,\"N/A\",0,1)","v":"N/A"},{"$f":"_xlfn.XLOOKUP($E10,'Activity 6'!$B$23:$B$29,'Activity 6'!N$23:N$29,\"N/A\",0,1)","v":"N/A"},{"$f":"_xlfn.XLOOKUP($E10,'Activity 6'!$B$33:$B$38,'Activity 6'!C$33:C$38,\"N/A\",0,1)","v":"N/A"},{"$f":"_xlfn.XLOOKUP($E10,'Activity 6'!$B$33:$B$38,'Activity 6'!D$33:D$38,\"N/A\",0,1)","v":"N/A"},{"$f":"_xlfn.XLOOKUP($E10,'Activity 6'!$B$33:$B$38,'Activity 6'!E$33:E$38,\"N/A\",0,1)","v":"N/A"},{"$f":"_xlfn.XLOOKUP($E10,'Activity 6'!$B$33:$B$38,'Activity 6'!I$33:I$38,\"N/A\",0,1)","v":"N/A"},{"$f":"_xlfn.XLOOKUP($E10,'Activity 6'!$B$33:$B$38,'Activity 6'!G$33:G$38,\"N/A\",0,1)","v":"N/A"},{"$f":"_xlfn.XLOOKUP($E10,'Activity 6'!$B$33:$B$38,'Activity 6'!H$33:H$38,\"N/A\",0,1)","v":"N/A"},{"$f":"_xlfn.XLOOKUP($E10,'Activity 6'!$B$33:$B$38,'Activity 6'!I$33:I$38,\"N/A\",0,1)","v":"N/A"},{"$f":"_xlfn.XLOOKUP($E10,'Activity 6'!$B$33:$B$38,'Activity 6'!J$33:J$38,\"N/A\",0,1)","v":"N/A"},{"$f":"_xlfn.XLOOKUP($E10,'Activity 6'!$B$33:$B$38,'Activity 6'!K$33:K$38,\"N/A\",0,1)","v":"N/A"},{"$f":"_xlfn.XLOOKUP($E10,'Activity 6'!$B$33:$B$38,'Activity 6'!M$33:M$38,\"N/A\",0,1)","v":"N/A"},{"$f":"_xlfn.XLOOKUP($E10,'Activity 7'!$B$7:$B$13,'Activity 7'!$A$7:$A$13,\"No\",0,1)","v":"No"},{"$f":"_xlfn.XLOOKUP($E10,'Activity 7'!$B$7:$B$13,'Activity 7'!C$7:C$13,\"N/A\",0,1)","v":"N/A"},{"$f":"_xlfn.XLOOKUP($E10,'Activity 7'!$B$7:$B$13,'Activity 7'!D$7:D$13,\"N/A\",0,1)","v":"N/A"},{"$f":"_xlfn.XLOOKUP($E10,'Activity 7'!$B$7:$B$13,'Activity 7'!E$7:E$13,\"N/A\",0,1)","v":"N/A"},{"$f":"_xlfn.XLOOKUP($E10,'Activity 7'!$B$7:$B$13,'Activity 7'!F$7:F$13,\"N/A\",0,1)","v":"N/A"},{"$f":"_xlfn.XLOOKUP($E10,'Activity 7'!$B$7:$B$13,'Activity 7'!G$7:G$13,\"N/A\",0,1)","v":"N/A"},{"$f":"_xlfn.XLOOKUP($E10,'Activity 7'!$B$7:$B$13,'Activity 7'!H$7:H$13,\"N/A\",0,1)","v":"N/A"},{"$f":"_xlfn.XLOOKUP($E10,'Activity 7'!$B$7:$B$13,'Activity 7'!I$7:I$13,\"N/A\",0,1)","v":"N/A"},{"$f":"_xlfn.XLOOKUP($E10,'Activity 7'!$B$7:$B$13,'Activity 7'!J$7:J$13,\"N/A\",0,1)","v":"N/A"},{"$f":"_xlfn.XLOOKUP($E10,'Activity 7'!$B$7:$B$13,'Activity 7'!K$7:K$13,\"N/A\",0,1)","v":"N/A"},{"$f":"_xlfn.XLOOKUP($E10,'Activity 7'!$B$7:$B$13,'Activity 7'!L$7:L$13,\"N/A\",0,1)","v":"N/A"},{"$f":"_xlfn.XLOOKUP($E10,'Activity 7'!$B$7:$B$13,'Activity 7'!M$7:M$13,\"N/A\",0,1)","v":"N/A"},{"$f":"_xlfn.XLOOKUP($E10,'Activity 7'!$B$17:$B$23,'Activity 7'!C$17:C$23,\"N/A\",0,1)","v":"N/A"},{"$f":"_xlfn.XLOOKUP($E10,'Activity 7'!$B$17:$B$23,'Activity 7'!D$17:D$23,\"N/A\",0,1)","v":"N/A"},{"$f":"_xlfn.XLOOKUP($E10,'Activity 7'!$B$17:$B$23,'Activity 7'!E$17:E$23,\"N/A\",0,1)","v":"N/A"},{"$f":"_xlfn.XLOOKUP($E10,'Activity 7'!$B$17:$B$23,'Activity 7'!F$17:F$23,\"N/A\",0,1)","v":"N/A"},{"$f":"_xlfn.XLOOKUP($E10,'Activity 7'!$B$17:$B$23,'Activity 7'!G$17:G$23,\"N/A\",0,1)","v":"N/A"},{"$f":"_xlfn.XLOOKUP($E10,'Activity 7'!$B$17:$B$23,'Activity 7'!H$17:H$23,\"N/A\",0,1)","v":"N/A"},{"$f":"_xlfn.XLOOKUP($E10,'Activity 7'!$B$17:$B$23,'Activity 7'!I$17:I$23,\"N/A\",0,1)","v":"N/A"},{"$f":"_xlfn.XLOOKUP($E10,'Activity 7'!$B$17:$B$23,'Activity 7'!J$17:J$23,\"N/A\",0,1)","v":"N/A"},{"$f":"_xlfn.XLOOKUP($E10,'Activity 7'!$B$17:$B$23,'Activity 7'!L$17:L$23,\"N/A\",0,1)","v":"N/A"},{"$f":"_xlfn.XLOOKUP($E10,'Activity 8'!$B$7:$B$13,'Activity 8'!A$7:A$13,\"No\",0,1)","v":"No"},{"$f":"_xlfn.XLOOKUP($E10,'Activity 8'!$B$7:$B$13,'Activity 8'!C$7:C$13,\"N/A\",0,1)","v":"N/A"},{"$f":"_xlfn.XLOOKUP($E10,'Activity 8'!$B$7:$B$13,'Activity 8'!D$7:D$13,\"N/A\",0,1)","v":"N/A"},{"$f":"_xlfn.XLOOKUP($E10,'Activity 8'!$B$7:$B$13,'Activity 8'!E$7:E$13,\"N/A\",0,1)","v":"N/A"},{"$f":"_xlfn.XLOOKUP($E10,'Activity 8'!$B$7:$B$13,'Activity 8'!F$7:F$13,\"N/A\",0,1)","v":"N/A"},{"$f":"_xlfn.XLOOKUP($E10,'Activity 8'!$B$7:$B$13,'Activity 8'!G$7:G$13,\"N/A\",0,1)","v":"N/A"},{"$f":"_xlfn.XLOOKUP($E10,'Activity 8'!$B$7:$B$13,'Activity 8'!H$7:H$13,\"N/A\",0,1)","v":"N/A"},{"$f":"_xlfn.XLOOKUP($E10,'Activity 8'!$B$7:$B$13,'Activity 8'!I$7:I$13,\"N/A\",0,1)","v":"N/A"},{"$f":"_xlfn.XLOOKUP($E10,'Activity 8'!$B$7:$B$13,'Activity 8'!J$7:J$13,\"N/A\",0,1)","v":"N/A"},{"$f":"_xlfn.XLOOKUP($E10,'Activity 8'!$B$7:$B$13,'Activity 8'!K$7:K$13,\"N/A\",0,1)","v":"N/A"},{"$f":"_xlfn.XLOOKUP($E10,'Activity 8'!$B$7:$B$13,'Activity 8'!L$7:L$13,\"N/A\",0,1)","v":"N/A"},{"$f":"_xlfn.XLOOKUP($E10,'Activity 8'!$B$7:$B$13,'Activity 8'!M$7:M$13,\"N/A\",0,1)","v":"N/A"},{"$f":"_xlfn.XLOOKUP($E10,'Activity 8'!$B$7:$B$13,'Activity 8'!N$7:N$13,\"N/A\",0,1)","v":"N/A"},{"$f":"_xlfn.XLOOKUP($E10,'Activity 8'!$B$7:$B$13,'Activity 8'!O$7:O$13,\"N/A\",0,1)","v":"N/A"},{"$f":"_xlfn.XLOOKUP($E10,'Activity 8'!$B$7:$B$13,'Activity 8'!P$7:P$13,\"N/A\",0,1)","v":"N/A"},{"$f":"_xlfn.XLOOKUP($E10,'Activity 8'!$B$17:$B$23,'Activity 8'!C$17:C$23,\"N/A\",0,1)","v":"N/A"},{"$f":"_xlfn.XLOOKUP($E10,'Activity 8'!$B$17:$B$23,'Activity 8'!D$17:D$23,\"N/A\",0,1)","v":"N/A"},{"$f":"_xlfn.XLOOKUP($E10,'Activity 8'!$B$17:$B$23,'Activity 8'!E$17:E$23,\"N/A\",0,1)","v":"N/A"},{"$f":"_xlfn.XLOOKUP($E10,'Activity 8'!$B$17:$B$23,'Activity 8'!F$17:F$23,\"N/A\",0,1)","v":"N/A"},{"$f":"_xlfn.XLOOKUP($E10,'Activity 8'!$B$17:$B$23,'Activity 8'!G$17:G$23,\"N/A\",0,1)","v":"N/A"},{"$f":"_xlfn.XLOOKUP($E10,'Activity 8'!$B$17:$B$23,'Activity 8'!H$17:H$23,\"N/A\",0,1)","v":"N/A"},{"$f":"_xlfn.XLOOKUP($E10,'Activity 8'!$B$17:$B$23,'Activity 8'!I$17:I$23,\"N/A\",0,1)","v":"N/A"},{"$f":"_xlfn.XLOOKUP($E10,'Activity 8'!$B$17:$B$23,'Activity 8'!J$17:J$23,\"N/A\",0,1)","v":"N/A"},{"$f":"_xlfn.XLOOKUP($E10,'Activity 8'!$B$17:$B$23,'Activity 8'!K$17:K$23,\"N/A\",0,1)","v":"N/A"},{"$f":"_xlfn.XLOOKUP($E10,'Activity 8'!$B$17:$B$23,'Activity 8'!L$17:L$23,\"N/A\",0,1)","v":"N/A"},{"$f":"_xlfn.XLOOKUP($E10,'Activity 8'!$B$17:$B$23,'Activity 8'!M$17:M$23,\"N/A\",0,1)","v":"N/A"},{"$f":"_xlfn.XLOOKUP($E10,'Activity 8'!$B$17:$B$23,'Activity 8'!P$17:P$23,\"N/A\",0,1)","v":"N/A"},{"$f":"_xlfn.XLOOKUP(E10,'Activity 9'!B15:B21,'Activity 9'!A15:A21,\"No\",0,1)","v":"No"},{"$f":"_xlfn.XLOOKUP($E10,'Activity 9'!$B$7:$B$13,'Activity 9'!C$7:C$13,\"N/A\",0,1)","v":"N/A"},{"$f":"_xlfn.XLOOKUP($E10,'Activity 9'!$B$7:$B$13,'Activity 9'!D$7:D$13,\"N/A\",0,1)","v":"N/A"},{"$f":"_xlfn.XLOOKUP($E10,'Activity 9'!$B$7:$B$13,'Activity 9'!E$7:E$13,\"N/A\",0,1)","v":"N/A"},{"$f":"_xlfn.XLOOKUP($E10,'Activity 9'!$B$7:$B$13,'Activity 9'!H$7:H$13,\"N/A\",0,1)","v":"N/A"},{"$f":"_xlfn.XLOOKUP($E10,'Activity 9'!$B$7:$B$13,'Activity 9'!I$7:I$13,\"N/A\",0,1)","v":"N/A"},{"$f":"_xlfn.XLOOKUP($E10,'Activity 9'!$B$7:$B$13,'Activity 9'!J$7:J$13,\"N/A\",0,1)","v":"N/A"},{"$f":"_xlfn.XLOOKUP($E10,'Activity 9'!$B$7:$B$13,'Activity 9'!K$7:K$13,\"N/A\",0,1)","v":"N/A"},{"$f":"_xlfn.XLOOKUP($E10,'Activity 9'!$B$7:$B$13,'Activity 9'!L$7:L$13,\"N/A\",0,1)","v":"N/A"},{"$f":"_xlfn.XLOOKUP($E10,'Activity 9'!$B$7:$B$13,'Activity 9'!M$7:M$13,\"N/A\",0,1)","v":"N/A"},{"$f":"_xlfn.XLOOKUP($E10,'Activity 9'!$B$7:$B$13,'Activity 9'!N$7:N$13,\"N/A\",0,1)","v":"N/A"},{"$f":"_xlfn.XLOOKUP($E10,'Activity 9'!$B$7:$B$13,'Activity 9'!O$7:O$13,\"N/A\",0,1)","v":"N/A"},{"$f":"_xlfn.XLOOKUP($E10,'Activity 9'!$B$17:$B$23,'Activity 9'!C$17:C$23,\"N/A\",0,1)","v":"N/A"},{"$f":"_xlfn.XLOOKUP($E10,'Activity 9'!$B$17:$B$23,'Activity 9'!D$17:D$23,\"N/A\",0,1)","v":"N/A"},{"$f":"_xlfn.XLOOKUP($E10,'Activity 9'!$B$17:$B$23,'Activity 9'!E$17:E$23,\"N/A\",0,1)","v":"N/A"},{"$f":"_xlfn.XLOOKUP($E10,'Activity 9'!$B$17:$B$23,'Activity 9'!F$17:F$23,\"N/A\",0,1)","v":"N/A"},{"$f":"_xlfn.XLOOKUP($E10,'Activity 9'!$B$17:$B$23,'Activity 9'!G$17:G$23,\"N/A\",0,1)","v":"N/A"},{"$f":"_xlfn.XLOOKUP($E10,'Activity 9'!$B$17:$B$23,'Activity 9'!H$17:H$23,\"N/A\",0,1)","v":"N/A"},{"$f":"_xlfn.XLOOKUP($E10,'Activity 9'!$B$17:$B$23,'Activity 9'!I$17:I$23,\"N/A\",0,1)","v":"N/A"},{"$f":"_xlfn.XLOOKUP($E10,'Activity 9'!$B$17:$B$23,'Activity 9'!J$17:J$23,\"N/A\",0,1)","v":"N/A"},{"$f":"_xlfn.XLOOKUP($E10,'Activity 9'!$B$17:$B$23,'Activity 9'!L$17:L$23,\"N/A\",0,1)","v":"N/A"},{"$f":"_xlfn.XLOOKUP($E10,'Activity 9'!$B$17:$B$23,'Activity 9'!M$17:M$23,\"N/A\",0,1)","v":"N/A"},{"$f":"_xlfn.XLOOKUP($E10,'Activity 9'!$B$17:$B$23,'Activity 9'!O$17:O$23,\"N/A\",0,1)","v":"N/A"},{"$f":"_xlfn.XLOOKUP($E10,'Activity 10'!B15:B21,'Activity 10'!A15:A21,\"No\",0,1)","v":"No"},{"$f":"_xlfn.XLOOKUP($E10,'Activity 10'!$B$7:$B$13,'Activity 10'!C$7:C$13,\"N/A\",0,1)","v":"N/A"},{"$f":"_xlfn.XLOOKUP($E10,'Activity 10'!$B$7:$B$13,'Activity 10'!D$7:D$13,\"N/A\",0,1)","v":"N/A"},{"$f":"_xlfn.XLOOKUP($E10,'Activity 10'!$B$7:$B$13,'Activity 10'!E$7:E$13,\"N/A\",0,1)","v":"N/A"},{"$f":"_xlfn.XLOOKUP($E10,'Activity 10'!$B$7:$B$13,'Activity 10'!F$7:F$13,\"N/A\",0,1)","v":"N/A"},{"$f":"_xlfn.XLOOKUP($E10,'Activity 10'!$B$7:$B$13,'Activity 10'!G$7:G$13,\"N/A\",0,1)","v":"N/A"},{"$f":"_xlfn.XLOOKUP($E10,'Activity 10'!$B$7:$B$13,'Activity 10'!H$7:H$13,\"N/A\",0,1)","v":"N/A"},{"$f":"_xlfn.XLOOKUP($E10,'Activity 10'!$B$7:$B$13,'Activity 10'!I$7:I$13,\"N/A\",0,1)","v":"N/A"},{"$f":"_xlfn.XLOOKUP($E10,'Activity 10'!$B$7:$B$13,'Activity 10'!J$7:J$13,\"N/A\",0,1)","v":"N/A"},{"$f":"_xlfn.XLOOKUP($E10,'Activity 10'!$B$7:$B$13,'Activity 10'!K$7:K$13,\"N/A\",0,1)","v":"N/A"},{"$f":"_xlfn.XLOOKUP($E10,'Activity 10'!$B$7:$B$13,'Activity 10'!L$7:L$13,\"N/A\",0,1)","v":"N/A"},{"$f":"_xlfn.XLOOKUP($E10,'Activity 10'!$B$7:$B$13,'Activity 10'!M$7:M$13,\"N/A\",0,1)","v":"N/A"},{"$f":"_xlfn.XLOOKUP($E10,'Activity 10'!$B$7:$B$13,'Activity 10'!N$7:N$13,\"N/A\",0,1)","v":"N/A"},{"$f":"_xlfn.XLOOKUP($E10,'Activity 10'!$B$7:$B$13,'Activity 10'!O$7:O$13,\"N/A\",0,1)","v":"N/A"},{"$f":"_xlfn.XLOOKUP($E10,'Activity 10'!$B$17:$B$23,'Activity 10'!C$17:C$23,\"N/A\",0,1)","v":"N/A"},{"$f":"_xlfn.XLOOKUP($E10,'Activity 10'!$B$17:$B$23,'Activity 10'!D$17:D$23,\"N/A\",0,1)","v":"N/A"},{"$f":"_xlfn.XLOOKUP($E10,'Activity 10'!$B$17:$B$23,'Activity 10'!E$17:E$23,\"N/A\",0,1)","v":"N/A"},{"$f":"_xlfn.XLOOKUP($E10,'Activity 10'!$B$17:$B$23,'Activity 10'!F$17:F$23,\"N/A\",0,1)","v":"N/A"},{"$f":"_xlfn.XLOOKUP($E10,'Activity 10'!$B$17:$B$23,'Activity 10'!G$17:G$23,\"N/A\",0,1)","v":"N/A"},{"$f":"_xlfn.XLOOKUP($E10,'Activity 10'!$B$17:$B$23,'Activity 10'!H$17:H$23,\"N/A\",0,1)","v":"N/A"},{"$f":"_xlfn.XLOOKUP($E10,'Activity 10'!$B$17:$B$23,'Activity 10'!I$17:I$23,\"N/A\",0,1)","v":"N/A"},{"$f":"_xlfn.XLOOKUP($E10,'Activity 10'!$B$17:$B$23,'Activity 10'!J$17:J$23,\"N/A\",0,1)","v":"N/A"},{"$f":"_xlfn.XLOOKUP($E10,'Activity 10'!$B$17:$B$23,'Activity 10'!K$17:K$23,\"N/A\",0,1)","v":"N/A"},{"$f":"_xlfn.XLOOKUP($E10,'Activity 10'!$B$17:$B$23,'Activity 10'!L$17:L$23,\"N/A\",0,1)","v":"N/A"},{"$f":"_xlfn.XLOOKUP($E10,'Activity 10'!$B$17:$B$23,'Activity 10'!N$17:N$23,\"N/A\",0,1)","v":"N/A"},{"$f":"_xlfn.XLOOKUP($E10,'Competitive Activity 1'!B15:B21,'Competitive Activity 1'!A15:A21,\"No\",0,1)","v":"No"},{"$f":"_xlfn.XLOOKUP($E10,'Competitive Activity 1'!$B$7:$B$13,'Competitive Activity 1'!C$7:C$13,\"N/A\",0,1)","v":"N/A"},{"$f":"_xlfn.XLOOKUP($E10,'Competitive Activity 1'!$B$7:$B$13,'Competitive Activity 1'!D$7:D$13,\"N/A\",0,1)","v":"N/A"},{"$f":"_xlfn.XLOOKUP($E10,'Competitive Activity 1'!$B$7:$B$13,'Competitive Activity 1'!E$7:E$13,\"N/A\",0,1)","v":"N/A"},{"$f":"_xlfn.XLOOKUP($E10,'Competitive Activity 1'!$B$7:$B$13,'Competitive Activity 1'!F$7:F$13,\"N/A\",0,1)","v":"N/A"},{"$f":"_xlfn.XLOOKUP($E10,'Competitive Activity 1'!$B$7:$B$13,'Competitive Activity 1'!G$7:G$13,\"N/A\",0,1)","v":"N/A"},{"$f":"_xlfn.XLOOKUP($E10,'Competitive Activity 1'!$B$7:$B$13,'Competitive Activity 1'!H$7:H$13,\"N/A\",0,1)","v":"N/A"},{"$f":"_xlfn.XLOOKUP($E10,'Competitive Activity 1'!$B$7:$B$13,'Competitive Activity 1'!I$7:I$13,\"N/A\",0,1)","v":"N/A"},{"$f":"_xlfn.XLOOKUP($E10,'Competitive Activity 1'!$B$7:$B$13,'Competitive Activity 1'!J$7:J$13,\"N/A\",0,1)","v":"N/A"},{"$f":"_xlfn.XLOOKUP($E10,'Competitive Activity 1'!$B$7:$B$13,'Competitive Activity 1'!K$7:K$13,\"N/A\",0,1)","v":"N/A"},{"$f":"_xlfn.XLOOKUP($E10,'Competitive Activity 1'!$B$7:$B$13,'Competitive Activity 1'!L$7:L$13,\"N/A\",0,1)","v":"N/A"},{"$f":"_xlfn.XLOOKUP($E10,'Competitive Activity 1'!$B$7:$B$13,'Competitive Activity 1'!M$7:M$13,\"N/A\",0,1)","v":"N/A"},{"$f":"_xlfn.XLOOKUP($E10,'Competitive Activity 1'!$B$7:$B$13,'Competitive Activity 1'!N$7:N$13,\"N/A\",0,1)","v":"N/A"},{"$f":"_xlfn.XLOOKUP($E10,'Competitive Activity 1'!$B$7:$B$13,'Competitive Activity 1'!O$7:O$13,\"N/A\",0,1)","v":"N/A"},{"$f":"_xlfn.XLOOKUP($E10,'Competitive Activity 1'!$B$7:$B$13,'Competitive Activity 1'!P$7:P$13,\"N/A\",0,1)","v":"N/A"},{"$f":"_xlfn.XLOOKUP($E10,'Competitive Activity 1'!$B$17:$B$23,'Competitive Activity 1'!C$17:C$23,\"N/A\",0,1)","v":"N/A"},{"$f":"_xlfn.XLOOKUP($E10,'Competitive Activity 1'!$B$17:$B$23,'Competitive Activity 1'!D$17:D$23,\"N/A\",0,1)","v":"N/A"},{"$f":"_xlfn.XLOOKUP($E10,'Competitive Activity 1'!$B$17:$B$23,'Competitive Activity 1'!E$17:E$23,\"N/A\",0,1)","v":"N/A"},{"$f":"_xlfn.XLOOKUP($E10,'Competitive Activity 1'!$B$17:$B$23,'Competitive Activity 1'!F$17:F$23,\"N/A\",0,1)","v":"N/A"},{"$f":"_xlfn.XLOOKUP($E10,'Competitive Activity 1'!$B$17:$B$23,'Competitive Activity 1'!G$17:G$23,\"N/A\",0,1)","v":"N/A"},{"$f":"_xlfn.XLOOKUP($E10,'Competitive Activity 1'!$B$17:$B$23,'Competitive Activity 1'!H$17:H$23,\"N/A\",0,1)","v":"N/A"},{"$f":"_xlfn.XLOOKUP($E10,'Competitive Activity 1'!$B$17:$B$23,'Competitive Activity 1'!I$17:I$23,\"N/A\",0,1)","v":"N/A"},{"$f":"_xlfn.XLOOKUP($E10,'Competitive Activity 1'!$B$17:$B$23,'Competitive Activity 1'!J$17:J$23,\"N/A\",0,1)","v":"N/A"},{"$f":"_xlfn.XLOOKUP($E10,'Competitive Activity 1'!$B$17:$B$23,'Competitive Activity 1'!K$17:K$23,\"N/A\",0,1)","v":"N/A"},{"$f":"_xlfn.XLOOKUP($E10,'Competitive Activity 1'!$B$17:$B$23,'Competitive Activity 1'!M$17:M$23,\"N/A\",0,1)","v":"N/A"},{"$f":"_xlfn.XLOOKUP($E10,'Competitive Activity 1'!$B$17:$B$23,'Competitive Activity 1'!N$17:N$23,\"N/A\",0,1)","v":"N/A"},{"$f":"_xlfn.XLOOKUP($E10,'Competitive Activity 1'!$B$17:$B$23,'Competitive Activity 1'!P$17:P$23,\"N/A\",0,1)","v":"N/A"},{"$f":"_xlfn.XLOOKUP($E10,'Competitive Activity 2'!$B$7:$B$13,'Competitive Activity 2'!$A$7:$A$13,\"No\",0,1)","v":"No"},{"$f":"_xlfn.XLOOKUP($E10,'Competitive Activity 2'!$B$7:$B$13,'Competitive Activity 2'!C$7:C$13,\"N/A\",0,1)","v":"N/A"},{"$f":"_xlfn.XLOOKUP($E10,'Competitive Activity 2'!$B$7:$B$13,'Competitive Activity 2'!D$7:D$13,\"N/A\",0,1)","v":"N/A"},{"$f":"_xlfn.XLOOKUP($E10,'Competitive Activity 2'!$B$7:$B$13,'Competitive Activity 2'!E$7:E$13,\"N/A\",0,1)","v":"N/A"},{"$f":"_xlfn.XLOOKUP($E10,'Competitive Activity 2'!$B$7:$B$13,'Competitive Activity 2'!F$7:F$13,\"N/A\",0,1)","v":"N/A"},{"$f":"_xlfn.XLOOKUP($E10,'Competitive Activity 2'!$B$7:$B$13,'Competitive Activity 2'!G$7:G$13,\"N/A\",0,1)","v":"N/A"},{"$f":"_xlfn.XLOOKUP($E10,'Competitive Activity 2'!$B$7:$B$13,'Competitive Activity 2'!H$7:H$13,\"N/A\",0,1)","v":"N/A"},{"$f":"_xlfn.XLOOKUP($E10,'Competitive Activity 2'!$B$7:$B$13,'Competitive Activity 2'!I$7:I$13,\"N/A\",0,1)","v":"N/A"},{"$f":"_xlfn.XLOOKUP($E10,'Competitive Activity 2'!$B$7:$B$13,'Competitive Activity 2'!J$7:J$13,\"N/A\",0,1)","v":"N/A"},{"$f":"_xlfn.XLOOKUP($E10,'Competitive Activity 2'!$B$7:$B$13,'Competitive Activity 2'!K$7:K$13,\"N/A\",0,1)","v":"N/A"},{"$f":"_xlfn.XLOOKUP($E10,'Competitive Activity 2'!$B$7:$B$13,'Competitive Activity 2'!L$7:L$13,\"N/A\",0,1)","v":"N/A"},{"$f":"_xlfn.XLOOKUP($E10,'Competitive Activity 2'!$B$17:$B$23,'Competitive Activity 2'!C$17:C$23,\"N/A\",0,1)","v":"N/A"},{"$f":"_xlfn.XLOOKUP($E10,'Competitive Activity 2'!$B$17:$B$23,'Competitive Activity 2'!D$17:D$23,\"N/A\",0,1)","v":"N/A"},{"$f":"_xlfn.XLOOKUP($E10,'Competitive Activity 2'!$B$17:$B$23,'Competitive Activity 2'!E$17:E$23,\"N/A\",0,1)","v":"N/A"},{"$f":"_xlfn.XLOOKUP($E10,'Competitive Activity 2'!$B$17:$B$23,'Competitive Activity 2'!F$17:F$23,\"N/A\",0,1)","v":"N/A"},{"$f":"_xlfn.XLOOKUP($E10,'Competitive Activity 2'!$B$17:$B$23,'Competitive Activity 2'!G$17:G$23,\"N/A\",0,1)","v":"N/A"},{"$f":"_xlfn.XLOOKUP($E10,'Competitive Activity 2'!$B$17:$B$23,'Competitive Activity 2'!H$17:H$23,\"N/A\",0,1)","v":"N/A"},{"$f":"_xlfn.XLOOKUP($E10,'Competitive Activity 2'!$B$17:$B$23,'Competitive Activity 2'!I$17:I$23,\"N/A\",0,1)","v":"N/A"},{"$f":"_xlfn.XLOOKUP($E10,'Competitive Activity 2'!$B$17:$B$23,'Competitive Activity 2'!J$17:J$23,\"N/A\",0,1)","v":"N/A"},{"$f":"_xlfn.XLOOKUP($E10,'Competitive Activity 2'!$B$17:$B$23,'Competitive Activity 2'!K$17:K$23,\"N/A\",0,1)","v":"N/A"},{"$f":"_xlfn.XLOOKUP($E10,'Competitive Activity 2'!$B$17:$B$23,'Competitive Activity 2'!L$17:L$23,\"N/A\",0,1)","v":"N/A"},{"$f":"_xlfn.XLOOKUP($E10,'Competitive Activity 2'!$B$17:$B$23,'Competitive Activity 2'!M$17:M$23,\"N/A\",0,1)","v":"N/A"},{"$f":"_xlfn.XLOOKUP($E10,'Competitive Activity 2'!$B$27:$B$33,'Competitive Activity 2'!C$27:C$33,\"N/A\",0,1)","v":"N/A"},{"$f":"_xlfn.XLOOKUP($E10,'Competitive Activity 2'!$B$27:$B$33,'Competitive Activity 2'!D$27:D$33,\"N/A\",0,1)","v":"N/A"},{"$f":"_xlfn.XLOOKUP($E10,'Competitive Activity 2'!$B$27:$B$33,'Competitive Activity 2'!E$27:E$33,\"N/A\",0,1)","v":"N/A"},{"$f":"_xlfn.XLOOKUP($E10,'Competitive Activity 2'!$B$27:$B$33,'Competitive Activity 2'!F$27:F$33,\"N/A\",0,1)","v":"N/A"},{"$f":"_xlfn.XLOOKUP($E10,'Competitive Activity 2'!$B$27:$B$33,'Competitive Activity 2'!G$27:G$33,\"N/A\",0,1)","v":"N/A"},{"$f":"_xlfn.XLOOKUP($E10,'Competitive Activity 2'!$B$27:$B$33,'Competitive Activity 2'!H$27:H$33,\"N/A\",0,1)","v":"N/A"},{"$f":"_xlfn.XLOOKUP($E10,'Competitive Activity 2'!$B$27:$B$33,'Competitive Activity 2'!I$27:I$33,\"N/A\",0,1)","v":"N/A"},{"$f":"_xlfn.XLOOKUP($E10,'Competitive Activity 2'!$B$27:$B$33,'Competitive Activity 2'!J$27:J$33,\"N/A\",0,1)","v":"N/A"},{"$f":"_xlfn.XLOOKUP($E10,'Competitive Activity 2'!$B$27:$B$33,'Competitive Activity 2'!L$27:L$33,\"N/A\",0,1)","v":"N/A"}]
[null,null,null,null,{"$f":"'3-Financial Summary'!A21","v":0},{"$f":"'3-Financial Summary'!B21","v":0},{"$f":"'3-Financial Summary'!C21","v":0},{"$f":"'3-Financial Summary'!D21","v":0},{"$f":"'3-Financial Summary'!E21","v":0},{"$f":"VLOOKUP(E11,'Summary Sheet'!$A$23:$L$34,11,FALSE)","v":"N/A"},{"$f":"VLOOKUP(E11,'Summary Sheet'!$A$23:$L$34,12,FALSE)","v":"N/A"},{"$f":"'3-Financial Summary'!F21","v":0},{"$f":"'3-Financial Summary'!G21","v":"00:00:00"},{"$f":"'3-Financial Summary'!H21","v":0},{"$f":"_xlfn.XLOOKUP($E11,'Activity 1'!$B$7:$B$13,'Activity 1'!$A$7:$A$13,\"No\",0,1)","v":"No"},{"$f":"_xlfn.XLOOKUP($E11,'Activity 1'!$B$7:$B$13,'Activity 1'!C16:C22,\"N/A\",0,1)","v":"N/A"},{"$f":"_xlfn.XLOOKUP($E11,'Activity 1'!$B$7:$B$13,'Activity 1'!D16:D22,\"N/A\",0,1)","v":"N/A"},{"$f":"_xlfn.XLOOKUP($E11,'Activity 1'!$B$7:$B$13,'Activity 1'!E$7:E$13,\"N/A\",0,1)","v":"N/A"},{"$f":"_xlfn.XLOOKUP($E11,'Activity 1'!$B$7:$B$13,'Activity 1'!F$7:F$13,\"N/A\",0,1)","v":"N/A"},{"$f":"_xlfn.XLOOKUP($E11,'Activity 1'!$B$7:$B$13,'Activity 1'!G$7:G$13,\"N/A\",0,1)","v":"N/A"},{"$f":"_xlfn.XLOOKUP($E11,'Activity 1'!$B$7:$B$13,'Activity 1'!H$7:H$13,\"N/A\",0,1)","v":"N/A"},{"$f":"_xlfn.XLOOKUP($E11,'Activity 1'!$B$7:$B$13,'Activity 1'!I$7:I$13,\"N/A\",0,1)","v":"N/A"},{"$f":"_xlfn.XLOOKUP($E11,'Activity 1'!$B$7:$B$13,'Activity 1'!J$7:J$13,\"N/A\",0,1)","v":"N/A"},{"$f":"_xlfn.XLOOKUP($E11,'Activity 1'!$B$7:$B$13,'Activity 1'!K$7:K$13,\"N/A\",0,1)","v":"N/A"},{"$f":"_xlfn.XLOOKUP($E11,'Activity 1'!$B$7:$B$13,'Activity 1'!L$7:L$13,\"N/A\",0,1)","v":"N/A"},{"$f":"_xlfn.XLOOKUP($E11,'Activity 1'!$B$7:$B$13,'Activity 1'!M$7:M$13,\"N/A\",0,1)","v":"N/A"},{"$f":"_xlfn.XLOOKUP($E11,'Activity 1'!$B$7:$B$13,'Activity 1'!N$7:N$13,\"N/A\",0,1)","v":"N/A"},{"$f":"_xlfn.XLOOKUP($E11,'Activity 1'!$B$7:$B$13,'Activity 1'!O$7:O$13,\"N/A\",0,1)","v":"N/A"},{"$f":"_xlfn.XLOOKUP($E11,'Activity 1'!$B$7:$B$13,'Activity 1'!P$7:P$13,\"N/A\",0,1)","v":"N/A"},{"$f":"_xlfn.XLOOKUP($E11,'Activity 1'!$B$7:$B$13,'Activity 1'!Q$7:Q$13,\"N/A\",0,1)","v":"N/A"},{"$f":"_xlfn.XLOOKUP($E11,'Activity 1'!$B$17:$B$23,'Activity 1'!C$17:C$23,\"N/A\",0,1)","v":"N/A"},{"$f":"_xlfn.XLOOKUP($E11,'Activity 1'!$B$17:$B$23,'Activity 1'!D$17:D$23,\"N/A\",0,1)","v":"N/A"},{"$f":"_xlfn.XLOOKUP($E11,'Activity 1'!$B$17:$B$23,'Activity 1'!E$17:E$23,\"N/A\",0,1)","v":"N/A"},{"$f":"_xlfn.XLOOKUP($E11,'Activity 1'!$B$17:$B$23,'Activity 1'!F$17:F$23,\"N/A\",0,1)","v":"N/A"},{"$f":"_xlfn.XLOOKUP($E11,'Activity 1'!$B$17:$B$23,'Activity 1'!G$17:G$23,\"N/A\",0,1)","v":"N/A"},{"$f":"_xlfn.XLOOKUP($E11,'Activity 1'!$B$17:$B$23,'Activity 1'!H$17:H$23,\"N/A\",0,1)","v":"N/A"},{"$f":"_xlfn.XLOOKUP($E11,'Activity 1'!$B$17:$B$23,'Activity 1'!I$17:I$23,\"N/A\",0,1)","v":"N/A"},{"$f":"_xlfn.XLOOKUP($E11,'Activity 1'!$B$17:$B$23,'Activity 1'!J$17:J$23,\"N/A\",0,1)","v":"N/A"},{"$f":"_xlfn.XLOOKUP($E11,'Activity 1'!$B$17:$B$23,'Activity 1'!K$17:K$23,\"N/A\",0,1)","v":"N/A"},{"$f":"_xlfn.XLOOKUP($E11,'Activity 1'!$B$17:$B$23,'Activity 1'!L$17:L$23,\"N/A\",0,1)","v":"N/A"},{"$f":"_xlfn.XLOOKUP($E11,'Activity 1'!$B$17:$B$23,'Activity 1'!M$17:M$23,\"N/A\",0,1)","v":"N/A"},{"$f":"_xlfn.XLOOKUP($E11,'Activity 1'!$B$17:$B$23,'Activity 1'!O$17:O$23,\"N/A\",0,1)","v":"N/A"},{"$f":"_xlfn.XLOOKUP($E11,'Activity 1'!$B$17:$B$23,'Activity 1'!Q$17:Q$23,\"N/A\",0,1)","v":"N/A"},{"$f":"_xlfn.XLOOKUP($E11,'Activity 2'!$B$7:$B$13,'Activity 2'!A$7:A$13,\"No\",0)","v":"No"},{"$f":"_xlfn.XLOOKUP($E11,'Activity 2'!$B$7:$B$13,'Activity 2'!C$7:C$13,\"N/A\",0,1)","v":"N/A"},{"$f":"_xlfn.XLOOKUP($E11,'Activity 2'!$B$7:$B$13,'Activity 2'!D$7:D$13,\"N/A\",0,1)","v":"N/A"},{"$f":"_xlfn.XLOOKUP($E11,'Activity 2'!$B$7:$B$13,'Activity 2'!E$7:E$13,\"N/A\",0,1)","v":"N/A"},{"$f":"_xlfn.XLOOKUP($E11,'Activity 2'!$B$7:$B$13,'Activity 2'!F$7:F$13,\"N/A\",0,1)","v":"N/A"},{"$f":"_xlfn.XLOOKUP($E11,'Activity 2'!$B$7:$B$13,'Activity 2'!G$7:G$13,\"N/A\",0,1)","v":"N/A"},{"$f":"_xlfn.XLOOKUP($E11,'Activity 2'!$B$7:$B$13,'Activity 2'!H$7:H$13,\"N/A\",0,1)","v":"N/A"},{"$f":"_xlfn.XLOOKUP($E11,'Activity 2'!$B$7:$B$13,'Activity 2'!I$7:I$13,\"N/A\",0,1)","v":"N/A"},{"$f":"_xlfn.XLOOKUP($E11,'Activity 2'!$B$7:$B$13,'Activity 2'!J$7:J$13,\"N/A\",0,1)","v":"N/A"},{"$f":"_xlfn.XLOOKUP($E11,'Activity 2'!$B$7:$B$13,'Activity 2'!K$7:K$13,\"N/A\",0,1)","v":"N/A"},{"$f":"_xlfn.XLOOKUP($E11,'Activity 2'!$B$7:$B$13,'Activity 2'!L$7:L$13,\"N/A\",0,1)","v":"N/A"},{"$f":"_xlfn.XLOOKUP($E11,'Activity 2'!$B$7:$B$13,'Activity 2'!M$7:M$13,\"N/A\",0,1)","v":"N/A"},{"$f":"_xlfn.XLOOKUP($E11,'Activity 2'!$B$7:$B$13,'Activity 2'!N$7:N$13,\"N/A\",0,1)","v":"N/A"},{"$f":"_xlfn.XLOOKUP($E11,'Activity 2'!$B$7:$B$13,'Activity 2'!O$7:O$13,\"N/A\",0,1)","v":"N/A"},{"$f":"_xlfn.XLOOKUP($E11,'Activity 2'!$B$7:$B$13,'Activity 2'!P$7:P$13,\"N/A\",0,1)","v":"N/A"},{"$f":"_xlfn.XLOOKUP($E11,'Activity 2'!$B$7:$B$13,'Activity 2'!Q$7:Q$13,\"N/A\",0,1)","v":"N/A"},{"$f":"_xlfn.XLOOKUP($E11,'Activity 2'!$B$17:$B$23,'Activity 2'!C$17:C$23,\"N/A\",0,1)","v":"N/A"},{"$f":"_xlfn.XLOOKUP($E11,'Activity 2'!$B$17:$B$23,'Activity 2'!D$17:D$23,\"N/A\",0,1)","v":"N/A"},{"$f":"_xlfn.XLOOKUP($E11,'Activity 2'!$B$17:$B$23,'Activity 2'!E$17:E$23,\"N/A\",0,1)","v":"N/A"},{"$f":"_xlfn.XLOOKUP($E11,'Activity 2'!$B$17:$B$23,'Activity 2'!F$17:F$23,\"N/A\",0,1)","v":"N/A"},{"$f":"_xlfn.XLOOKUP($E11,'Activity 2'!$B$17:$B$23,'Activity 2'!G$17:G$23,\"N/A\",0,1)","v":"N/A"},{"$f":"_xlfn.XLOOKUP($E11,'Activity 2'!$B$17:$B$23,'Activity 2'!H$17:H$23,\"N/A\",0,1)","v":"N/A"},{"$f":"_xlfn.XLOOKUP($E11,'Activity 2'!$B$17:$B$23,'Activity 2'!I$17:I$23,\"N/A\",0,1)","v":"N/A"},{"$f":"_xlfn.XLOOKUP($E11,'Activity 2'!$B$17:$B$23,'Activity 2'!J$17:J$23,\"N/A\",0,1)","v":"N/A"},{"$f":"_xlfn.XLOOKUP($E11,'Activity 2'!$B$17:$B$23,'Activity 2'!K$17:K$23,\"N/A\",0,1)","v":"N/A"},{"$f":"_xlfn.XLOOKUP($E11,'Activity 2'!$B$17:$B$23,'Activity 2'!L$17:L$23,\"N/A\",0,1)","v":"N/A"},{"$f":"_xlfn.XLOOKUP($E11,'Activity 2'!$B$17:$B$23,'Activity 2'!M$17:M$23,\"N/A\",0,1)","v":"N/A"},{"$f":"_xlfn.XLOOKUP($E11,'Activity 2'!$B$17:$B$23,'Activity 2'!O$17:O$23,\"N/A\",0,1)","v":"N/A"},{"$f":"_xlfn.XLOOKUP($E11,'Activity 2'!$B$17:$B$23,'Activity 2'!Q$17:Q$23,\"N/A\",0,1)","v":"N/A"},{"$f":"_xlfn.XLOOKUP($E11,'Activity 3'!$B$8:$B$14,'Activity 3'!A$8:A$14,\"No\",0,1)","v":"No"},{"$f":"_xlfn.XLOOKUP($E11,'Activity 3'!$B$8:$B$14,'Activity 3'!C$8:C$14,\"N/A\",0,1)","v":"N/A"},{"$f":"_xlfn.XLOOKUP($E11,'Activity 3'!$B$8:$B$14,'Activity 3'!D$8:D$14,\"N/A\",0,1)","v":"N/A"},{"$f":"_xlfn.XLOOKUP($E11,'Activity 3'!$B$8:$B$14,'Activity 3'!E$8:E$14,\"N/A\",0,1)","v":"N/A"},{"$f":"_xlfn.XLOOKUP($E11,'Activity 3'!$B$8:$B$14,'Activity 3'!F$8:F$14,\"N/A\",0,1)","v":"N/A"},{"$f":"_xlfn.XLOOKUP($E11,'Activity 3'!$B$8:$B$14,'Activity 3'!G$8:G$14,\"N/A\",0,1)","v":"N/A"},{"$f":"_xlfn.XLOOKUP($E11,'Activity 4'!$B$8:$B$14,'Activity 4'!A17:A22,\"No\",0,1)","v":{"$error":"#VALUE!"}},{"$f":"_xlfn.XLOOKUP($E11,'Activity 4'!$B$8:$B$14,'Activity 4'!C$8:C$14,\"N/A\",0,1)","v":"N/A"},{"$f":"_xlfn.XLOOKUP($E11,'Activity 4'!$B$8:$B$14,'Activity 4'!D$8:D$14,\"N/A\",0,1)","v":"N/A"},{"$f":"_xlfn.XLOOKUP($E11,'Activity 4'!$B$8:$B$14,'Activity 4'!G$8:G$14,\"N/A\",0,1)","v":"N/A"},{"$f":"_xlfn.XLOOKUP($E11,'Activity 5'!$B$8:$B$14,'Activity 5'!$A$8:$A$14,\"No\",0,1)","v":"No"},{"$f":"_xlfn.XLOOKUP($E11,'Activity 5'!$B$8:$B$14,'Activity 5'!C$8:C$14,\"N/A\",0,1)","v":"N/A"},{"$f":"_xlfn.XLOOKUP($E11,'Activity 5'!$B$8:$B$14,'Activity 5'!D$8:D$14,\"N/A\",0,1)","v":"N/A"},{"$f":"_xlfn.XLOOKUP($E11,'Activity 5'!$B$8:$B$14,'Activity 5'!G$8:G$14,\"N/A\",0,1)","v":"N/A"},{"$f":"_xlfn.XLOOKUP($E11,'Activity 5'!$B$8:$B$14,'Activity 5'!H$8:H$14,\"N/A\",0,1)","v":"N/A"},{"$f":"_xlfn.XLOOKUP($E11,'Activity 5'!$B$8:$B$14,'Activity 5'!I$8:I$14,\"N/A\",0,1)","v":"N/A"},{"$f":"_xlfn.XLOOKUP($E11,'Activity 5'!$B$8:$B$14,'Activity 5'!J$8:J$14,\"N/A\",0,1)","v":"N/A"},{"$f":"_xlfn.XLOOKUP($E11,'Activity 6'!$B$7:$B$13,'Activity 6'!A$7:A$13,\"No\",0,1)","v":"No"},{"$f":"_xlfn.XLOOKUP($E11,'Activity 6'!$B$7:$B$13,'Activity 6'!C$7:C$13,\"N/A\",0,1)","v":"N/A"},{"$f":"_xlfn.XLOOKUP($E11,'Activity 6'!$B$7:$B$13,'Activity 6'!D$7:D$13,\"N/A\",0,1)","v":"N/A"},{"$f":"_xlfn.XLOOKUP($E11,'Activity 6'!$B$7:$B$13,'Activity 6'!E$7:E$13,\"N/A\",0,1)","v":"N/A"},{"$f":"_xlfn.XLOOKUP($E11,'Activity 6'!$B$7:$B$13,'Activity 6'!F$7:F$13,\"N/A\",0,1)","v":"N/A"},{"$f":"_xlfn.XLOOKUP($E11,'Activity 6'!$B$7:$B$13,'Activity 6'!G$7:G$13,\"N/A\",0,1)","v":"N/A"},{"$f":"_xlfn.XLOOKUP($E11,'Activity 6'!$B$7:$B$13,'Activity 6'!H$7:H$13,\"N/A\",0,1)","v":"N/A"},{"$f":"_xlfn.XLOOKUP($E11,'Activity 6'!$B$7:$B$13,'Activity 6'!I$7:I$13,\"N/A\",0,1)","v":"N/A"},{"$f":"_xlfn.XLOOKUP($E11,'Activity 6'!$B$7:$B$13,'Activity 6'!J$7:J$13,\"N/A\",0,1)","v":"N/A"},{"$f":"_xlfn.XLOOKUP($E11,'Activity 6'!$B$7:$B$13,'Activity 6'!K$7:K$13,\"N/A\",0,1)","v":"N/A"},{"$f":"_xlfn.XLOOKUP($E11,'Activity 6'!$B$7:$B$13,'Activity 6'!L$7:L$13,\"N/A\",0,1)","v":"N/A"},{"$f":"_xlfn.XLOOKUP($E11,'Activity 6'!$B$7:$B$13,'Activity 6'!M$7:M$13,\"N/A\",0,1)","v":"N/A"},{"$f":"IF(ISNUMBER(SEARCH(\"6\",H11)),COUNTA('Activity 6'!$D$17:$E$20),\"N/A\")","v":"N/A"},{"$f":"IF(ISNUMBER(SEARCH(6,H11)),SUM('Activity 6'!G26:G29),\"N/A\")","v":"N/A"},{"$f":"_xlfn.XLOOKUP($E11,'Activity 6'!$B$23:$B$29,'Activity 6'!C$23:C$29,\"N/A\",0,1)","v":"N/A"},{"$f":"_xlfn.XLOOKUP($E11,'Activity 6'!$B$23:$B$29,'Activity 6'!D$23:D$29,\"N/A\",0,1)","v":"N/A"},{"$f":"_xlfn.XLOOKUP($E11,'Activity 6'!$B$23:$B$29,'Activity 6'!E$23:E$29,\"N/A\",0,1)","v":"N/A"},{"$f":"_xlfn.XLOOKUP($E11,'Activity 6'!$B$23:$B$29,'Activity 6'!F$23:F$29,\"N/A\",0,1)","v":"N/A"},{"$f":"_xlfn.XLOOKUP($E11,'Activity 6'!$B$23:$B$29,'Activity 6'!G$23:G$29,\"N/A\",0,1)","v":"N/A"},{"$f":"_xlfn.XLOOKUP($E11,'Activity 6'!$B$23:$B$29,'Activity 6'!H$23:H$29,\"N/A\",0,1)","v":"N/A"},{"$f":"_xlfn.XLOOKUP($E11,'Activity 6'!$B$23:$B$29,'Activity 6'!I$23:I$29,\"N/A\",0,1)","v":"N/A"},{"$f":"_xlfn.XLOOKUP($E11,'Activity 6'!$B$23:$B$29,'Activity 6'!J$23:J$29,\"N/A\",0,1)","v":"N/A"},{"$f":"_xlfn.XLOOKUP($E11,'Activity 6'!$B$23:$B$29,'Activity 6'!K$23:K$29,\"N/A\",0,1)","v":"N/A"},{"$f":"_xlfn.XLOOKUP($E11,'Activity 6'!$B$23:$B$29,'Activity 6'!L$23:L$29,\"N/A\",0,1)","v":"N/A"},{"$f":"_xlfn.XLOOKUP($E11,'Activity 6'!$B$23:$B$29,'Activity 6'!M$23:M$29,\"N/A\",0,1)","v":"N/A"},{"$f":"_xlfn.XLOOKUP($E11,'Activity 6'!$B$23:$B$29,'Activity 6'!N$23:N$29,\"N/A\",0,1)","v":"N/A"},{"$f":"_xlfn.XLOOKUP($E11,'Activity 6'!$B$33:$B$38,'Activity 6'!C$33:C$38,\"N/A\",0,1)","v":"N/A"},{"$f":"_xlfn.XLOOKUP($E11,'Activity 6'!$B$33:$B$38,'Activity 6'!D$33:D$38,\"N/A\",0,1)","v":"N/A"},{"$f":"_xlfn.XLOOKUP($E11,'Activity 6'!$B$33:$B$38,'Activity 6'!E$33:E$38,\"N/A\",0,1)","v":"N/A"},{"$f":"_xlfn.XLOOKUP($E11,'Activity 6'!$B$33:$B$38,'Activity 6'!I$33:I$38,\"N/A\",0,1)","v":"N/A"},{"$f":"_xlfn.XLOOKUP($E11,'Activity 6'!$B$33:$B$38,'Activity 6'!G$33:G$38,\"N/A\",0,1)","v":"N/A"},{"$f":"_xlfn.XLOOKUP($E11,'Activity 6'!$B$33:$B$38,'Activity 6'!H$33:H$38,\"N/A\",0,1)","v":"N/A"},{"$f":"_xlfn.XLOOKUP($E11,'Activity 6'!$B$33:$B$38,'Activity 6'!I$33:I$38,\"N/A\",0,1)","v":"N/A"},{"$f":"_xlfn.XLOOKUP($E11,'Activity 6'!$B$33:$B$38,'Activity 6'!J$33:J$38,\"N/A\",0,1)","v":"N/A"},{"$f":"_xlfn.XLOOKUP($E11,'Activity 6'!$B$33:$B$38,'Activity 6'!K$33:K$38,\"N/A\",0,1)","v":"N/A"},{"$f":"_xlfn.XLOOKUP($E11,'Activity 6'!$B$33:$B$38,'Activity 6'!M$33:M$38,\"N/A\",0,1)","v":"N/A"},{"$f":"_xlfn.XLOOKUP($E11,'Activity 7'!$B$7:$B$13,'Activity 7'!$A$7:$A$13,\"No\",0,1)","v":"No"},{"$f":"_xlfn.XLOOKUP($E11,'Activity 7'!$B$7:$B$13,'Activity 7'!C$7:C$13,\"N/A\",0,1)","v":"N/A"},{"$f":"_xlfn.XLOOKUP($E11,'Activity 7'!$B$7:$B$13,'Activity 7'!D$7:D$13,\"N/A\",0,1)","v":"N/A"},{"$f":"_xlfn.XLOOKUP($E11,'Activity 7'!$B$7:$B$13,'Activity 7'!E$7:E$13,\"N/A\",0,1)","v":"N/A"},{"$f":"_xlfn.XLOOKUP($E11,'Activity 7'!$B$7:$B$13,'Activity 7'!F$7:F$13,\"N/A\",0,1)","v":"N/A"},{"$f":"_xlfn.XLOOKUP($E11,'Activity 7'!$B$7:$B$13,'Activity 7'!G$7:G$13,\"N/A\",0,1)","v":"N/A"},{"$f":"_xlfn.XLOOKUP($E11,'Activity 7'!$B$7:$B$13,'Activity 7'!H$7:H$13,\"N/A\",0,1)","v":"N/A"},{"$f":"_xlfn.XLOOKUP($E11,'Activity 7'!$B$7:$B$13,'Activity 7'!I$7:I$13,\"N/A\",0,1)","v":"N/A"},{"$f":"_xlfn.XLOOKUP($E11,'Activity 7'!$B$7:$B$13,'Activity 7'!J$7:J$13,\"N/A\",0,1)","v":"N/A"},{"$f":"_xlfn.XLOOKUP($E11,'Activity 7'!$B$7:$B$13,'Activity 7'!K$7:K$13,\"N/A\",0,1)","v":"N/A"},{"$f":"_xlfn.XLOOKUP($E11,'Activity 7'!$B$7:$B$13,'Activity 7'!L$7:L$13,\"N/A\",0,1)","v":"N/A"},{"$f":"_xlfn.XLOOKUP($E11,'Activity 7'!$B$7:$B$13,'Activity 7'!M$7:M$13,\"N/A\",0,1)","v":"N/A"},{"$f":"_xlfn.XLOOKUP($E11,'Activity 7'!$B$17:$B$23,'Activity 7'!C$17:C$23,\"N/A\",0,1)","v":"N/A"},{"$f":"_xlfn.XLOOKUP($E11,'Activity 7'!$B$17:$B$23,'Activity 7'!D$17:D$23,\"N/A\",0,1)","v":"N/A"},{"$f":"_xlfn.XLOOKUP($E11,'Activity 7'!$B$17:$B$23,'Activity 7'!E$17:E$23,\"N/A\",0,1)","v":"N/A"},{"$f":"_xlfn.XLOOKUP($E11,'Activity 7'!$B$17:$B$23,'Activity 7'!F$17:F$23,\"N/A\",0,1)","v":"N/A"},{"$f":"_xlfn.XLOOKUP($E11,'Activity 7'!$B$17:$B$23,'Activity 7'!G$17:G$23,\"N/A\",0,1)","v":"N/A"},{"$f":"_xlfn.XLOOKUP($E11,'Activity 7'!$B$17:$B$23,'Activity 7'!H$17:H$23,\"N/A\",0,1)","v":"N/A"},{"$f":"_xlfn.XLOOKUP($E11,'Activity 7'!$B$17:$B$23,'Activity 7'!I$17:I$23,\"N/A\",0,1)","v":"N/A"},{"$f":"_xlfn.XLOOKUP($E11,'Activity 7'!$B$17:$B$23,'Activity 7'!J$17:J$23,\"N/A\",0,1)","v":"N/A"},{"$f":"_xlfn.XLOOKUP($E11,'Activity 7'!$B$17:$B$23,'Activity 7'!L$17:L$23,\"N/A\",0,1)","v":"N/A"},{"$f":"_xlfn.XLOOKUP($E11,'Activity 8'!$B$7:$B$13,'Activity 8'!A$7:A$13,\"No\",0,1)","v":"No"},{"$f":"_xlfn.XLOOKUP($E11,'Activity 8'!$B$7:$B$13,'Activity 8'!C$7:C$13,\"N/A\",0,1)","v":"N/A"},{"$f":"_xlfn.XLOOKUP($E11,'Activity 8'!$B$7:$B$13,'Activity 8'!D$7:D$13,\"N/A\",0,1)","v":"N/A"},{"$f":"_xlfn.XLOOKUP($E11,'Activity 8'!$B$7:$B$13,'Activity 8'!E$7:E$13,\"N/A\",0,1)","v":"N/A"},{"$f":"_xlfn.XLOOKUP($E11,'Activity 8'!$B$7:$B$13,'Activity 8'!F$7:F$13,\"N/A\",0,1)","v":"N/A"},{"$f":"_xlfn.XLOOKUP($E11,'Activity 8'!$B$7:$B$13,'Activity 8'!G$7:G$13,\"N/A\",0,1)","v":"N/A"},{"$f":"_xlfn.XLOOKUP($E11,'Activity 8'!$B$7:$B$13,'Activity 8'!H$7:H$13,\"N/A\",0,1)","v":"N/A"},{"$f":"_xlfn.XLOOKUP($E11,'Activity 8'!$B$7:$B$13,'Activity 8'!I$7:I$13,\"N/A\",0,1)","v":"N/A"},{"$f":"_xlfn.XLOOKUP($E11,'Activity 8'!$B$7:$B$13,'Activity 8'!J$7:J$13,\"N/A\",0,1)","v":"N/A"},{"$f":"_xlfn.XLOOKUP($E11,'Activity 8'!$B$7:$B$13,'Activity 8'!K$7:K$13,\"N/A\",0,1)","v":"N/A"},{"$f":"_xlfn.XLOOKUP($E11,'Activity 8'!$B$7:$B$13,'Activity 8'!L$7:L$13,\"N/A\",0,1)","v":"N/A"},{"$f":"_xlfn.XLOOKUP($E11,'Activity 8'!$B$7:$B$13,'Activity 8'!M$7:M$13,\"N/A\",0,1)","v":"N/A"},{"$f":"_xlfn.XLOOKUP($E11,'Activity 8'!$B$7:$B$13,'Activity 8'!N$7:N$13,\"N/A\",0,1)","v":"N/A"},{"$f":"_xlfn.XLOOKUP($E11,'Activity 8'!$B$7:$B$13,'Activity 8'!O$7:O$13,\"N/A\",0,1)","v":"N/A"},{"$f":"_xlfn.XLOOKUP($E11,'Activity 8'!$B$7:$B$13,'Activity 8'!P$7:P$13,\"N/A\",0,1)","v":"N/A"},{"$f":"_xlfn.XLOOKUP($E11,'Activity 8'!$B$17:$B$23,'Activity 8'!C$17:C$23,\"N/A\",0,1)","v":"N/A"},{"$f":"_xlfn.XLOOKUP($E11,'Activity 8'!$B$17:$B$23,'Activity 8'!D$17:D$23,\"N/A\",0,1)","v":"N/A"},{"$f":"_xlfn.XLOOKUP($E11,'Activity 8'!$B$17:$B$23,'Activity 8'!E$17:E$23,\"N/A\",0,1)","v":"N/A"},{"$f":"_xlfn.XLOOKUP($E11,'Activity 8'!$B$17:$B$23,'Activity 8'!F$17:F$23,\"N/A\",0,1)","v":"N/A"},{"$f":"_xlfn.XLOOKUP($E11,'Activity 8'!$B$17:$B$23,'Activity 8'!G$17:G$23,\"N/A\",0,1)","v":"N/A"},{"$f":"_xlfn.XLOOKUP($E11,'Activity 8'!$B$17:$B$23,'Activity 8'!H$17:H$23,\"N/A\",0,1)","v":"N/A"},{"$f":"_xlfn.XLOOKUP($E11,'Activity 8'!$B$17:$B$23,'Activity 8'!I$17:I$23,\"N/A\",0,1)","v":"N/A"},{"$f":"_xlfn.XLOOKUP($E11,'Activity 8'!$B$17:$B$23,'Activity 8'!J$17:J$23,\"N/A\",0,1)","v":"N/A"},{"$f":"_xlfn.XLOOKUP($E11,'Activity 8'!$B$17:$B$23,'Activity 8'!K$17:K$23,\"N/A\",0,1)","v":"N/A"},{"$f":"_xlfn.XLOOKUP($E11,'Activity 8'!$B$17:$B$23,'Activity 8'!L$17:L$23,\"N/A\",0,1)","v":"N/A"},{"$f":"_xlfn.XLOOKUP($E11,'Activity 8'!$B$17:$B$23,'Activity 8'!M$17:M$23,\"N/A\",0,1)","v":"N/A"},{"$f":"_xlfn.XLOOKUP($E11,'Activity 8'!$B$17:$B$23,'Activity 8'!P$17:P$23,\"N/A\",0,1)","v":"N/A"},{"$f":"_xlfn.XLOOKUP(E11,'Activity 9'!B16:B22,'Activity 9'!A16:A22,\"No\",0,1)","v":"No"},{"$f":"_xlfn.XLOOKUP($E11,'Activity 9'!$B$7:$B$13,'Activity 9'!C$7:C$13,\"N/A\",0,1)","v":"N/A"},{"$f":"_xlfn.XLOOKUP($E11,'Activity 9'!$B$7:$B$13,'Activity 9'!D$7:D$13,\"N/A\",0,1)","v":"N/A"},{"$f":"_xlfn.XLOOKUP($E11,'Activity 9'!$B$7:$B$13,'Activity 9'!E$7:E$13,\"N/A\",0,1)","v":"N/A"},{"$f":"_xlfn.XLOOKUP($E11,'Activity 9'!$B$7:$B$13,'Activity 9'!H$7:H$13,\"N/A\",0,1)","v":"N/A"},{"$f":"_xlfn.XLOOKUP($E11,'Activity 9'!$B$7:$B$13,'Activity 9'!I$7:I$13,\"N/A\",0,1)","v":"N/A"},{"$f":"_xlfn.XLOOKUP($E11,'Activity 9'!$B$7:$B$13,'Activity 9'!J$7:J$13,\"N/A\",0,1)","v":"N/A"},{"$f":"_xlfn.XLOOKUP($E11,'Activity 9'!$B$7:$B$13,'Activity 9'!K$7:K$13,\"N/A\",0,1)","v":"N/A"},{"$f":"_xlfn.XLOOKUP($E11,'Activity 9'!$B$7:$B$13,'Activity 9'!L$7:L$13,\"N/A\",0,1)","v":"N/A"},{"$f":"_xlfn.XLOOKUP($E11,'Activity 9'!$B$7:$B$13,'Activity 9'!M$7:M$13,\"N/A\",0,1)","v":"N/A"},{"$f":"_xlfn.XLOOKUP($E11,'Activity 9'!$B$7:$B$13,'Activity 9'!N$7:N$13,\"N/A\",0,1)","v":"N/A"},{"$f":"_xlfn.XLOOKUP($E11,'Activity 9'!$B$7:$B$13,'Activity 9'!O$7:O$13,\"N/A\",0,1)","v":"N/A"},{"$f":"_xlfn.XLOOKUP($E11,'Activity 9'!$B$17:$B$23,'Activity 9'!C$17:C$23,\"N/A\",0,1)","v":"N/A"},{"$f":"_xlfn.XLOOKUP($E11,'Activity 9'!$B$17:$B$23,'Activity 9'!D$17:D$23,\"N/A\",0,1)","v":"N/A"},{"$f":"_xlfn.XLOOKUP($E11,'Activity 9'!$B$17:$B$23,'Activity 9'!E$17:E$23,\"N/A\",0,1)","v":"N/A"},{"$f":"_xlfn.XLOOKUP($E11,'Activity 9'!$B$17:$B$23,'Activity 9'!F$17:F$23,\"N/A\",0,1)","v":"N/A"},{"$f":"_xlfn.XLOOKUP($E11,'Activity 9'!$B$17:$B$23,'Activity 9'!G$17:G$23,\"N/A\",0,1)","v":"N/A"},{"$f":"_xlfn.XLOOKUP($E11,'Activity 9'!$B$17:$B$23,'Activity 9'!H$17:H$23,\"N/A\",0,1)","v":"N/A"},{"$f":"_xlfn.XLOOKUP($E11,'Activity 9'!$B$17:$B$23,'Activity 9'!I$17:I$23,\"N/A\",0,1)","v":"N/A"},{"$f":"_xlfn.XLOOKUP($E11,'Activity 9'!$B$17:$B$23,'Activity 9'!J$17:J$23,\"N/A\",0,1)","v":"N/A"},{"$f":"_xlfn.XLOOKUP($E11,'Activity 9'!$B$17:$B$23,'Activity 9'!L$17:L$23,\"N/A\",0,1)","v":"N/A"},{"$f":"_xlfn.XLOOKUP($E11,'Activity 9'!$B$17:$B$23,'Activity 9'!M$17:M$23,\"N/A\",0,1)","v":"N/A"},{"$f":"_xlfn.XLOOKUP($E11,'Activity 9'!$B$17:$B$23,'Activity 9'!O$17:O$23,\"N/A\",0,1)","v":"N/A"},{"$f":"_xlfn.XLOOKUP($E11,'Activity 10'!B16:B22,'Activity 10'!A16:A22,\"No\",0,1)","v":"No"},{"$f":"_xlfn.XLOOKUP($E11,'Activity 10'!$B$7:$B$13,'Activity 10'!C$7:C$13,\"N/A\",0,1)","v":"N/A"},{"$f":"_xlfn.XLOOKUP($E11,'Activity 10'!$B$7:$B$13,'Activity 10'!D$7:D$13,\"N/A\",0,1)","v":"N/A"},{"$f":"_xlfn.XLOOKUP($E11,'Activity 10'!$B$7:$B$13,'Activity 10'!E$7:E$13,\"N/A\",0,1)","v":"N/A"},{"$f":"_xlfn.XLOOKUP($E11,'Activity 10'!$B$7:$B$13,'Activity 10'!F$7:F$13,\"N/A\",0,1)","v":"N/A"},{"$f":"_xlfn.XLOOKUP($E11,'Activity 10'!$B$7:$B$13,'Activity 10'!G$7:G$13,\"N/A\",0,1)","v":"N/A"},{"$f":"_xlfn.XLOOKUP($E11,'Activity 10'!$B$7:$B$13,'Activity 10'!H$7:H$13,\"N/A\",0,1)","v":"N/A"},{"$f":"_xlfn.XLOOKUP($E11,'Activity 10'!$B$7:$B$13,'Activity 10'!I$7:I$13,\"N/A\",0,1)","v":"N/A"},{"$f":"_xlfn.XLOOKUP($E11,'Activity 10'!$B$7:$B$13,'Activity 10'!J$7:J$13,\"N/A\",0,1)","v":"N/A"},{"$f":"_xlfn.XLOOKUP($E11,'Activity 10'!$B$7:$B$13,'Activity 10'!K$7:K$13,\"N/A\",0,1)","v":"N/A"},{"$f":"_xlfn.XLOOKUP($E11,'Activity 10'!$B$7:$B$13,'Activity 10'!L$7:L$13,\"N/A\",0,1)","v":"N/A"},{"$f":"_xlfn.XLOOKUP($E11,'Activity 10'!$B$7:$B$13,'Activity 10'!M$7:M$13,\"N/A\",0,1)","v":"N/A"},{"$f":"_xlfn.XLOOKUP($E11,'Activity 10'!$B$7:$B$13,'Activity 10'!N$7:N$13,\"N/A\",0,1)","v":"N/A"},{"$f":"_xlfn.XLOOKUP($E11,'Activity 10'!$B$7:$B$13,'Activity 10'!O$7:O$13,\"N/A\",0,1)","v":"N/A"},{"$f":"_xlfn.XLOOKUP($E11,'Activity 10'!$B$17:$B$23,'Activity 10'!C$17:C$23,\"N/A\",0,1)","v":"N/A"},{"$f":"_xlfn.XLOOKUP($E11,'Activity 10'!$B$17:$B$23,'Activity 10'!D$17:D$23,\"N/A\",0,1)","v":"N/A"},{"$f":"_xlfn.XLOOKUP($E11,'Activity 10'!$B$17:$B$23,'Activity 10'!E$17:E$23,\"N/A\",0,1)","v":"N/A"},{"$f":"_xlfn.XLOOKUP($E11,'Activity 10'!$B$17:$B$23,'Activity 10'!F$17:F$23,\"N/A\",0,1)","v":"N/A"},{"$f":"_xlfn.XLOOKUP($E11,'Activity 10'!$B$17:$B$23,'Activity 10'!G$17:G$23,\"N/A\",0,1)","v":"N/A"},{"$f":"_xlfn.XLOOKUP($E11,'Activity 10'!$B$17:$B$23,'Activity 10'!H$17:H$23,\"N/A\",0,1)","v":"N/A"},{"$f":"_xlfn.XLOOKUP($E11,'Activity 10'!$B$17:$B$23,'Activity 10'!I$17:I$23,\"N/A\",0,1)","v":"N/A"},{"$f":"_xlfn.XLOOKUP($E11,'Activity 10'!$B$17:$B$23,'Activity 10'!J$17:J$23,\"N/A\",0,1)","v":"N/A"},{"$f":"_xlfn.XLOOKUP($E11,'Activity 10'!$B$17:$B$23,'Activity 10'!K$17:K$23,\"N/A\",0,1)","v":"N/A"},{"$f":"_xlfn.XLOOKUP($E11,'Activity 10'!$B$17:$B$23,'Activity 10'!L$17:L$23,\"N/A\",0,1)","v":"N/A"},{"$f":"_xlfn.XLOOKUP($E11,'Activity 10'!$B$17:$B$23,'Activity 10'!N$17:N$23,\"N/A\",0,1)","v":"N/A"},{"$f":"_xlfn.XLOOKUP($E11,'Competitive Activity 1'!B16:B22,'Competitive Activity 1'!A16:A22,\"No\",0,1)","v":"No"},{"$f":"_xlfn.XLOOKUP($E11,'Competitive Activity 1'!$B$7:$B$13,'Competitive Activity 1'!C$7:C$13,\"N/A\",0,1)","v":"N/A"},{"$f":"_xlfn.XLOOKUP($E11,'Competitive Activity 1'!$B$7:$B$13,'Competitive Activity 1'!D$7:D$13,\"N/A\",0,1)","v":"N/A"},{"$f":"_xlfn.XLOOKUP($E11,'Competitive Activity 1'!$B$7:$B$13,'Competitive Activity 1'!E$7:E$13,\"N/A\",0,1)","v":"N/A"},{"$f":"_xlfn.XLOOKUP($E11,'Competitive Activity 1'!$B$7:$B$13,'Competitive Activity 1'!F$7:F$13,\"N/A\",0,1)","v":"N/A"},{"$f":"_xlfn.XLOOKUP($E11,'Competitive Activity 1'!$B$7:$B$13,'Competitive Activity 1'!G$7:G$13,\"N/A\",0,1)","v":"N/A"},{"$f":"_xlfn.XLOOKUP($E11,'Competitive Activity 1'!$B$7:$B$13,'Competitive Activity 1'!H$7:H$13,\"N/A\",0,1)","v":"N/A"},{"$f":"_xlfn.XLOOKUP($E11,'Competitive Activity 1'!$B$7:$B$13,'Competitive Activity 1'!I$7:I$13,\"N/A\",0,1)","v":"N/A"},{"$f":"_xlfn.XLOOKUP($E11,'Competitive Activity 1'!$B$7:$B$13,'Competitive Activity 1'!J$7:J$13,\"N/A\",0,1)","v":"N/A"},{"$f":"_xlfn.XLOOKUP($E11,'Competitive Activity 1'!$B$7:$B$13,'Competitive Activity 1'!K$7:K$13,\"N/A\",0,1)","v":"N/A"},{"$f":"_xlfn.XLOOKUP($E11,'Competitive Activity 1'!$B$7:$B$13,'Competitive Activity 1'!L$7:L$13,\"N/A\",0,1)","v":"N/A"},{"$f":"_xlfn.XLOOKUP($E11,'Competitive Activity 1'!$B$7:$B$13,'Competitive Activity 1'!M$7:M$13,\"N/A\",0,1)","v":"N/A"},{"$f":"_xlfn.XLOOKUP($E11,'Competitive Activity 1'!$B$7:$B$13,'Competitive Activity 1'!N$7:N$13,\"N/A\",0,1)","v":"N/A"},{"$f":"_xlfn.XLOOKUP($E11,'Competitive Activity 1'!$B$7:$B$13,'Competitive Activity 1'!O$7:O$13,\"N/A\",0,1)","v":"N/A"},{"$f":"_xlfn.XLOOKUP($E11,'Competitive Activity 1'!$B$7:$B$13,'Competitive Activity 1'!P$7:P$13,\"N/A\",0,1)","v":"N/A"},{"$f":"_xlfn.XLOOKUP($E11,'Competitive Activity 1'!$B$17:$B$23,'Competitive Activity 1'!C$17:C$23,\"N/A\",0,1)","v":"N/A"},{"$f":"_xlfn.XLOOKUP($E11,'Competitive Activity 1'!$B$17:$B$23,'Competitive Activity 1'!D$17:D$23,\"N/A\",0,1)","v":"N/A"},{"$f":"_xlfn.XLOOKUP($E11,'Competitive Activity 1'!$B$17:$B$23,'Competitive Activity 1'!E$17:E$23,\"N/A\",0,1)","v":"N/A"},{"$f":"_xlfn.XLOOKUP($E11,'Competitive Activity 1'!$B$17:$B$23,'Competitive Activity 1'!F$17:F$23,\"N/A\",0,1)","v":"N/A"},{"$f":"_xlfn.XLOOKUP($E11,'Competitive Activity 1'!$B$17:$B$23,'Competitive Activity 1'!G$17:G$23,\"N/A\",0,1)","v":"N/A"},{"$f":"_xlfn.XLOOKUP($E11,'Competitive Activity 1'!$B$17:$B$23,'Competitive Activity 1'!H$17:H$23,\"N/A\",0,1)","v":"N/A"},{"$f":"_xlfn.XLOOKUP($E11,'Competitive Activity 1'!$B$17:$B$23,'Competitive Activity 1'!I$17:I$23,\"N/A\",0,1)","v":"N/A"},{"$f":"_xlfn.XLOOKUP($E11,'Competitive Activity 1'!$B$17:$B$23,'Competitive Activity 1'!J$17:J$23,\"N/A\",0,1)","v":"N/A"},{"$f":"_xlfn.XLOOKUP($E11,'Competitive Activity 1'!$B$17:$B$23,'Competitive Activity 1'!K$17:K$23,\"N/A\",0,1)","v":"N/A"},{"$f":"_xlfn.XLOOKUP($E11,'Competitive Activity 1'!$B$17:$B$23,'Competitive Activity 1'!M$17:M$23,\"N/A\",0,1)","v":"N/A"},{"$f":"_xlfn.XLOOKUP($E11,'Competitive Activity 1'!$B$17:$B$23,'Competitive Activity 1'!N$17:N$23,\"N/A\",0,1)","v":"N/A"},{"$f":"_xlfn.XLOOKUP($E11,'Competitive Activity 1'!$B$17:$B$23,'Competitive Activity 1'!P$17:P$23,\"N/A\",0,1)","v":"N/A"},{"$f":"_xlfn.XLOOKUP($E11,'Competitive Activity 2'!$B$7:$B$13,'Competitive Activity 2'!$A$7:$A$13,\"No\",0,1)","v":"No"},{"$f":"_xlfn.XLOOKUP($E11,'Competitive Activity 2'!$B$7:$B$13,'Competitive Activity 2'!C$7:C$13,\"N/A\",0,1)","v":"N/A"},{"$f":"_xlfn.XLOOKUP($E11,'Competitive Activity 2'!$B$7:$B$13,'Competitive Activity 2'!D$7:D$13,\"N/A\",0,1)","v":"N/A"},{"$f":"_xlfn.XLOOKUP($E11,'Competitive Activity 2'!$B$7:$B$13,'Competitive Activity 2'!E$7:E$13,\"N/A\",0,1)","v":"N/A"},{"$f":"_xlfn.XLOOKUP($E11,'Competitive Activity 2'!$B$7:$B$13,'Competitive Activity 2'!F$7:F$13,\"N/A\",0,1)","v":"N/A"},{"$f":"_xlfn.XLOOKUP($E11,'Competitive Activity 2'!$B$7:$B$13,'Competitive Activity 2'!G$7:G$13,\"N/A\",0,1)","v":"N/A"},{"$f":"_xlfn.XLOOKUP($E11,'Competitive Activity 2'!$B$7:$B$13,'Competitive Activity 2'!H$7:H$13,\"N/A\",0,1)","v":"N/A"},{"$f":"_xlfn.XLOOKUP($E11,'Competitive Activity 2'!$B$7:$B$13,'Competitive Activity 2'!I$7:I$13,\"N/A\",0,1)","v":"N/A"},{"$f":"_xlfn.XLOOKUP($E11,'Competitive Activity 2'!$B$7:$B$13,'Competitive Activity 2'!J$7:J$13,\"N/A\",0,1)","v":"N/A"},{"$f":"_xlfn.XLOOKUP($E11,'Competitive Activity 2'!$B$7:$B$13,'Competitive Activity 2'!K$7:K$13,\"N/A\",0,1)","v":"N/A"},{"$f":"_xlfn.XLOOKUP($E11,'Competitive Activity 2'!$B$7:$B$13,'Competitive Activity 2'!L$7:L$13,\"N/A\",0,1)","v":"N/A"},{"$f":"_xlfn.XLOOKUP($E11,'Competitive Activity 2'!$B$17:$B$23,'Competitive Activity 2'!C$17:C$23,\"N/A\",0,1)","v":"N/A"},{"$f":"_xlfn.XLOOKUP($E11,'Competitive Activity 2'!$B$17:$B$23,'Competitive Activity 2'!D$17:D$23,\"N/A\",0,1)","v":"N/A"},{"$f":"_xlfn.XLOOKUP($E11,'Competitive Activity 2'!$B$17:$B$23,'Competitive Activity 2'!E$17:E$23,\"N/A\",0,1)","v":"N/A"},{"$f":"_xlfn.XLOOKUP($E11,'Competitive Activity 2'!$B$17:$B$23,'Competitive Activity 2'!F$17:F$23,\"N/A\",0,1)","v":"N/A"},{"$f":"_xlfn.XLOOKUP($E11,'Competitive Activity 2'!$B$17:$B$23,'Competitive Activity 2'!G$17:G$23,\"N/A\",0,1)","v":"N/A"},{"$f":"_xlfn.XLOOKUP($E11,'Competitive Activity 2'!$B$17:$B$23,'Competitive Activity 2'!H$17:H$23,\"N/A\",0,1)","v":"N/A"},{"$f":"_xlfn.XLOOKUP($E11,'Competitive Activity 2'!$B$17:$B$23,'Competitive Activity 2'!I$17:I$23,\"N/A\",0,1)","v":"N/A"},{"$f":"_xlfn.XLOOKUP($E11,'Competitive Activity 2'!$B$17:$B$23,'Competitive Activity 2'!J$17:J$23,\"N/A\",0,1)","v":"N/A"},{"$f":"_xlfn.XLOOKUP($E11,'Competitive Activity 2'!$B$17:$B$23,'Competitive Activity 2'!K$17:K$23,\"N/A\",0,1)","v":"N/A"},{"$f":"_xlfn.XLOOKUP($E11,'Competitive Activity 2'!$B$17:$B$23,'Competitive Activity 2'!L$17:L$23,\"N/A\",0,1)","v":"N/A"},{"$f":"_xlfn.XLOOKUP($E11,'Competitive Activity 2'!$B$17:$B$23,'Competitive Activity 2'!M$17:M$23,\"N/A\",0,1)","v":"N/A"},{"$f":"_xlfn.XLOOKUP($E11,'Competitive Activity 2'!$B$27:$B$33,'Competitive Activity 2'!C$27:C$33,\"N/A\",0,1)","v":"N/A"},{"$f":"_xlfn.XLOOKUP($E11,'Competitive Activity 2'!$B$27:$B$33,'Competitive Activity 2'!D$27:D$33,\"N/A\",0,1)","v":"N/A"},{"$f":"_xlfn.XLOOKUP($E11,'Competitive Activity 2'!$B$27:$B$33,'Competitive Activity 2'!E$27:E$33,\"N/A\",0,1)","v":"N/A"},{"$f":"_xlfn.XLOOKUP($E11,'Competitive Activity 2'!$B$27:$B$33,'Competitive Activity 2'!F$27:F$33,\"N/A\",0,1)","v":"N/A"},{"$f":"_xlfn.XLOOKUP($E11,'Competitive Activity 2'!$B$27:$B$33,'Competitive Activity 2'!G$27:G$33,\"N/A\",0,1)","v":"N/A"},{"$f":"_xlfn.XLOOKUP($E11,'Competitive Activity 2'!$B$27:$B$33,'Competitive Activity 2'!H$27:H$33,\"N/A\",0,1)","v":"N/A"},{"$f":"_xlfn.XLOOKUP($E11,'Competitive Activity 2'!$B$27:$B$33,'Competitive Activity 2'!I$27:I$33,\"N/A\",0,1)","v":"N/A"},{"$f":"_xlfn.XLOOKUP($E11,'Competitive Activity 2'!$B$27:$B$33,'Competitive Activity 2'!J$27:J$33,\"N/A\",0,1)","v":"N/A"},{"$f":"_xlfn.XLOOKUP($E11,'Competitive Activity 2'!$B$27:$B$33,'Competitive Activity 2'!L$27:L$33,\"N/A\",0,1)","v":"N/A"}]

{"sheet":"Grantee Data","index":19,"n_rows":2,"n_cols":475,"rows_kept":2,"cut":false,"hidden":true,"merged":[]}
["Grantee Name","Contract Number","Preparer Name","Preparer Title","Preparer Email","Reporting Period","Type of Allocation","Delegated Local Government OR Housing Trust Fund","HCD Rep","2019 Allocation","2020 Allocation","2021 Allocation","2022 Allocation","2023 Allocation","Total Award","Admin Award","AOWH Planned for 2019 Allocation","AOWH Planned for 2020 Allocation","AOWH Planned for 2021 Allocation","AOWH Planned for 2022 Allocation","AOWH Planned for 2023 Allocation","Total Planned AOWH","2019 Disbursed AOWH","2020 Disbursed AOWH","2021 Disbursed AOWH","2022 Disbursed AOWH","2023 Disbursed AOWH","Total Disbursed AOWH","Eligible for Next Year Allocation?","Total Funds Expended on Activity Costs","Total Funds Expended on Admin","Reporting Period Program Income","# Households Assisted with PI","Total PI Balance","Activity 1","Total Awarded Funds to A1","2019 Award Allocated to A1","2019 Disbursement Year for A1","2020 Award Allocated to A1","2020 Disbursement Year for A1","2021 Award Allocated to A1","2021 Disbursement Year for A1","2022 Award Allocated to A1","2022 Disbursement Year for A1","2023 Award Allocated to A1","2023 Disbursement Year for A1","Activity 2","Total Awarded Funds to A2","2019 Award Allocated to A2","2019 Disbursement Year for A2","2020 Award Allocated to A2","2020 Disbursement Year for A2","2021 Award Allocated to A2","2021 Disbursement Year for A2","2022 Award Allocated to A2","2022 Disbursement Year for A2","2023 Award Allocated to A2","2023 Disbursement Year for A2","Activity 3","Total Awarded Funds to A3","2019 Award Allocated to A3","2019 Disbursement Year for A3","2020 Award Allocated to A3","2020 Disbursement Year for A3","2021 Award Allocated to A3","2021 Disbursement Year for A3","2022 Award Allocated to A3","2022 Disbursement Year for A3","2023 Award Allocated to A3","2023 Disbursement Year for A3","Activity 4","Total Awarded Funds to A4","2019 Award Allocated to A4","2019 Disbursement Year for A4","2020 Award Allocated to A4","2020 Disbursement Year for A4","2021 Award Allocated to A4","2021 Disbursement Year for A4","2022 Award Allocated to A4","2022 Disbursement Year for A4","2023 Award Allocated to A4","2023 Disbursement Year for A4","Activity 5","Total Awarded Funds to A5","2019 Award Allocated to A5","2019 Disbursement Year for A5","2020 Award Allocated to A5","2020 Disbursement Year for A5","2021 Award Allocated to A5","2021 Disbursement Year for A5","2022 Award Allocated to A5","2022 Disbursement Year for A5","2023 Award Allocated to A5","2023 Disbursement Year for A5","Activity 6","Total Awarded Funds to A6","2019 Award Allocated to A6","2019 Disbursement Year for A6","2020 Award Allocated to A6","2020 Disbursement Year for A6","2021 Award Allocated to A6","2021 Disbursement Year for A6","2022 Award Allocated to A6","2022 Disbursement Year for A6","2023 Award Allocated to A6","2023 Disbursement Year for A6","Activity 7","Total Awarded Funds to A7","2019 Award Allocated to A7","2019 Disbursement Year for A7","2020 Award Allocated to A7","2020 Disbursement Year for A7","2021 Award Allocated to A7","2021 Disbursement Year for A7","2022 Award Allocated to A7","2022 Disbursement Year for A7","2023 Award Allocated to A7","2023 Disbursement Year for A7","Activity 8","Total Awarded Funds to A8","2019 Award Allocated to A8","2019 Disbursement Year for A8","2020 Award Allocated to A8","2020 Disbursement Year for A8","2021 Award Allocated to A8","2021 Disbursement Year for A8","2022 Award Allocated to A8","2022 Disbursement Year for A8","2023 Award Allocated to A8","2023 Disbursement Year for A8","Activity 9","Total Awarded Funds to A9","2019 Award Allocated to A9","2019 Disbursement Year for A9","2020 Award Allocated to A9","2020 Disbursement Year for A9","2021 Award Allocated to A9","2021 Disbursement Year for A9","2022 Award Allocated to A9","2022 Disbursement Year for A9","2023 Award Allocated to A9","2023 Disbursement Year for A9","Activity 10","Total Awarded Funds to A10","2019 Award Allocated to A10","2019 Disbursement Year for A10","2020 Award Allocated to A10","2020 Disbursement Year for A10","2021 Award Allocated to A10","2021 Disbursement Year for A10","2022 Award Allocated to A10","2022 Disbursement Year for A10","2023 Award Allocated to A10","2023 Disbursement Year for A10","Competitive Award Year","Competitive Award Amount","Competitive Funds Disbursed?","Disbursement Year for Competitive Funds","Competitive Admin Used","Competitive Activity 1","Competitive Activity 2","1. Please describe any issues or barriers you encountered in securing required entitlements, permits, zoning changes, and environmental clearances as applicable. ","2. Please describe the targeted beneficiaries of your project including services to be provided.","3. Please describe any proposed amendment(s) to the approved Activities and schedule (pursuant to Guidelines Section 503(b))","4. Please describe additional revenue generated from program funding in this reporting period and how revenue was generated (e.g. loan repayments, interest, fees). Please provide a description of how your estimate of households to be assisted was determined. ","5. Please share any success stories you've had from PLHA-funded projects","6. If your five-year plan includes any of the following activities:  2, 3, 4, 7, 8, 9, or 10, explain how you are targeting 20% of your allocation toward AOWH.  See Guidelines §303(e) \nIf AOWH is not applicable (e.g. if your plan only includes activities 1, 5, or 6), please enter \"N/A.\" ","A1. Number of Units Developed, Rehabilitated, or Preserved  by PLHA funds (prior total)","A1. Number of ADA Accessible Units Developed, Rehabilitated or Preserved (prior total)","A1. Number of Units Developed, Rehabilitated or Preserved for Formerly Homeless Individuals (prior total)","A1. Number of Extremely Low- Income Units Developed, Rehabilitated or Preserved\n(Max 30% AMI) (prior total)","A1. Number of Very Low-Income Units Developed, Rehabilitated or Preserved\n(Max 50% AMI) (prior total)","A1. Total Number of Units at or below 60% AMI Developed, Rehabilitated or Preserved (prior total)","A1. Number of Low(er)-Income Units Developed, Rehabilitated or Preserved (Max 80% AMI) (prior total)","A1. Number of Moderate-Income Units Developed, Rehabilitated or Preserved\n(Max 120% AMI, or if in High Cost Area 150%) (prior total)","A1. Number of Units Developed, Rehabilitated, or Preserved  by PLHA funds (this period) ","A1. Number of ADA Accessible Units Developed, Rehabilitated or Preserved (this period) ","A1. Number of Units Developed, Rehabilitated or Preserved for Formerly Homeless Individuals  (this period) ","A1. Number of Extremely Low- Income Units Developed, Rehabilitated or Preserved\n(Max 30% AMI) (this period) ","A1. Number of Very Low-Income Units Developed, Rehabilitated or Preserved\n(Max 50% AMI) (this period) ","A1. Total Number of Units at or below 60% AMI Developed, Rehabilitated or Preserved (this period) ","A1. Number of Low(er)-Income Units Developed, Rehabilitated or Preserved (Max 80% AMI) (this period) ","A1. Number of Moderate-Income Units Developed, Rehabilitated or Preserved\n(Max 120% AMI, or if in High Cost Area 150%) (this period) ","A1. Number of Individuals Served (prior)","A1. Number of Households Served (prior)","A1. Number of Seniors (65 and older) Served (Prior)","A1. Number of Veterans Served (prior)","A1. Number of Disabled Persons Served (prior)","A1. Number of Families with Minor Children Served (prior)","A1. Number of Transition-Aged Youth (ages 18-24) Served (prior)","A1. Number of Farmworkers Served (prior)","A1. Number of Individuals Served (this period)","A1. Number of Households Served (this period)","A1. Number of Seniors (65 and older) Served (this period)","A1. Number of Veterans Served (this period)","A1. Number of Disabled Persons Served (this period)","A1. Number of Families with Minor Children Served (this period)","A1. Number of Transition-Aged Youth (ages 18-24) Served (this period)","A1. Number of Farmworkers Served (this period)","A2. Number of Units Developed, Rehabilitated, or Preserved  by PLHA funds (prior)","A2. Number of ADA Accessible Units Developed, Rehabilitated or Preserved (prior)","A2. Number of Units Developed, Rehabilitated or Preserved for Formerly Homeless Individuals (prior)","A2. Number of Extremely Low- Income Units Developed, Rehabilitated or Preserved\n(Max 30% AMI) (prior)","A2. Number of Very Low-Income Units Developed, Rehabilitated or Preserved\n(Max 50% AMI) (prior)","A2. Total Number of Units at or below 60% AMI Developed, Rehabilitated or Preserved (prior)","A2. Number of Low(er)-Income Units Developed, Rehabilitated or Preserved (Max 80% AMI) (prior)","A2. Number of Moderate-Income Units Developed, Rehabilitated or Preserved\n(Max 120% AMI, or if in High Cost Area 150%) (prior)","A2. Number of Units Developed, Rehabilitated, or Preserved  by PLHA funds (this period)","A2. Number of ADA Accessible Units Developed, Rehabilitated or Preserved (this period)","A2. Number of Units Developed, Rehabilitated or Preserved for Formerly Homeless Individuals (this period)","A2. Number of Extremely Low- Income Units Developed, Rehabilitated or Preserved\n(Max 30% AMI) (this period)","A2. Number of Very Low-Income Units Developed, Rehabilitated or Preserved\n(Max 50% AMI) (this period)","A2. Total Number of Units at or below 60% AMI Developed, Rehabilitated or Preserved (this period)","A2. Number of Low(er)-Income Units Developed, Rehabilitated or Preserved (Max 80% AMI) (this period)","A2. Number of Moderate-Income Units Developed, Rehabilitated or Preserved\n(Max 120% AMI, or if in High Cost Area 150%) (this period)","A2. Number of Individuals Served (prior)","A2. Number of Households Served (prior)","A2. Number of Seniors (65 and older) Served (prior)","A2. Number of Veterans Served (prior)","A2. Number of Disabled Persons Served (prior)","A2. Number of Families with Minor Children Served (prior)","A2. Number of Transition-Aged Youth (ages 18-24) Served (prior)","A2. Number of Farmworkers Served (prior)","A2. Number of Individuals Served (this period)","A2. Number of Households Served (this period)","A2. Number of Seniors (65 and older) Served (this period)","A2. Number of Veterans Served (this period)","A2. Number of Disabled Persons Served (this period)","A2. Number of Families with Minor Children Served (this period)","A2. Number of Transition-Aged Youth (ages 18-24) Served (this period)","A2. Number of Farmworkers Served (this period)","A3. Number of Units Funded by PLHA (prior)","A3. Number of Rental Units Funded by PLHA (prior)","A3. Number of Ownership Units Funded by PLHA (prior)","A3. Number of ADUs Funded by PLHA (prior)","A3. Number of Units Funded by PLHA (this period)","A3. Number of Rental Units Funded by PLHA (this period)","A3. Number of Ownership Units Funded by PLHA (this period)","A3. Number of ADUs Funded by PLHA (this period)","A3. Number of Individuals Served (prior)","A3. Number of Individuals Served (this period)","A4. Number of Units Funded by PLHA (prior)","A4. Number of Rental Units Funded by PLHA (prior)","A4. Number of Ownership Units Funded by PLHA (prior)","A4. Number of Units Funded by PLHA (this period)","A4. Number of Rental Units Funded by PLHA (this period)","A4. Number of Ownership Units Funded by PLHA (this period)","A4. Number of Individuals Served (prior)","A4. Number of Individuals Served (this period)","A5. Number of Units Funded by PLHA (prior)","A5. Number of Existing Permanent Supportive Housing Units Preserved by PLHA Funds (prior)","A5. Number of New Permanent Supportive Units Created by PLHA Funds (prior)","A5. Number of Units Funded by PLHA (this period)","A5. Number of Existing Permanent Supportive Housing Units Preserved by PLHA Funds (this period)","A5. Number of New Permanent Supportive Units Created by PLHA Funds (this period)","A5. Number of Individuals Served (prior)","A5. Number of Individuals Served (this period)","A6. Number of Units Developed, Rehabilitated, or Preserved (prior)","A6. Number of Housing Units Receiving Rapid-Rehousing Assistance (prior)","A6. Number of Housing Units Receiving Rental Assistance (prior)","A6. Number of Housing Units Receiving Supportive/Case Management Services(prior)","A6. Number of Housing Units Receiving Operating or Capital subsidy (prior)","A6. Number of Emergency Shelter Beds Supported (prior)","A6. Number of Permanent Units Developed, Rehabilitated or Preserved (prior)","A6. Number of Transitional Units Developed, Rehabilitated or Preserved (prior)","A6. Number of Units Developed, Rehabilitated, or Preserved (this period)","A6. Number of Housing Units Receiving Rapid-Rehousing Assistance (this period)","A6. Number of Housing Units Receiving Rental Assistance (this period)","A6. Number of Housing Units Receiving Supportive/Case Management Services(this period)","A6. Number of Housing Units Receiving Operating or Capital subsidy (this period)","A6. Number of Emergency Shelter Beds Supported (this period)","A6. Number of Permanent Units Developed, Rehabilitated or Preserved (this period)","A6. Number of Transitional Units Developed, Rehabilitated or Preserved (this period)","A6. Number of Persons Served (prior)","A6. Number of Persons assisted by Rapid Rehousing (prior)","A6. Number of Persons assisted by Rental Assistance (prior)","A6. Number of Persons assisted by Supportive/Case Management (prior)","A6. Number of Individuals to Exit to Homelessness (prior)","A6. Number of Individuals to Occupy Newly Constructed or Rehabilitated Permanent Housing (prior)","A6. Number of Individuals to Occupy Newly Constructed or Rehabilitated Transitional Housing (prior)","A6. Number of Seniors Assisted (65 and older) (prior)","A6. Number of Veterans Assisted (prior)","A6. Number of Disabled Persons Assisted (prior)","A6. Number of Families with Minor Children Assisted (prior)","A6. Number of Transition-Aged Youth (18-24) Assisted (prior)","A6. Number of Persons Served (this period)","A6. Number of Persons assisted by Rapid Rehousing (this period)","A6. Number of Persons assisted by Rental Assistance (this period)","A6. Number of Persons assisted by Supportive/Case Management (this period)","A6. Number of Individuals to Exit to Homelessness (this period)","A6. Number of Individuals to Occupy Newly Constructed or Rehabilitated Permanent Housing (this period)","A6. Number of Individuals to Occupy Newly Constructed or Rehabilitated Transitional Housing (this period)","A6. Number of Seniors Assisted (65 and older) (this period)","A6. Number of Veterans Assisted (this period)","A6. Number of Disabled Persons Assisted (this period)","A6. Number of Families with Minor Children Assisted (this period)","A6. Number of Transition-Aged Youth (18-24) Assisted (this period)","A7. Number of Units Rehabilitated by PLHA funds (prior)","A7. Number of Extremely Low- Income Units Rehabilitated\n(Max 30% AMI) (prior)","A7. Number of Very Low-Income Units Rehabilitated\n(Max 50% AMI) (prior)","A7. Total Number of Units at or below 60% AMI Rehabilitated (prior)","A7. Number of Low(er)-Income Units Rehabilitated (Max 80%AMI) (prior)","A7. Number of Units Rehabilitated by PLHA funds (this period)","A7. Number of Extremely Low- Income Units Rehabilitated\n(Max 30% AMI) (this period)","A7. Number of Very Low-Income Units Rehabilitated\n(Max 50% AMI) (this period)","A7. Total Number of Units at or below 60% AMI Rehabilitated (this period)","A7. Number of Low(er)-Income Units Rehabilitated (Max 80%AMI) (this period)","A7. Number of Individuals Served (prior)","A7.  Number of Households assisted (prior)","A7. Number of Seniors Assisted (65 and older) (prior)","A7. Number of Veterans Assisted (prior)","A7. Number of Disabled Persons Assisted (prior)","A7. Number of Families with Minor Children Assisted (prior)","A7. Number of Transition-Aged Youth (18-24) Assisted (prior)","A7. Number of Individuals Served (this period)","A7.  Number of Households assisted (this period)","A7. Number of Seniors Assisted (65 and older) (this period)","A7. Number of Veterans Assisted (this period)","A7. Number of Disabled Persons Assisted (this period)","A7. Number of Families with Minor Children Assisted (this period)","A7. Number of Transition-Aged Youth (18-24) Assisted (this period)","A8. Number of Units Acquired and Rehabilitated by PLHA funds (prior)","A8. Number of ADA-Accessible Units Acquired and Rehabilitated (prior)","A8. Number of Units Acquired and Rehabilitated for Formerly Homeless Individuals (prior)","A8. Number of Extremely Low- Income Units Acquired and Rehabilitated\n(Max 30% AMI) (prior)","A8. Number of Low-Income Units Acquired and Rehabilitated\n(Max 50% AMI) (prior)","A8. Total Number of Units at or below 60% AMI Acquired and Rehabilitated (prior)","A8. Number of Low(er)-Income Units Acquired and Rehabilitated (Max 80%AMI) (prior)","A8. Number of Moderate-Income Units Acquired and Rehabilitated\n(Max 120% AMI, or if in High Cost Area 150%) (prior)","A8. Number of Units Acquired and Rehabilitated by PLHA funds (this period)","A8. Number of ADA-Accessible Units Acquired and Rehabilitated (this period)","A8. Number of Units Acquired and Rehabilitated for Formerly Homeless Individuals (this period)","A8. Number of Extremely Low- Income Units Acquired and Rehabilitated\n(Max 30% AMI) (this period)","A8. Number of Low-Income Units Acquired and Rehabilitated\n(Max 50% AMI) (this period)","A8. Total Number of Units at or below 60% AMI Acquired and Rehabilitated (this period)","A8. Number of Low(er)-Income Units Acquired and Rehabilitated (Max 80%AMI) (this period)","A8. Number of Moderate-Income Units Acquired and Rehabilitated\n(Max 120% AMI, or if in High Cost Area 150%) (this period)","A8. Number of Individuals Occuping Projects (prior)","A8. Number of Households occupying the projects (prior)","A8. Seniors (65 and older) occupying the projects (prior)","A8. Veterans occupying the projects (prior)","A8. Disabled Persons occuping the projects (prior)","A8. Families with Minor Children occupying the projects (prior)","A8. Transition-Aged Youth (ages 18-24) occupying the projects (prior)","A8. Farmworkers occupying the projects (prior)","A8. Number of Individuals Occuping Projects (this period)","A8. Number of Households occupying the projects (this period)","A8. Seniors (65 and older) occupying the projects (this period)","A8. Veterans occupying the projects (this period)","A8. Disabled Persons occuping the projects (this period)","A8. Families with Minor Children occupying the projects (this period)","A8. Transition-Aged Youth (ages 18-24) occupying the projects (this period)","A8. Farmworkers occupying the projects (this period)","A9. Number of Units Assisted (prior)","A9. Number of Extremely Low- Income Households Assisted\n(Max 30% AMI) (prior)","A9. Number of Very Low-Income Households Assisted\n(Max 50% AMI) (prior)","A9. Number of Households at or below 60% AMI Assisted (prior)","A9. Number of Low(er)-Income Households Assisted (Max 80%AMI) (prior)","A9. Number of Moderate-Income Households Assisted\n(Max 120% AMI, or if in High Cost Area 150%) (prior)","A9. Number of Units Assisted (this period)","A9. Number of Extremely Low- Income Households Assisted\n(Max 30% AMI) (this period)","A9. Number of Very Low-Income Households Assisted\n(Max 50% AMI) (this period)","A9. Number of Households at or below 60% AMI Assisted (this period)","A9. Number of Low(er)-Income Households Assisted (Max 80%AMI) (this period)","A9. Number of Moderate-Income Households Assisted\n(Max 120% AMI, or if in High Cost Area 150%) (this period)","A9. Number of Individuals Assisted (prior)","A9. Number of Seniors (65 and older) Assisted (prior)","A9. Number of Veterans Assisted (prior)","A9. Number of Disabled Persons Assisted (prior)","A9. Number of Families with Minor Children Assisted (prior)","A9. Number of Transition-Aged Youth (ages 18-24) Assisted (prior)","A9. Number of Farmworkers Assisted (prior)","A9. Number of Individuals Assisted (this period)","A9. Number of Seniors (65 and older) Assisted (this period)","A9. Number of Veterans Assisted (this period)","A9. Number of Disabled Persons Assisted (this period)","A9. Number of Families with Minor Children Assisted (this period)","A9. Number of Transition-Aged Youth (ages 18-24) Assisted (this period)","A9. Number of Farmworkers Assisted (this period)","A10. Number of Units Developed, Rehabilitated, or Preserved (prior)","A10. Number of ADA Accessible Units Developed, Rehabilitated or Preserved (prior)","A10. Number of Units Developed, Rehabilitated or Preserved for Formerly Homeless Individuals (prior)","A10. Number of Extremely Low- Income Units Developed, Rehabilitated or Preserved\n(Max 30% AMI) (prior)","A10 Number of Very Low-Income Units Developed, Rehabilitated or Preserved\n(Max 50% AMI) (prior)","A10 Total Number of Units at or below 60% AMI Developed, Rehabilitated or Preserved (prior)","A10. Number of Low(er)-Income Units Developed, Rehabilitated or Preserved (Max 80% AMI) (prior)","A10. Number of Moderate-Income Units Developed, Rehabilitated or Preserved\n(Max 120% AMI, or if in High Cost Area 150%) (prior)","A10. Number of Units Developed, Rehabilitated, or Preserved (this period)","A10. Number of ADA Accessible Units Developed, Rehabilitated or Preserved (this period)","A10. Number of Units Developed, Rehabilitated or Preserved for Formerly Homeless Individuals (this period)","A10. Number of Extremely Low- Income Units Developed, Rehabilitated or Preserved\n(Max 30% AMI) (this period)","A10 Number of Very Low-Income Units Developed, Rehabilitated or Preserved\n(Max 50% AMI) (this period)","A10 Total Number of Units at or below 60% AMI Developed, Rehabilitated or Preserved (this period)","A10. Number of Low(er)-Income Units Developed, Rehabilitated or Preserved (Max 80% AMI) (this period)","A10. Number of Moderate-Income Units Developed, Rehabilitated or Preserved\n(Max 120% AMI, or if in High Cost Area 150%) (this period)","A10. Number of Individuals Occuping Projects (prior)","A10. Number of Households occupying the projects (prior)","A10. Seniors (65 and older) occupying the projects (prior)","A10. Veterans occupying the projects (prior)","A10. Disabled Persons occuping the projects (prior)","A10. Families with Minor Children occupying the projects (prior)","A10. Transition-Aged Youth (ages 18-24) occupying the projects (prior)","A10. Farmworkers occupying the projects (prior)","A10. Number of Individuals Occuping Projects (this period)","A10. Number of Households occupying the projects (this period)","A10. Seniors (65 and older) occupying the projects (this period)","A10. Veterans occupying the projects (this period)","A10. Disabled Persons occuping the projects (this period)","A10. Families with Minor Children occupying the projects (this period)","A10. Transition-Aged Youth (ages 18-24) occupying the projects (this period)","A10. Farmworkers occupying the projects (this period)","CA1. Number of Units Developed, Rehabilitated, or Preserved (prior)","CA1. Number of ADA Accessible Units Developed, Rehabilitated or Preserved (prior)","CA1. Number of Units Developed, Rehabilitated or Preserved for Formerly Homeless Individuals (prior)","CA1. Number of Extremely Low- Income Units Developed, Rehabilitated or Preserved\n(Max 30% AMI) (prior)","CA1. Number of Very Low-Income Units Developed, Rehabilitated or Preserved\n(Max 50% AMI) (prior)","CA1. Number of Units Developed, Rehabilitated, or Preserved (this period)","CA1. Number of ADA Accessible Units Developed, Rehabilitated or Preserved (this period)","CA1. Number of Units Developed, Rehabilitated or Preserved for Formerly Homeless Individuals (this period)","CA1. Number of Extremely Low- Income Units Developed, Rehabilitated or Preserved\n(Max 30% AMI) (this period)","CA1. Number of Very Low-Income Units Developed, Rehabilitated or Preserved\n(Max 50% AMI) (this period)","CA1. Number of Individuals Occuping Projects (prior)","CA1. Number of Households occupying the projects (prior)","CA1. Seniors (65 and older) occupying the projects (prior)","CA1. Veterans occupying the projects (prior)","CA1. Disabled Persons occuping the projects (prior)","CA1. Families with Minor Children occupying the projects (prior)","CA1. Transition-Aged Youth (ages 18-24) occupying the projects (prior)","CA1. Farmworkers occupying the projects (prior)","CA1. Number of Individuals Occuping Projects (this period)","CA1. Number of Households occupying the projects (this period)","CA1. Seniors (65 and older) occupying the projects (this period)","CA1. Veterans occupying the projects (this period)","CA1. Disabled Persons occuping the projects (this period)","CA1. Families with Minor Children occupying the projects (this period)","CA1. Transition-Aged Youth (ages 18-24) occupying the projects (this period)","CA1. Farmworkers occupying the projects (this period)","CA2. Number of Housing Units Assisted (prior)","CA2. Number of Housing Units Receiving Rapid-Rehousing Assistance (prior)","CA2. Number of Housing Units Receiving Rental Assistance (prior)","CA2. Number of Housing Units Receiving Supportive/Case Management Services (prior)","CA2. Number of Units Receiving Operating or Capital subsidy (prior)","CA2. Number of Transitional Units Developed, Rehabilitated or Preserved (prior)","CA2. Number of Permanent Units Developed, Rehabilitated or Preserved (prior)","CA2. Number of Housing Units Assisted (this period)","CA2. Number of Housing Units Receiving Rapid-Rehousing Assistance (this period)","CA2. Number of Housing Units Receiving Rental Assistance (this period)","CA2. Number of Housing Units Receiving Supportive/Case Management Services (this period)","CA2. Number of Units Receiving Operating or Capital subsidy (this period)","CA2. Number of Transitional Units Developed, Rehabilitated or Preserved (this period)","CA2. Number of Permanent Units Developed, Rehabilitated or Preserved (this period)","CA2. Number of Persons Assisted (prior)","CA2. Number of Persons assisted by Rapid Rehousing (prior)","CA2. Number of Persons assisted by Rental Assistance (prior)","CA2. Number of Persons assisted by Supportive/Case Management (prior)","CA2. Total Unduplicated persons assisted by project (prior)","CA2. Number of Individuals to Occupy Newly Constructed or Rehabilitated Transitional Housing (prior)","CA2. Number of Individuals to Occupy Newly Constructed or Rehabilitated Permanent Housing (prior)","CA2. Number of Seniors Assisted (65 and older) (prior)","CA2. Number of Veterans Assisted (prior)","CA2. Number of Disabled Persons Assisted (prior)","CA2. Number of Families with Minor Children Assisted (prior)","CA2. Number of Transition-Aged Youth (18-24) Assisted (prior)","CA2. Number of Persons Assisted (this period)","CA2. Number of Persons assisted by Rapid Rehousing (this period)","CA2. Number of Persons assisted by Rental Assistance (this period)","CA2. Number of Persons assisted by Supportive/Case Management (this period)","CA2. Total Unduplicated persons assisted by project (this period)","CA2. Number of Individuals to Occupy Newly Constructed or Rehabilitated Transitional Housing (this period)","CA2. Number of Individuals to Occupy Newly Constructed or Rehabilitated Permanent Housing (this period)","CA2. Number of Seniors Assisted (65 and older) (this period)","CA2. Number of Veterans Assisted (this period)","CA2. Number of Disabled Persons Assisted (this period)","CA2. Number of Families with Minor Children Assisted (this period)","CA2. Number of Transition-Aged Youth (18-24) Assisted (this period)"]
[{"$f":"'1-Cover Sheet'!$F$8","v":"Select One"},{"$f":"'1-Cover Sheet'!C8","v":0},{"$f":"'1-Cover Sheet'!C9","v":0},{"$f":"'1-Cover Sheet'!C11","v":0},{"$f":"'1-Cover Sheet'!C10","v":0},{"$f":"'1-Cover Sheet'!F10","v":0},{"$f":"'1-Cover Sheet'!F11","v":"Select One"},{"$f":"'1-Cover Sheet'!F9","v":0},{"$f":"'Summary Sheet'!D8","v":0},{"$f":"'1-Cover Sheet'!C37","v":0},{"$f":"'1-Cover Sheet'!D37","v":0},{"$f":"'1-Cover Sheet'!E37","v":0},{"$f":"'1-Cover Sheet'!F37","v":0},{"$f":"'1-Cover Sheet'!G37","v":0},{"$f":"SUM(J2:N2)","v":0},{"$f":"SUM('1-Cover Sheet'!C35:G35)","v":0},{"$f":"'1-Cover Sheet'!C38","v":0},{"$f":"'1-Cover Sheet'!D38","v":0},{"$f":"'1-Cover Sheet'!E38","v":0},{"$f":"'1-Cover Sheet'!F38","v":0},{"$f":"'1-Cover Sheet'!G38","v":0},{"$f":"SUM(Q2:U2)","v":0},{"$f":"'1-Cover Sheet'!C39","v":0},{"$f":"'1-Cover Sheet'!D39","v":0},{"$f":"'1-Cover Sheet'!E39","v":0},{"$f":"'1-Cover Sheet'!F39","v":0},{"$f":"'1-Cover Sheet'!G39","v":0},{"$f":"SUM(W2:AA2)","v":0},{"$f":"'Summary Sheet'!J20","v":"Formula Grantee is Eligible for Pending Allocation"},{"$f":"'3-Financial Summary'!E22","v":0},{"$f":"'3-Financial Summary'!$C$8","v":0},{"$f":"'2-Narrative Summary'!C13","v":0},{"$f":"'2-Narrative Summary'!G13","v":0},{"$f":"'2-Narrative Summary'!C14","v":0},{"$f":"IF('1-Cover Sheet'!$H$15>0,\"Yes\",\"No\")","v":"No"},{"$f":"'1-Cover Sheet'!$H$15","v":0},{"$f":"'1-Cover Sheet'!C15","v":0},{"$f":"'1-Cover Sheet'!C16","v":0},{"$f":"'1-Cover Sheet'!D15","v":0},{"$f":"'1-Cover Sheet'!D16","v":0},{"$f":"'1-Cover Sheet'!E15","v":0},{"$f":"'1-Cover Sheet'!E16","v":0},{"$f":"'1-Cover Sheet'!F15","v":0},{"$f":"'1-Cover Sheet'!F16","v":0},{"$f":"'1-Cover Sheet'!G15","v":0},{"$f":"'1-Cover Sheet'!G16","v":0},{"$f":"IF('1-Cover Sheet'!$H$17>0,\"Yes\",\"No\")","v":"No"},{"$f":"'1-Cover Sheet'!$H$17","v":0},{"$f":"'1-Cover Sheet'!C17","v":0},{"$f":"'1-Cover Sheet'!C18","v":0},{"$f":"'1-Cover Sheet'!D17","v":0},{"$f":"'1-Cover Sheet'!D18","v":0},{"$f":"'1-Cover Sheet'!E17","v":0},{"$f":"'1-Cover Sheet'!E18","v":0},{"$f":"'1-Cover Sheet'!F17","v":0},{"$f":"'1-Cover Sheet'!F18","v":0},{"$f":"'1-Cover Sheet'!G17","v":0},{"$f":"'1-Cover Sheet'!G18","v":0},{"$f":"IF('1-Cover Sheet'!$H$19>0,\"Yes\",\"No\")","v":"No"},{"$f":"'1-Cover Sheet'!$H$19","v":0},{"$f":"'1-Cover Sheet'!C19","v":0},{"$f":"'1-Cover Sheet'!C20","v":0},{"$f":"'1-Cover Sheet'!D19","v":0},{"$f":"'1-Cover Sheet'!D20","v":0},{"$f":"'1-Cover Sheet'!E19","v":0},{"$f":"'1-Cover Sheet'!E20","v":0},{"$f":"'1-Cover Sheet'!F19","v":0},{"$f":"'1-Cover Sheet'!F20","v":0},{"$f":"'1-Cover Sheet'!G19","v":0},{"$f":"'1-Cover Sheet'!G20","v":0},{"$f":"IF('1-Cover Sheet'!$H$21>0,\"Yes\",\"No\")","v":"No"},{"$f":"'1-Cover Sheet'!$H$21","v":0},{"$f":"'1-Cover Sheet'!C21","v":0},{"$f":"'1-Cover Sheet'!C22","v":0},{"$f":"'1-Cover Sheet'!D21","v":0},{"$f":"'1-Cover Sheet'!D22","v":0},{"$f":"'1-Cover Sheet'!E21","v":0},{"$f":"'1-Cover Sheet'!E22","v":0},{"$f":"'1-Cover Sheet'!F21","v":0},{"$f":"'1-Cover Sheet'!F22","v":0},{"$f":"'1-Cover Sheet'!G21","v":0},{"$f":"'1-Cover Sheet'!G22","v":0},{"$f":"IF('1-Cover Sheet'!$H$23>0,\"Yes\",\"No\")","v":"No"},{"$f":"'1-Cover Sheet'!$H$23","v":0},{"$f":"'1-Cover Sheet'!C23","v":0},{"$f":"'1-Cover Sheet'!C24","v":0},{"$f":"'1-Cover Sheet'!D23","v":0},{"$f":"'1-Cover Sheet'!D24","v":0},{"$f":"'1-Cover Sheet'!E23","v":0},{"$f":"'1-Cover Sheet'!E24","v":0},{"$f":"'1-Cover Sheet'!F23","v":0},{"$f":"'1-Cover Sheet'!F24","v":0},{"$f":"'1-Cover Sheet'!G23","v":0},{"$f":"'1-Cover Sheet'!G24","v":0},{"$f":"IF('1-Cover Sheet'!$H$25>0,\"Yes\",\"No\")","v":"No"},{"$f":"'1-Cover Sheet'!$H$25","v":0},{"$f":"'1-Cover Sheet'!C25","v":0},{"$f":"'1-Cover Sheet'!C26","v":0},{"$f":"'1-Cover Sheet'!D25","v":0},{"$f":"'1-Cover Sheet'!D26","v":0},{"$f":"'1-Cover Sheet'!E25","v":0},{"$f":"'1-Cover Sheet'!E26","v":0},{"$f":"'1-Cover Sheet'!F25","v":0},{"$f":"'1-Cover Sheet'!F26","v":0},{"$f":"'1-Cover Sheet'!G25","v":0},{"$f":"'1-Cover Sheet'!G26","v":0},{"$f":"IF('1-Cover Sheet'!$H$27>0,\"Yes\",\"No\")","v":"No"},{"$f":"'1-Cover Sheet'!$H$27","v":0},{"$f":"'1-Cover Sheet'!C27","v":0},{"$f":"'1-Cover Sheet'!C28","v":0},{"$f":"'1-Cover Sheet'!D27","v":0},{"$f":"'1-Cover Sheet'!D28","v":0},{"$f":"'1-Cover Sheet'!E27","v":0},{"$f":"'1-Cover Sheet'!E28","v":0},{"$f":"'1-Cover Sheet'!F27","v":0},{"$f":"'1-Cover Sheet'!F28","v":0},{"$f":"'1-Cover Sheet'!G27","v":0},{"$f":"'1-Cover Sheet'!G28","v":0},{"$f":"IF('1-Cover Sheet'!$H$29>0,\"Yes\",\"No\")","v":"No"},{"$f":"'1-Cover Sheet'!$H$29","v":0},{"$f":"'1-Cover Sheet'!C29","v":0},{"$f":"'1-Cover Sheet'!C30","v":0},{"$f":"'1-Cover Sheet'!D29","v":0},{"$f":"'1-Cover Sheet'!D30","v":0},{"$f":"'1-Cover Sheet'!E29","v":0},{"$f":"'1-Cover Sheet'!E30","v":0},{"$f":"'1-Cover Sheet'!F29","v":0},{"$f":"'1-Cover Sheet'!F30","v":0},{"$f":"'1-Cover Sheet'!G29","v":0},{"$f":"'1-Cover Sheet'!G30","v":0},{"$f":"IF('1-Cover Sheet'!$H$31>0,\"Yes\",\"No\")","v":"No"},{"$f":"'1-Cover Sheet'!$H$31","v":0},{"$f":"'1-Cover Sheet'!C31","v":0},{"$f":"'1-Cover Sheet'!C32","v":0},{"$f":"'1-Cover Sheet'!D31","v":0},{"$f":"'1-Cover Sheet'!D32","v":0},{"$f":"'1-Cover Sheet'!E31","v":0},{"$f":"'1-Cover Sheet'!E32","v":0},{"$f":"'1-Cover Sheet'!F31","v":0},{"$f":"'1-Cover Sheet'!F32","v":0},{"$f":"'1-Cover Sheet'!G31","v":0},{"$f":"'1-Cover Sheet'!G32","v":0},{"$f":"IF('1-Cover Sheet'!$H$33>0,\"Yes\",\"No\")","v":"No"},{"$f":"'1-Cover Sheet'!$H$33","v":0},{"$f":"'1-Cover Sheet'!C33","v":0},{"$f":"'1-Cover Sheet'!C34","v":0},{"$f":"'1-Cover Sheet'!D33","v":0},{"$f":"'1-Cover Sheet'!D34","v":0},{"$f":"'1-Cover Sheet'!E33","v":0},{"$f":"'1-Cover Sheet'!E34","v":0},{"$f":"'1-Cover Sheet'!F33","v":0},{"$f":"'1-Cover Sheet'!F34","v":0},{"$f":"'1-Cover Sheet'!G33","v":0},{"$f":"'1-Cover Sheet'!G34","v":0},{"$f":"'1-Cover Sheet'!B42","v":"Please Select One"},{"$f":"'1-Cover Sheet'!C42","v":0},{"$f":"'1-Cover Sheet'!B44","v":"Please Select One"},{"$f":"'1-Cover Sheet'!C44","v":"Please Select One"},{"$f":"'1-Cover Sheet'!C49","v":0},{"$f":"'1-Cover Sheet'!C47","v":"Please Select One"},{"$f":"'1-Cover Sheet'!C48","v":"Please Select One"},{"$f":"'2-Narrative Summary'!A6","v":0},{"$f":"'2-Narrative Summary'!A8","v":0},{"$f":"'2-Narrative Summary'!A10","v":0},{"$f":"'2-Narrative Summary'!A12","v":0},{"$f":"'2-Narrative Summary'!A16","v":0},{"$f":"'2-Narrative Summary'!A31","v":0},{"$f":"'Activity 1'!E29","v":0},{"$f":"'Activity 1'!E30","v":0},{"$f":"'Activity 1'!E31","v":0},{"$f":"'Activity 1'!E32","v":0},{"$f":"'Activity 1'!E33","v":0},{"$f":"'Activity 1'!E34","v":0},{"$f":"'Activity 1'!E35","v":0},{"$f":"'Activity 1'!E36","v":0},{"$f":"'Activity 1'!F29","v":0},{"$f":"'Activity 1'!F30","v":0},{"$f":"'Activity 1'!F31","v":0},{"$f":"'Activity 1'!F32","v":0},{"$f":"'Activity 1'!F33","v":0},{"$f":"'Activity 1'!F34","v":0},{"$f":"'Activity 1'!F35","v":0},{"$f":"'Activity 1'!F36","v":0},{"$f":"'Activity 1'!K29","v":0},{"$f":"'Activity 1'!K30","v":0},{"$f":"'Activity 1'!K31","v":0},{"$f":"'Activity 1'!K32","v":0},{"$f":"'Activity 1'!K33","v":0},{"$f":"'Activity 1'!K34","v":0},{"$f":"'Activity 1'!K35","v":0},{"$f":"'Activity 1'!K36","v":0},{"$f":"'Activity 1'!L29","v":0},{"$f":"'Activity 1'!L30","v":0},{"$f":"'Activity 1'!L31","v":0},{"$f":"'Activity 1'!L32","v":0},{"$f":"'Activity 1'!L33","v":0},{"$f":"'Activity 1'!L34","v":0},{"$f":"'Activity 1'!L35","v":0},{"$f":"'Activity 1'!L36","v":0},{"$f":"'Activity 2'!E29","v":0},{"$f":"'Activity 2'!E30","v":0},{"$f":"'Activity 2'!E31","v":0},{"$f":"'Activity 2'!E32","v":0},{"$f":"'Activity 2'!E33","v":0},{"$f":"'Activity 2'!E34","v":0},{"$f":"'Activity 2'!E35","v":0},{"$f":"'Activity 2'!E36","v":0},{"$f":"'Activity 2'!F29","v":0},{"$f":"'Activity 2'!F30","v":0},{"$f":"'Activity 2'!F31","v":0},{"$f":"'Activity 2'!F32","v":0},{"$f":"'Activity 2'!F33","v":0},{"$f":"'Activity 2'!F34","v":0},{"$f":"'Activity 2'!F35","v":0},{"$f":"'Activity 2'!F36","v":0},{"$f":"'Activity 2'!K29","v":0},{"$f":"'Activity 2'!K30","v":0},{"$f":"'Activity 2'!K31","v":0},{"$f":"'Activity 2'!K32","v":0},{"$f":"'Activity 2'!K33","v":0},{"$f":"'Activity 2'!K34","v":0},{"$f":"'Activity 2'!K35","v":0},{"$f":"'Activity 2'!K36","v":0},{"$f":"'Activity 2'!L29","v":0},{"$f":"'Activity 2'!L30","v":0},{"$f":"'Activity 2'!L31","v":0},{"$f":"'Activity 2'!L32","v":0},{"$f":"'Activity 2'!L33","v":0},{"$f":"'Activity 2'!L34","v":0},{"$f":"'Activity 2'!L35","v":0},{"$f":"'Activity 2'!L36","v":0},{"$f":"'Activity 3'!D20","v":0},{"$f":"'Activity 3'!D21","v":0},{"$f":"'Activity 3'!D22","v":0},{"$f":"'Activity 3'!D23","v":0},{"$f":"'Activity 3'!E20","v":0},{"$f":"'Activity 3'!E21","v":0},{"$f":"'Activity 3'!E22","v":0},{"$f":"'Activity 3'!E23","v":0},{"$f":"'Activity 3'!H20","v":0},{"$f":"'Activity 3'!I20","v":0},{"$f":"'Activity 4'!C20","v":0},{"$f":"'Activity 4'!C21","v":0},{"$f":"'Activity 4'!C22","v":0},{"$f":"'Activity 4'!D20","v":0},{"$f":"'Activity 4'!D21","v":0},{"$f":"'Activity 4'!D22","v":0},{"$f":"'Activity 4'!F20","v":0},{"$f":"'Activity 4'!G20","v":0},{"$f":"'Activity 5'!D22","v":0},{"$f":"'Activity 5'!D23","v":0},{"$f":"'Activity 5'!D24","v":0},{"$f":"'Activity 5'!E22","v":0},{"$f":"'Activity 5'!E23","v":0},{"$f":"'Activity 5'!E24","v":0},{"$f":"'Activity 5'!I22","v":0},{"$f":"'Activity 5'!J22","v":0},{"$f":"'Activity 6'!E47","v":0},{"$f":"'Activity 6'!E48","v":0},{"$f":"'Activity 6'!E49","v":0},{"$f":"'Activity 6'!E50","v":0},{"$f":"'Activity 6'!E51","v":0},{"$f":"'Activity 6'!E52","v":0},{"$f":"'Activity 6'!E53","v":0},{"$f":"'Activity 6'!E54","v":0},{"$f":"'Activity 6'!F47","v":0},{"$f":"'Activity 6'!F48","v":0},{"$f":"'Activity 6'!F49","v":0},{"$f":"'Activity 6'!F50","v":0},{"$f":"'Activity 6'!F51","v":0},{"$f":"'Activity 6'!F52","v":0},{"$f":"'Activity 6'!F53","v":0},{"$f":"'Activity 6'!F54","v":0},{"$f":"'Activity 6'!K47","v":0},{"$f":"'Activity 6'!K48","v":0},{"$f":"'Activity 6'!K49","v":0},{"$f":"'Activity 6'!K50","v":0},{"$f":"'Activity 6'!K51","v":0},{"$f":"'Activity 6'!K52","v":0},{"$f":"'Activity 6'!K53","v":0},{"$f":"'Activity 6'!K54","v":0},{"$f":"'Activity 6'!K55","v":0},{"$f":"'Activity 6'!K56","v":0},{"$f":"'Activity 6'!K57","v":0},{"$f":"'Activity 6'!K58","v":0},{"$f":"'Activity 6'!L47","v":0},{"$f":"'Activity 6'!L48","v":0},{"$f":"'Activity 6'!L49","v":0},{"$f":"'Activity 6'!L50","v":0},{"$f":"'Activity 6'!L51","v":0},{"$f":"'Activity 6'!L52","v":0},{"$f":"'Activity 6'!L53","v":0},{"$f":"'Activity 6'!L54","v":0},{"$f":"'Activity 6'!L55","v":0},{"$f":"'Activity 6'!L56","v":0},{"$f":"'Activity 6'!L57","v":0},{"$f":"'Activity 6'!L58","v":0},{"$f":"'Activity 7'!E29","v":0},{"$f":"'Activity 7'!E30","v":0},{"$f":"'Activity 7'!E31","v":0},{"$f":"'Activity 7'!E32","v":0},{"$f":"'Activity 7'!E33","v":0},{"$f":"'Activity 7'!F29","v":0},{"$f":"'Activity 7'!F30","v":0},{"$f":"'Activity 7'!F31","v":0},{"$f":"'Activity 7'!F32","v":0},{"$f":"'Activity 7'!F33","v":0},{"$f":"'Activity 7'!L29","v":0},{"$f":"'Activity 7'!L30","v":0},{"$f":"'Activity 7'!L31","v":0},{"$f":"'Activity 7'!L32","v":0},{"$f":"'Activity 7'!L33","v":0},{"$f":"'Activity 7'!L34","v":0},{"$f":"'Activity 7'!L35","v":0},{"$f":"'Activity 7'!M29","v":0},{"$f":"'Activity 7'!M30","v":0},{"$f":"'Activity 7'!M31","v":0},{"$f":"'Activity 7'!M32","v":0},{"$f":"'Activity 7'!M33","v":0},{"$f":"'Activity 7'!M34","v":0},{"$f":"'Activity 7'!M35","v":0},{"$f":"'Activity 8'!E29","v":0},{"$f":"'Activity 8'!E30","v":0},{"$f":"'Activity 8'!E31","v":0},{"$f":"'Activity 8'!E32","v":0},{"$f":"'Activity 8'!E33","v":0},{"$f":"'Activity 8'!E34","v":0},{"$f":"'Activity 8'!E35","v":0},{"$f":"'Activity 8'!E36","v":0},{"$f":"'Activity 8'!F29","v":0},{"$f":"'Activity 8'!F30","v":0},{"$f":"'Activity 8'!F31","v":0},{"$f":"'Activity 8'!F32","v":0},{"$f":"'Activity 8'!F33","v":0},{"$f":"'Activity 8'!F34","v":0},{"$f":"'Activity 8'!F35","v":0},{"$f":"'Activity 8'!F36","v":0},{"$f":"'Activity 8'!L29","v":0},{"$f":"'Activity 8'!L30","v":0},{"$f":"'Activity 8'!L31","v":0},{"$f":"'Activity 8'!L32","v":0},{"$f":"'Activity 8'!L33","v":0},{"$f":"'Activity 8'!L34","v":0},{"$f":"'Activity 8'!L35","v":0},{"$f":"'Activity 8'!L36","v":0},{"$f":"'Activity 8'!M29","v":0},{"$f":"'Activity 8'!M30","v":0},{"$f":"'Activity 8'!M31","v":0},{"$f":"'Activity 8'!M32","v":0},{"$f":"'Activity 8'!M33","v":0},{"$f":"'Activity 8'!M34","v":0},{"$f":"'Activity 8'!M35","v":0},{"$f":"'Activity 8'!M36","v":0},{"$f":"'Activity 9'!E29","v":0},{"$f":"'Activity 9'!E30","v":0},{"$f":"'Activity 9'!E31","v":0},{"$f":"'Activity 9'!E32","v":0},{"$f":"'Activity 9'!E33","v":0},{"$f":"'Activity 9'!E34","v":0},{"$f":"'Activity 9'!F29","v":0},{"$f":"'Activity 9'!F30","v":0},{"$f":"'Activity 9'!F31","v":0},{"$f":"'Activity 9'!F32","v":0},{"$f":"'Activity 9'!F33","v":0},{"$f":"'Activity 9'!F34","v":0},{"$f":"'Activity 9'!L29","v":0},{"$f":"'Activity 9'!L30","v":0},{"$f":"'Activity 9'!L31","v":0},{"$f":"'Activity 9'!L32","v":0},{"$f":"'Activity 9'!L33","v":0},{"$f":"'Activity 9'!L34","v":0},{"$f":"'Activity 9'!L35","v":0},{"$f":"'Activity 9'!M29","v":0},{"$f":"'Activity 9'!M30","v":0},{"$f":"'Activity 9'!M31","v":0},{"$f":"'Activity 9'!M32","v":0},{"$f":"'Activity 9'!M33","v":0},{"$f":"'Activity 9'!M34","v":0},{"$f":"'Activity 9'!M35","v":0},{"$f":"'Activity 10'!E29","v":0},{"$f":"'Activity 10'!E30","v":0},{"$f":"'Activity 10'!E31","v":0},{"$f":"'Activity 10'!E32","v":0},{"$f":"'Activity 10'!E33","v":0},{"$f":"'Activity 10'!E34","v":0},{"$f":"'Activity 10'!E35","v":0},{"$f":"'Activity 10'!E36","v":0},{"$f":"'Activity 10'!F29","v":0},{"$f":"'Activity 10'!F30","v":0},{"$f":"'Activity 10'!F31","v":0},{"$f":"'Activity 10'!F32","v":0},{"$f":"'Activity 10'!F33","v":0},{"$f":"'Activity 10'!F34","v":0},{"$f":"'Activity 10'!F35","v":0},{"$f":"'Activity 10'!F36","v":0},{"$f":"'Activity 10'!L29","v":0},{"$f":"'Activity 10'!L30","v":0},{"$f":"'Activity 10'!L31","v":0},{"$f":"'Activity 10'!L32","v":0},{"$f":"'Activity 10'!L33","v":0},{"$f":"'Activity 10'!L34","v":0},{"$f":"'Activity 10'!L35","v":0},{"$f":"'Activity 10'!L36","v":0},{"$f":"'Activity 10'!M29","v":0},{"$f":"'Activity 10'!M30","v":0},{"$f":"'Activity 10'!M31","v":0},{"$f":"'Activity 10'!M32","v":0},{"$f":"'Activity 10'!M33","v":0},{"$f":"'Activity 10'!M34","v":0},{"$f":"'Activity 10'!M35","v":0},{"$f":"'Activity 10'!M36","v":0},{"$f":"'Competitive Activity 1'!E29","v":0},{"$f":"'Competitive Activity 1'!E30","v":0},{"$f":"'Competitive Activity 1'!E31","v":0},{"$f":"'Competitive Activity 1'!E32","v":0},{"$f":"'Competitive Activity 1'!E33","v":0},{"$f":"'Competitive Activity 1'!F29","v":0},{"$f":"'Competitive Activity 1'!F30","v":0},{"$f":"'Competitive Activity 1'!F31","v":0},{"$f":"'Competitive Activity 1'!F32","v":0},{"$f":"'Competitive Activity 1'!F33","v":0},{"$f":"'Competitive Activity 1'!L29","v":0},{"$f":"'Competitive Activity 1'!L30","v":0},{"$f":"'Competitive Activity 1'!L31","v":0},{"$f":"'Competitive Activity 1'!L32","v":0},{"$f":"'Competitive Activity 1'!L33","v":0},{"$f":"'Competitive Activity 1'!L34","v":0},{"$f":"'Competitive Activity 1'!L35","v":0},{"$f":"'Competitive Activity 1'!L36","v":0},{"$f":"'Competitive Activity 1'!M29","v":0},{"$f":"'Competitive Activity 1'!M30","v":0},{"$f":"'Competitive Activity 1'!M31","v":0},{"$f":"'Competitive Activity 1'!M32","v":0},{"$f":"'Competitive Activity 1'!M33","v":0},{"$f":"'Competitive Activity 1'!M34","v":0},{"$f":"'Competitive Activity 1'!M35","v":0},{"$f":"'Competitive Activity 1'!M36","v":0},{"$f":"'Competitive Activity 2'!E41","v":0},{"$f":"'Competitive Activity 2'!E42","v":0},{"$f":"'Competitive Activity 2'!E43","v":0},{"$f":"'Competitive Activity 2'!E44","v":0},{"$f":"'Competitive Activity 2'!E45","v":0},{"$f":"'Competitive Activity 2'!E46","v":0},{"$f":"'Competitive Activity 2'!E47","v":0},{"$f":"'Competitive Activity 2'!F41","v":0},{"$f":"'Competitive Activity 2'!F42","v":0},{"$f":"'Competitive Activity 2'!F43","v":0},{"$f":"'Competitive Activity 2'!F44","v":0},{"$f":"'Competitive Activity 2'!F45","v":0},{"$f":"'Competitive Activity 2'!F46","v":0},{"$f":"'Competitive Activity 2'!F47","v":0},{"$f":"'Competitive Activity 2'!L41","v":0},{"$f":"'Competitive Activity 2'!L42","v":0},{"$f":"'Competitive Activity 2'!L43","v":0},{"$f":"'Competitive Activity 2'!L44","v":0},{"$f":"'Competitive Activity 2'!L45","v":0},{"$f":"'Competitive Activity 2'!L46","v":0},{"$f":"'Competitive Activity 2'!L47","v":0},{"$f":"'Competitive Activity 2'!L48","v":0},{"$f":"'Competitive Activity 2'!L49","v":0},{"$f":"'Competitive Activity 2'!L50","v":0},{"$f":"'Competitive Activity 2'!L51","v":0},{"$f":"'Competitive Activity 2'!L52","v":0},{"$f":"'Competitive Activity 2'!M41","v":0},{"$f":"'Competitive Activity 2'!M42","v":0},{"$f":"'Competitive Activity 2'!M43","v":0},{"$f":"'Competitive Activity 2'!M44","v":0},{"$f":"'Competitive Activity 2'!M45","v":0},{"$f":"'Competitive Activity 2'!M46","v":0},{"$f":"'Competitive Activity 2'!M47","v":0},{"$f":"'Competitive Activity 2'!M48","v":0},{"$f":"'Competitive Activity 2'!M49","v":0},{"$f":"'Competitive Activity 2'!M50","v":0},{"$f":"'Competitive Activity 2'!M51","v":0},{"$f":"'Competitive Activity 2'!M52","v":0}]

{"sheet":"Drop Down Box","index":20,"n_rows":352,"n_cols":5,"rows_kept":352,"cut":false,"hidden":true,"merged":[]}
["Reporting Period Due Date",null,null,null,"Jurisdictions"]
["Select One",null,null,null,"Select One"]
[null,null,null,null,"Alameda"]
[null,null,null,null,"Alameda County"]
["July 1, 2022- June 30, 2023, Due July 31, 2023",null,null,null,"Alhambra"]
["July 1, 2023- June 30, 2024, Due July 31, 2024",null,null,null,"Aliso Viejo"]
["July 1, 2024- June 30, 2025, Due July 31, 2025",null,null,null,"Alpine County"]
["July 1, 2025- June 30, 2026, Due July 31, 2026",null,null,null,"Alturas"]
["July 1, 2026- June 30, 2027, Due July 31, 2027",null,null,null,"Amador City"]
["July 1, 2027- June 30, 2028, Due July 31, 2028",null,null,null,"Amador County"]
["July 1, 2028- June 30, 2029, Due July 31, 2029",null,null,null,"American Canyon"]
["July 1, 2029- June 30, 2030, Due July 31, 2030",null,null,null,"Anaheim"]
[null,null,null,null,"Anderson"]
["Allocation Type","Project Type per Guidelines Section 301","Project Type per Guidelines Section 401",null,"Angels"]
["Select One","Select All that Apply","Select One",null,"Antioch"]
["Formula","Activity 1","Competitive Activity 1",null,"Apple Valley"]
["Competitive","Activity 2","Competitive Activity 2",null,"Arcata"]
[null,"Activity 3",null,null,"Artesia"]
[null,"Activity 4",null,null,"Arvin"]
[null,"Activity 5",null,null,"Atwater"]
[null,"Activity 6",null,null,"Auburn"]
[null,"Activity 7",null,null,"Avenal"]
[null,"Activity 8",null,null,"Bakersfield"]
[null,"Activity 9",null,null,"Baldwin Park"]
[null,"Activity 10",null,null,"Bellflower"]
[null,null,null,null,"Benicia"]
["Type of Loan",null,null,null,"Berkeley"]
["Construction Loan",null,null,null,"Biggs"]
["Permanent Financing Loan",null,null,null,"Bishop"]
["Both Const/Perm",null,null,null,"Blue Lake"]
[null,null,null,null,"Brawley"]
["Project Type's Guidelines 301 & 401","Sheet Reference",null,null,"Buena Park"]
["Select One","N/A",null,null,"Burbank"]
["1. Predevelopment, Development, Acquisition, Rehabilitation, and Preservation of Multifamily Rental Housing","Activity 1",null,null,"Butte County"]
["2. Predevelopment, Development, Acquisition, Rehabilitation, and Preservation of Affordable Rental and Ownership Housing Including ADU's/JDU's","Activity 2",null,null,"Calaveras County"]
["3. Matching Portion of Funds placed into Local or Regional HTF","Activity 3",null,null,"Calexico"]
["4. Matching Portion of Funds for Low and Moderate Income Housing Asset Fund","Activity 4",null,null,"Calimesa"]
["5. Capitalized Reserves for the Preservation and Creation of New Permanent Supportive Housing","Activity 5",null,null,"Calipatria"]
["6. Assisting Persons who are Experiencing or at Risk of Homelessness","Activity 6",null,null,"Calistoga"]
["7. Accessibility Modifications in Lower-Income and Owner-Occupied Housing","Activity 7",null,null,"Camarillo"]
["8. Acquiring and Rehabilitation of Foreclosed or Vacant Homes and Apartments","Activity 8",null,null,"Capitola"]
["9. Homeownership Opportunities","Activity 9",null,null,"Carlsbad"]
["10. Fiscal Incentives Made by a County to a City within the County in the Form of a Grant or Low-Interest Loan","Activity 10",null,null,"Carmel-by-the-Sea"]
["Development of New or Substantial Rehabilitation of Multi-Family Rental Housing at or Below 60% AMI","Competitive Activity 1",null,null,"Carson"]
["Assistance to Persons who are Homeless or at Risk of Becoming Homeless","Competitive Activity 2",null,null,"Cathedral City"]
["Property Type",null,null,null,"Cerritos"]
["Select One",null,null,null,"Chico"]
["Accessory Dwelling Units (ADU's)",null,null,null,"Chino"]
["Apartment",null,null,null,"Chino Hills"]
["Emergency Shelter",null,null,null,"Chowchilla"]
["Navigation Center",null,null,null,"Chula Vista"]
["Owner Occupied Housing",null,null,null,"Citrus Heights"]
["Permanent Supportive Housing",null,null,null,"Clearlake"]
["Rapid Rehousing",null,null,null,"Clovis City"]
["Rental Housing",null,null,null,"Coalinga"]
["Transitional Housing",null,null,null,"Colfax"]
[null,null,null,null,"Colusa"]
["Answer",null,null,null,"Colusa County"]
["Select One",null,null,null,"Compton"]
["Yes",null,null,null,"Concord"]
["No",null,null,null,"Contra Costa County"]
[null,null,null,null,"Corcoran"]
["Financial Incentive Type",null,null,null,"Corning"]
["Select One",null,null,null,"Corona"]
["Grant",null,null,null,"Costa Mesa"]
["Low-Interest Loan",null,null,null,"Crescent City"]
[null,null,null,null,"Cupertino City"]
["Matching Fund",null,null,null,"Daly City"]
["LHTF/RHTF",null,null,null,"Davis"]
["LMIHAF",null,null,null,"Del Norte County"]
[null,null,null,null,"Delano City"]
["Counties","High Cost? ",null,null,"Dinuba"]
["Alameda County","Yes",null,null,"Dixon"]
["Alpine County","No",null,null,"Dorris"]
["Amador County","No",null,null,"Dos Palos"]
["Butte County","Yes",null,null,"Downey"]
["Calaveras County","No",null,null,"Dunsmuir"]
["Colusa County","No",null,null,"El Cajon"]
["Contra Costa County","Yes",null,null,"El Centro"]
["Del Norte County","No",null,null,"El Centro (Colonia Only)"]
["El Dorado County","Under Review",null,null,"El Dorado County"]
["Fresno County","No",null,null,"El Monte"]
["Glenn County","No",null,null,"Elk Grove"]
["Humboldt County","No",null,null,"Encinitas"]
["Imperial County","Yes",null,null,"Escondido"]
["Inyo County","No",null,null,"Etna"]
["Kern County","No",null,null,"Eureka"]
["Kings County","No",null,null,"Exeter"]
["Lake County","No",null,null,"Fairfield"]
["Lassen County","No",null,null,"Farmersville"]
["Los Angeles County","Yes",null,null,"Ferndale"]
["Madera County","Yes",null,null,"Firebaugh"]
["Marin County","Yes",null,null,"Fontana"]
["Mariposa County","Yes",null,null,"Fort Bragg"]
["Mendocino County","Yes",null,null,"Fort Jones"]
["Merced County","Under Review",null,null,"Fortuna"]
["Modoc County","No",null,null,"Fountain Valley"]
["Mono County","No",null,null,"Fowler"]
["Monterey County","Yes",null,null,"Fremont"]
["Napa County","Yes",null,null,"Fresno"]
["Nevada County","No",null,null,"Fresno County"]
["Orange County","Yes",null,null,"Fullerton"]
["Placer County","Under Review",null,null,"Garden Grove"]
["Plumas County","No",null,null,"Gardena"]
["Riverside County","Yes",null,null,"Gilroy City"]
["Sacramento County","Under Review",null,null,"Glendale"]
["San Benito County","Yes",null,null,"Glendora City"]
["San Bernardino County","Yes",null,null,"Glenn County"]
["San Diego County","Yes",null,null,"Goleta"]
["San Francisco County","Yes",null,null,"Grass Valley"]
["San Joaquin County","Yes",null,null,"Greenfield"]
["San Luis Obispo County","Under Review",null,null,"Gridley"]
["San Mateo County","Yes",null,null,"Grover Beach"]
["Santa Barbara County","Yes",null,null,"Guadalupe"]
["Santa Clara County","Yes",null,null,"Gustine"]
["Santa Cruz County","Yes",null,null,"Hanford"]
["Shasta County","Yes",null,null,"Hawthorne"]
["Sierra County","No",null,null,"Hayward"]
["Siskiyou County","No",null,null,"Hemet"]
["Solano County","Under Review",null,null,"Hesperia"]
["Sonoma County","Yes",null,null,"Hidden Hills"]
["Stanislaus County","Yes",null,null,"Hollister"]
["Sutter County","No",null,null,"Holtville"]
["Tehama County","Yes",null,null,"Humboldt County"]
["Trinity County","No",null,null,"Huntington Beach"]
["Tulare County","Under Review",null,null,"Huntington Park"]
["Tuolumne County","No",null,null,"Huron"]
["Ventura County","Yes",null,null,"Imperial"]
["Yolo County","Under Review",null,null,"Imperial County"]
["Yuba County","No",null,null,"Indian Wells"]
[null,null,null,null,"Indio City"]
["Target Populations ",null,null,null,"Industry"]
["Families with Children",null,null,null,"Inglewood"]
["Formerly Homeless Persons",null,null,null,"Inyo County"]
["Seniors (65+)",null,null,null,"Ione"]
["Transition Age Youth (18-24)",null,null,null,"Irvine"]
["Veterans",null,null,null,"Jackson"]
["Disabled Persons",null,null,null,"Kern County"]
["Farmworkers",null,null,null,"King City"]
["Foster Youth",null,null,null,"Kings County"]
["Workforce",null,null,null,"La Habra"]
["No Specific Target Population",null,null,null,"La Mesa"]
["Other",null,null,null,"Laguna Niguel"]
[null,null,null,null,"Lake County"]
["Type of Project",null,null,null,"Lake Elsinore"]
["Select One",null,null,null,"Lake Forest"]
["Rental Housing Projects including Permanent Supportive Housing",null,null,null,"Lakeport"]
["Emergency Shelter or Transitional Housing",null,null,null,"Lakewood"]
["Homeownership Projects",null,null,null,"Lancaster"]
["ADU/JADU",null,null,null,"Lassen County"]
[null,null,null,null,"Lemoore"]
[null,null,null,null,"Lincoln"]
[null,null,null,null,"Lindsay"]
[null,null,null,null,"Live Oak"]
["Activity 8 Property Types",null,null,null,"Livermore"]
["Select One",null,null,null,"Livingston"]
["Multifamily Rental - Acquisition",null,null,null,"Lodi"]
["Multifamily Rental - Ownership",null,null,null,"Lompoc"]
["Single Family Home - Acquisition",null,null,null,"Long Beach"]
["Single Family Home - Ownership",null,null,null,"Loomis"]
["Mobile Home - Acquisition",null,null,null,"Los Angeles"]
["Mobile Home - Ownership",null,null,null,"Los Angeles County"]
["Manufactured - Acquisition",null,null,null,"Los Banos"]
["Manufactured - Ownership",null,null,null,"Loyalton"]
[null,null,null,null,"Lynwood"]
[null,null,null,null,"Madera"]
[null,null,null,null,"Madera County"]
[null,null,null,null,"Mammoth Lakes"]
[null,null,null,null,"Maricopa"]
[null,null,null,null,"Marin County"]
[null,null,null,null,"Marina"]
[null,null,null,null,"Mariposa County"]
[null,null,null,null,"Marysville"]
[null,null,null,null,"McFarland"]
[null,null,null,null,"Mendocino County"]
[null,null,null,null,"Menifee"]
[null,null,null,null,"Merced"]
[null,null,null,null,"Merced County"]
[null,null,null,null,"Milpitas City"]
[null,null,null,null,"Mission Viejo"]
[null,null,null,null,"Modesto"]
[null,null,null,null,"Modoc County"]
[null,null,null,null,"Mono County"]
[null,null,null,null,"Montague"]
[null,null,null,null,"Montebello"]
[null,null,null,null,"Monterey"]
[null,null,null,null,"Monterey County"]
[null,null,null,null,"Monterey Park"]
[null,null,null,null,"Moreno Valley"]
[null,null,null,null,"Mount Shasta"]
[null,null,null,null,"Mountain View"]
[null,null,null,null,"Napa City"]
[null,null,null,null,"Napa County"]
[null,null,null,null,"National City"]
[null,null,null,null,"Nevada City"]
[null,null,null,null,"Nevada County"]
[null,null,null,null,"Newport Beach"]
[null,null,null,null,"Norwalk"]
[null,null,null,null,"Oakland"]
[null,null,null,null,"Oceanside"]
[null,null,null,null,"Ontario"]
[null,null,null,null,"Orange"]
[null,null,null,null,"Orange County"]
[null,null,null,null,"Orange Cove"]
[null,null,null,null,"Orland"]
[null,null,null,null,"Oroville"]
[null,null,null,null,"Oxnard"]
[null,null,null,null,"Pacific Grove"]
[null,null,null,null,"Palm Desert"]
[null,null,null,null,"Palm Springs"]
[null,null,null,null,"Palmdale"]
[null,null,null,null,"Palo Alto"]
[null,null,null,null,"Palos Verdes Estates"]
[null,null,null,null,"Paradise"]
[null,null,null,null,"Paramount City"]
[null,null,null,null,"Parlier"]
[null,null,null,null,"Pasadena"]
[null,null,null,null,"Perris City"]
[null,null,null,null,"Petaluma"]
[null,null,null,null,"Pico Rivera"]
[null,null,null,null,"Pismo Beach"]
[null,null,null,null,"Pittsburg"]
[null,null,null,null,"Placentia"]
[null,null,null,null,"Placer County"]
[null,null,null,null,"Placerville"]
[null,null,null,null,"Pleasanton City"]
[null,null,null,null,"Plumas County"]
[null,null,null,null,"Plymouth"]
[null,null,null,null,"Point Arena"]
[null,null,null,null,"Pomona"]
[null,null,null,null,"Porterville"]
[null,null,null,null,"Portola"]
[null,null,null,null,"Rancho Cordova City"]
[null,null,null,null,"Rancho Cucamonga"]
[null,null,null,null,"Rancho Mirage"]
[null,null,null,null,"Rancho Santa Margarita"]
[null,null,null,null,"Red Bluff"]
[null,null,null,null,"Redding"]
[null,null,null,null,"Redondo Beach"]
[null,null,null,null,"Redwood City"]
[null,null,null,null,"Rialto"]
[null,null,null,null,"Rio Dell"]
[null,null,null,null,"Rio Vista"]
[null,null,null,null,"Riverbank"]
[null,null,null,null,"Riverside"]
[null,null,null,null,"Riverside County"]
[null,null,null,null,"Rocklin City"]
[null,null,null,null,"Rosemead"]
[null,null,null,null,"Roseville"]
[null,null,null,null,"Sacramento"]
[null,null,null,null,"Sacramento County"]
[null,null,null,null,"Salinas"]
[null,null,null,null,"San Benito County"]
[null,null,null,null,"San Bernardino"]
[null,null,null,null,"San Bernardino County"]
[null,null,null,null,"San Buenaventura"]
[null,null,null,null,"San Clemente"]
[null,null,null,null,"San Diego"]
[null,null,null,null,"San Diego County"]
[null,null,null,null,"San Francisco"]
[null,null,null,null,"San Joaquin"]
[null,null,null,null,"San Joaquin County"]
[null,null,null,null,"San Jose"]
[null,null,null,null,"San Juan Bautista"]
[null,null,null,null,"San Juan Capistrano"]
[null,null,null,null,"San Leandro"]
[null,null,null,null,"San Luis Obispo County"]
[null,null,null,null,"San Marcos City"]
[null,null,null,null,"San Mateo"]
[null,null,null,null,"San Mateo County"]
[null,null,null,null,"Sand City"]
[null,null,null,null,"Santa Ana"]
[null,null,null,null,"Santa Barbara"]
[null,null,null,null,"Santa Barbara County"]
[null,null,null,null,"Santa Clara"]
[null,null,null,null,"Santa Clara County"]
[null,null,null,null,"Santa Clarita"]
[null,null,null,null,"Santa Cruz"]
[null,null,null,null,"Santa Cruz County"]
[null,null,null,null,"Santa Maria"]
[null,null,null,null,"Santa Monica"]
[null,null,null,null,"Santa Rosa"]
[null,null,null,null,"Santee"]
[null,null,null,null,"Scotts Valley"]
[null,null,null,null,"Seaside"]
[null,null,null,null,"Shasta County"]
[null,null,null,null,"Shasta Lake"]
[null,null,null,null,"Sierra County"]
[null,null,null,null,"Simi Valley"]
[null,null,null,null,"Siskiyou County"]
[null,null,null,null,"Solano County"]
[null,null,null,null,"Soledad"]
[null,null,null,null,"Sonoma County"]
[null,null,null,null,"Sonora"]
[null,null,null,null,"South Gate"]
[null,null,null,null,"South Lake Tahoe"]
[null,null,null,null,"South San Francisco"]
[null,null,null,null,"St. Helena"]
[null,null,null,null,"Stanislaus County"]
[null,null,null,null,"Stockton"]
[null,null,null,null,"Suisun City"]
[null,null,null,null,"Sunnyvale"]
[null,null,null,null,"Susanville"]
[null,null,null,null,"Sutter County"]
[null,null,null,null,"Sutter Creek"]
[null,null,null,null,"Taft"]
[null,null,null,null,"Tehama"]
[null,null,null,null,"Tehama County"]
[null,null,null,null,"Temecula"]
[null,null,null,null,"Thousand Oaks"]
[null,null,null,null,"Torrance"]
[null,null,null,null,"Trinidad"]
[null,null,null,null,"Trinity County"]
[null,null,null,null,"Truckee"]
[null,null,null,null,"Tulare"]
[null,null,null,null,"Tulare County"]
[null,null,null,null,"Tulelake"]
[null,null,null,null,"Tuolumne County"]
[null,null,null,null,"Turlock"]
[null,null,null,null,"Tustin"]
[null,null,null,null,"Ukiah"]
[null,null,null,null,"Union City"]
[null,null,null,null,"Upland"]
[null,null,null,null,"Vacaville"]
[null,null,null,null,"Vallejo"]
[null,null,null,null,"Ventura County"]
[null,null,null,null,"Vernon"]
[null,null,null,null,"Victorville"]
[null,null,null,null,"Visalia"]
[null,null,null,null,"Vista"]
[null,null,null,null,"Walnut Creek"]
[null,null,null,null,"Wasco"]
[null,null,null,null,"Watsonville"]
[null,null,null,null,"Weed"]
[null,null,null,null,"West Covina"]
[null,null,null,null,"West Sacramento"]
[null,null,null,null,"Westminster"]
[null,null,null,null,"Westmorland"]
[null,null,null,null,"Wheatland"]
[null,null,null,null,"Whittier"]
[null,null,null,null,"Williams"]
[null,null,null,null,"Willits"]
[null,null,null,null,"Willows"]
[null,null,null,null,"Winters"]
[null,null,null,null,"Woodlake"]
[null,null,null,null,"Woodland"]
[null,null,null,null,"Yolo County"]
[null,null,null,null,"Yorba Linda"]
[null,null,null,null,"Yountville"]
[null,null,null,null,"Yreka"]
[null,null,null,null,"Yuba City"]
[null,null,null,null,"Yuba County"]