{"text_format":"1","workbook":"xlsx","n_sheets":2,"sheets":["Activity Funds Request Form","Validation"],"not_rendered":{"charts":0,"images":1,"macros":1,"external_links":0,"defined_names":2,"comments":1,"pivot_tables":0},"unopened":[],"bounds":{"document_bytes":16777216,"sheet_cells":100000,"rows_first":2000,"rows_last":500,"rows_between":2000,"halvings":0,"cell_chars":16384,"cell_head_chars":4096},"cells_cut":0,"cells_raw":0,"read":"whole","date_system":"1900"}

{"sheet":"Activity Funds Request Form","index":0,"n_rows":106,"n_cols":93,"rows_kept":106,"cut":false,"hidden":false,"merged":[[1,26,1,84],[28,26,29,40],[28,42,29,47],[1,86,55,88],[63,34,63,54],[63,55,63,58],[6,37,6,55],[6,56,6,60],[6,61,6,84],[63,59,63,82],[33,45,33,56],[61,65,62,77],[61,78,62,83],[16,35,16,42],[16,43,16,51],[18,42,18,47],[18,63,21,68],[18,70,21,75],[18,78,21,84],[16,52,16,61],[18,56,21,61],[23,70,23,75],[23,63,23,68],[16,63,16,80],[16,81,16,84],[25,56,25,61],[16,26,16,34],[65,58,65,65],[65,66,65,74],[5,66,5,70],[5,71,5,84],[64,34,64,49],[64,50,64,57],[64,58,64,84],[62,26,62,33],[62,34,62,54],[63,26,63,33],[65,26,65,32],[65,33,65,39],[65,40,65,47],[65,48,65,57],[59,48,59,51],[59,73,59,80],[59,52,59,70],[60,73,60,80],[59,26,59,34],[51,36,51,74],[38,55,38,62],[40,55,40,62],[45,55,45,62],[50,36,50,74],[48,28,48,61],[45,27,45,53],[36,63,36,84],[42,77,42,82],[42,64,42,74],[42,27,42,53],[36,27,36,53],[38,27,38,53],[40,27,40,53],[4,37,4,52],[4,26,4,36],[76,28,76,84],[7,26,7,36],[8,26,8,36],[8,37,8,84],[6,26,6,36],[5,26,5,42],[4,54,4,57],[4,58,4,84],[5,43,5,65],[7,66,7,71],[7,72,7,84],[7,37,7,65],[12,37,12,71],[12,26,12,36],[25,70,25,75],[31,26,31,62],[31,63,31,84],[33,64,33,74],[33,58,33,61],[33,76,33,83],[34,36,34,43],[51,34,51,35],[18,49,21,54],[25,63,25,68],[23,42,23,47],[23,56,23,61],[56,86,103,88],[65,78,66,84],[89,26,89,27],[89,28,91,84],[82,26,82,27],[82,28,84,84],[86,26,86,27],[78,26,78,27],[78,28,78,84],[80,26,80,27],[76,26,76,27],[74,26,74,27],[98,57,98,83],[80,28,80,84],[94,27,94,53],[98,27,98,53],[92,27,92,53],[92,57,92,83],[93,58,93,64],[56,26,56,84],[105,26,105,84],[51,75,51,79],[53,26,55,27],[53,28,55,84],[44,77,44,82],[71,26,71,84],[100,26,103,84],[99,58,99,64],[93,28,93,45],[95,28,95,43],[97,28,97,47],[99,28,99,47],[94,57,94,83],[95,58,95,64],[57,26,57,84],[96,27,96,53],[96,57,96,83],[97,58,97,64],[74,28,74,84],[59,35,59,47],[61,36,61,50],[61,51,61,54],[60,26,60,41],[61,26,61,35],[25,49,25,54],[26,42,26,47],[68,90,68,148],[68,26,69,84],[72,26,72,84],[86,28,87,84],[42,55,42,62],[36,55,36,62],[40,64,40,67],[40,68,40,74],[38,76,38,83],[47,27,47,53],[44,26,44,62],[38,64,38,74],[44,64,44,74],[64,26,64,33],[59,81,60,83],[60,42,60,59],[61,55,61,62],[60,60,60,63],[60,64,60,71],[33,36,33,43],[33,26,33,35],[49,36,49,74],[28,77,29,84],[28,49,29,75],[2,26,2,84],[10,26,10,84],[14,26,14,36],[12,73,12,84],[47,55,47,62],[34,64,34,66],[34,68,34,74],[34,77,34,82],[14,73,14,84],[14,37,14,71],[26,63,26,68],[26,70,26,75],[34,26,34,35],[23,78,23,84],[18,26,18,40],[25,78,25,84],[23,26,23,40],[20,26,21,40],[25,26,25,40],[20,42,21,47],[25,42,25,47],[23,49,23,54]]}
[]
[null,null,null,null,null,null,null,null,null,null,null,null,null,null,null,null,null,null,null,null,null,null,null,null,null,null,"ACTIVITY FUNDS REQUEST FORM",null,null,null,null,null,null,null,null,null,null,null,null,null,null,null,null,null,null,null,null,null,null,null,null,null,null,null,null,null,null,null,null,null,null,null,null,null,null,null,null,null,null,null,null,null,null,null,null,null,null,null,null,null,null,null,null,null,null,null,"P a g e   1"]
["Yes",null,null,null,null,null,null,null,null,null,null,null,null,null,null,null,null,null,null,null,null,null,null,null,null,null,"     PREPARER'S INFORMATION"]
["Yes",null,null,null,null,null,null,null,null,null,null,null,null,null,null,null,null,null,null,null,null,null,null,null,null,null," "]
["Good Job Everyone!!! And Congratulations in the completion of this project. Please turn in a final setup and completion report to the department (community development block grant).",null,null,null,null,null,null,null,null,null,null,null,null,null,null,null,null,null,null,null,null,null,null,null,null,null,"Preparer's Name:",null,null,null,null,null,null,null,null,null,null,null,null,null,null,null,null,null,null,null,null,null,null,null,null,null,null,null,"E-mail:"]
[null,null,null,null,null,null,null,null,null,null,null,null,null,null,null,null,null,null,null,null,null,null,null,null,null,null,"Preparer's Organization Name:",null,null,null,null,null,null,null,null,null,null,null,null,null,null,null,null,null,null,null,null,null,null,null,null,null,null,null,null,null,null,null,null,null,null,null,null,null,null,null,"Phone:"]
[null,null,null,null,null,null,null,null,null,null,null,null,null,null,null,null,null,null,null,null,null,null,null,null,null,null,"Jurisdiction Name:",null,null,null,null,null,null,null,null,null,null,null,null,null,null,null,null,null,null,null,null,null,null,null,null,null,null,null,null,null,"E-mail:"]
[null,null,null,null,null,null,null,null,null,null,null,null,null,null,null,null,null,null,null,null,null,null,null,null,null,null,"  Payee Name:    ",null,null,null,null,null,null,null,null,null,null,null,null,null,null,null,null,null,null,null,null,null,null,null,null,null,null,null,null,null,null,null,null,null,null,null,null,null,null,null,"Phone:"]
[null,null,null,null,null,null,null,null,null,null,null,null,null,null,null,null,null,null,null,null,null,null,null,null,null,null,"Payee Address:    "]
[]
[null,null,null,null,null,null,null,null,null,null,null,null,null,null,null,null,null,null,null,null,null,null,null,null,null,null,"     PROJECT INFORMATION"]
[]
[null,null,null,null,null,null,null,null,null,null,null,null,null,null,null,null,null,null,null,null,null,null,null,null,null,null,"Project Name:",null,null,null,null,null,null,null,null,null,null,null,null,null,null,null,null,null,null,null,null,null,null,null,null,null,null,null,null,null,null,null,null,null,null,null,null,null,null,null,null,null,null,null,null,null,null,"CDBG Contract #"]
[]
[null,null,null,null,null,null,null,null,null,null,null,null,null,null,null,null,null,null,null,null,null,null,null,null,null,null,"Project Address:"]
[]
[null,null,null,null,null,null,null,null,null,null,null,null,null,null,null,null,null,null,null,null,null,null,null,null,null,null,"IDIS Activity #",null,null,null,null,null,null,null,null,null,null,null,null,null,null,null,null,"CDBG Project #",null,null,null,null,null,null,null,null,null,null,null,null,null,null,null,null,null,null,null,"Is this a \"Supplemental\" Activity?",null,null,null,null,null,null,null,null,null,null,null,null,null,null,null,null,null,"No"]
[null,null,null,null,null,null,null,null,null,null,null,null," "]
[null,null,null,null,null,null,null,null,null,null,null,null,null,null,null,null,null,null,null,null,null,null,null,null,null,null,"FUNDS REQUEST #",null,null,null,null,null,null,null,null,null,null,null,null,null,null,null,null,null,null,null,null,null,null,"Total Grant Expended (from prior requests)",null,null,null,null,null,null,"Total PI Expended (from prior requests)",null,null,null,null,null,null,"Total Grant Expended (this & prior requests)",null,null,null,null,null,null,"Total PI Expended (this & prior requests)",null,null,null,null,null,null,null,"Available Balance (before/after this request)"]
[null,null,null,null,null,null,null,null,null,null,null,null,null,null,null,null,null,null,null,null,null,null,null,null,null,null,null,null,null,null,null,null,null,null,null,null,null,null,null,null,null,null,null,null,null,null,null,null,null,null,null,null,null,null,null,null,null,null,null,null,null,null,null,null,null,null,null,null,null,null,null,null,null,null,null,null,null,null,null,null,null,null,null,null,null,null,null,null,null,null,null,null,"YES"]
[null,null,null,null,null,null,null,null,null,null,null,null,null,null,null,null,null,null,null,null,null,null,null,null,null,null,"Activity Code and Description",null,null,null,null,null,null,null,null,null,null,null,null,null,null,null,"Total Grant Allocation",null,null,null,null,null,null,null,null,null,null,null,null,null,null,null,null,null,null,null,null,null,null,null,null,null,null,null,null,null,null,null,null,null,null,null,null,null,null,null,null,null,null,null,null,null,null,null,null,null,"NO"]
[]
[]
[null,null,null,null,null,null,null,null,null,null,null,null,null,null,null,null,null,null,null,null,null,null,null,{"$f":"SUM(AQ24:AV26)","v":0},null,null,"Select Option",null,null,null,null,null,null,null,null,null,null,null,null,null,null,null,null,null,null,null,null,null,null,null,null,null,null,null,null,null,null,null,null,null,null,null,null,{"$f":"SUM(AX24,BD37)-BD41","v":0},null,null,null,null,null,null,{"$f":"SUM(BE24,BD41)","v":0},null,null,null,null,null,null,null,{"$f":"AQ24-(BL24+BS24)+BZ29","v":0}]
[]
[null,null,null,null,null,null,null,null,null,null,null,null,null,null,null,null,null,null,null,null,null,null,null,{"$f":"SUM(BL27:BX27)","v":0},null,null,{"$f":"IF(OR($AA$24=Validation!$B$3,$AA$24=Validation!$B$49,$AA$24=Validation!$B$50,$AA$24=Validation!$B$51,$AA$24=Validation!$B$53,$AA$24=Validation!$B$54,$AA$24=Validation!$B$55,$AA$24=Validation!$B$58,$AA$24=Validation!$B$59,$AA$24=Validation!$B$61,$AA$24=Validation!$B$62,$AA$24=Validation!$B$63,$AA$24=Validation!$B$64),\"Activity Delivery (AD)\",\"\")","v":""},null,null,null,null,null,null,null,null,null,null,null,null,null,null,null,null,null,null,null,null,null,null,null,null,null,null,null,null,null,null,null,null,null,null,null,null,{"$f":"SUM(AX26,BD39)-BD43","v":0},null,null,null,null,null,null,{"$f":"SUM(BE26,BD43)","v":0},null,null,null,null,null,null,null,{"$f":"AQ26-(BL26+BS26)","v":0}]
[null,null,null,null,null,null,null,null,null,null,null,null,null,null,null," ",null,null,null,null,null,null,null,null,null,null,null,null,null,null,null,null,null,null,null,null,null,null,null,null,null,null,{"$f":"AQ26/AQ24","v":{"$error":"#DIV/0!"}},null,null,null,null,null,null,null,null,null,null,null,null,null,null,null,null,null,null,null,null,{"$f":"SUM(BL24:BQ26)","v":0},null,null,null,null,null,null,{"$f":"SUM(BS24:BX26)","v":0}]
[]
[null,null,null,null,null,null,null,null,null,null,null,null,null,null,null,null,null,null,null,null,null,null,null,null,null,null,"Date HCD approved the increased Project Budget/Costs ",null,null,null,null,null,null,null,null,null,null,null,null,null,null,null,null,null,null,null,null,null,null,"What is the amount of PI approved by HCD to be added to the project?"]
[]
[]
[null,null,null,null,null,null,null,null,null,null,null,null,null,null,null,null,null,null,null,null,null,null,null,null,null,null,"REQUEST FOR REIMBURSEMENT",null,null,null,null,null,null,null,null,null,null,null,null,null,null,null,null,null,null,null,null,null,null,null,null,null,null,null,null,null,null,null,null,null,null,null,null,"Program Income Certification"]
[]
[null,null,null,null,null,null,null,null,null,null,null,null,null,null,null,null,null," ",null,null,null,null,null,null,null,null,"Date Prepared:",null,null,null,null,null,null,null,null,null,null,null,null,null,null,null,null,null,null,"Project Completed?",null,null,null,null,null,null,null,null,null,null,null,null,"No",null,null,null,null,null,"Total PI on-hand as of:",null,null,null,null,null,null,null,null,null,null,null,"Amount"]
[null,null,null,null,null,null,null,null,null,null,null,null,null,null,null,null,null,null,null,null,null,null,null,null,null,null,"Type of Request:",null,null,null,null,null,null,null,null,null,"Select Option",null,null,null,null,null,null,null,null,null,null,null,null,null,null,null,null,null,null,null,null,null,null,null,null,null,null,null,"DATE",null,null,null,null,null,null,null,null,null,null,null,null,0]
[]
[null,null,null,null,null,null,null,null,null,null,null,null,null,null,null,null,null,null,null,null,null,null,null,null,null,null,null,"Total  Activity Expenses",null,null,null,null,null,null,null,null,null,null,null,null,null,null,null,null,null,null,null,null,null,null,null,null,null,null,null,null,null,null,null,null,null,null,null,"RLFs PI Certification"]
[]
[null,null,null,null,null,null,null,null,null,null,null,null,null,null,null,null,null,null,null,null,null,null,null,null,null,null,null,{"$f":"IF(OR($AA$24=Validation!$B$3,$AA$24=Validation!$B$49,$AA$24=Validation!$B$50,$AA$24=Validation!$B$51,$AA$24=Validation!$B$53,$AA$24=Validation!$B$54,$AA$24=Validation!$B$55,$AA$24=Validation!$B$58,$AA$24=Validation!$B$59,$AA$24=Validation!$B$61,$AA$24=Validation!$B$62,$AA$24=Validation!$B$63,$AA$24=Validation!$B$64),\"Total Activity Delivery (AD) Expenses\",\"\")","v":""},null,null,null,null,null,null,null,null,null,null,null,null,null,null,null,null,null,null,null,null,null,null,null,null,null,null,null,null,null,null,null,null,null,null,null,null,"Total RLF on-hand as of:",null,null,null,null,null,null,null,null,null,null,null,"Amount"]
[]
[null,null,null,null,null,null,null,null,null,null,null,null,null,null,null,null,null,null,null,null,null,null,null,null,null,null,null,"PI USED for reimbursement on this Activity",null,null,null,null,null,null,null,null,null,null,null,null,null,null,null,null,null,null,null,null,null,null,null,null,null,null,null,null,null,null,null,null,null,null,null,null,"DATE"]
[]
[null,null,null,null,null,null,null,null,null,null,null,null,null,null,null,null,null,null,null,null,null,null,null,null,null,null,null,{"$f":"IF(OR($AA$24=Validation!$B$3,$AA$24=Validation!$B$49,$AA$24=Validation!$B$50,$AA$24=Validation!$B$51,$AA$24=Validation!$B$53,$AA$24=Validation!$B$54,$AA$24=Validation!$B$55,$AA$24=Validation!$B$58,$AA$24=Validation!$B$59,$AA$24=Validation!$B$61,$AA$24=Validation!$B$62,$AA$24=Validation!$B$63,$AA$24=Validation!$B$64),\"PI USED for reimbursement on (AD) Expenses\",\"\")","v":""},null,null,null,null,null,null,null,null,null,null,null,null,null,null,null,null,null,null,null,null,null,null,null,null,null,null,null,null,null,null,null,null,null,null,null,null,"Housing RLF",null,null,null,null,null,null,null,null,null,null,null,null,0]
[]
[null,null,null,null,null,null,null,null,null,null,null,null,null,null,null,null,null,null,null,null,null,null,null,null,null,null,"CDBG only processes funds request greater than $1000 (unless Final request)",null,null,null,null,null,null,null,null,null,null,null,null,null,null,null,null,null,null,null,null,null,null,null,null,null,null,null,null,null,null,null,null,null,null,null,null,null,"ED RLF",null,null,null,null,null,null,null,null,null,null,null,null,0]
[null,null,null,null,null,null,null,null,null,null,null,null,null,null,null,null,null,null,null,null,null,null,null,null,null,null,null,"Total GRANT Funds Request",null,null,null,null,null,null,null,null,null,null,null,null,null,null,null,null,null,null,null,null,null,null,null,null,null,null,null,{"$f":"SUM($BD$37+$BD$39)-(BD41+BD43)","v":0}]
[]
[null,null,null,null,null,null,null,null,null,null,null,null,null,null,null,null,null,null,null,null,null,null,null,null,null,null,null,"Total Project Balance before/after this request",null,null,null,null,null,null,null,null,null,null,null,null,null,null,null,null,null,null,null,null,null,null,null,null,null,null,null,{"$f":"SUM(CA24:CG26)","v":0}]
[null,null,null,null,null,null,null,null,null,null,null,null,null,null,null,null,null,null," ",null,null,null,null,null,null,null,null,null,{"$f":"IF(BD48<0,\"Project balance may not be less then ZERO\",\"\")","v":""}]
[null,null,null,null,null,null,null,null,null,null,null,null,null,null,null,null,null,null,null,null,null,null,null,null,null,null,null,null,null,null,null,null,null,null,null,null,{"$f":"IF(BG34=\"Yes\",\"Complete a FINAL Setup and Completion Report\",\"\")","v":""}]
[null,null,null,null,null,null,null,null,null,null,null,null,null,null,null,null,null,null,null,null,null,null,null,null,null,null,null,null,null,null,null,null,null,null,null,null,"PROJECT PROGRESSION BAR"]
[null,null,null,null,null,null,null,null,null,null,null,null,null,null,null,null,null,null,null,null,null,null,null,null,null,null,null,null,null,null,null,null,null,null,0,null,{"$f":"BX52*100","v":{"$error":"#DIV/0!"}},null,null,null,null,null,null,null,null,null,null,null,null,null,null,null,null,null,null,null,null,null,null,null,null,null,null,null,null,null,null,null,null,null,null,null,null,null,null,{"$f":"SUM(X26/X24)","v":{"$error":"#DIV/0!"}}]
[]
[null,null,null,null,null,null,null,null,null,null,null,null,null,null,null,null,null,null,null,null,null,null,null,null,null,null,"Notes"]
[]
[]
[null,null,null,null,null,null,null,null,null,null,null,null,null,null,null,null,null,null,null,null,null,null,null,null,null,null,"STATE OF CALIFORNIA\nCOMMUNITY DEVELOPMENT BLOCK GRANT (CDBG)\nACTIVITY FUNDS REQUEST CERTIFICATION\n",null,null,null,null,null,null,null,null,null,null,null,null,null,null,null,null,null,null,null,null,null,null,null,null,null,null,null,null,null,null,null,null,null,null,null,null,null,null,null,null,null,null,null,null,null,null,null,null,null,null,null,null,null,null,null,null,null,null,null,"P a g e   2"]
[]
[null,null,null,null,null,null,null,null,null,null,null,null,null,null,null,null,null,null,null,null,null,null,null,null,null,null,null,null,null,null,null,null,null,null,null,null,null,null,null,null,null,null,null,null,null,null,null,null,null,null,null,null,null,null,null,null,null,null,null,null,null,null,null,null,null,null,null,null,null,null,null,null,null,null,null,null,null,null,null,null,null,{"$f":"IF(AS16>0,AS16,\"\")","v":""}]
[null,null,null,null,null,null,null,null,null,null,null,null,null,null,null,null,null,null,null,null,null,null,null,null,null,null,"Preparer's Name:",null,null,null,null,null,null,null,null,{"$f":"IF(AL5>0,AL5,\"\")","v":""},null,null,null,null,null,null,null,null,null,null,null,null,"E-mail:",null,null,null,{"$f":"IF(BG5>0,BG5,\"\")","v":""},null,null,null,null,null,null,null,null,null,null,null,null,null,null,null,null,null,null,null,null,null,null,null,null,null,null,null,null,{"$f":"IF(AQ19>0,AQ19,\"\")","v":""}]
[null,null,null,null,null,null,null,null,null,null,null,null,null,null,null,null,null,null,null,null,null,null,null,null,null,null,"Preparer's Organization Name:",null,null,null,null,null,null,null,null,null,null,null,null,null,null,null,{"$f":"IF(AR6>0,AR6,\"\")","v":""},null,null,null,null,null,null,null,null,null,null,null,null,null,null,null,null,null,"Phone:",null,null,null,{"$f":"IF(BT6>0,BT6,\"\")","v":""},null,null,null,null,null,null,null,null,"Funds Request #"]
[null,null,null,null,null,null,null,null,null,null,null,null,null,null,null,null,null,null,null,null,null,null,null,null,null,null,"Jurisdiction Name:",null,null,null,null,null,null,null,null,null,{"$f":"IF(AL7>0,AL7,\"\")","v":""},null,null,null,null,null,null,null,null,null,null,null,null,null,null,"Phone:",null,null,null,{"$f":"IF(BT6>0,BT6,\"\")","v":""},null,null,null,null,null,null,null,null,null,"Total Grant Funds Request",null,null,null,null,null,null,null,null,null,null,null,null,{"$f":"BD46","v":0}]
[null,null,null,null,null,null,null,null,null,null,null,null,null,null,null,null,null,null,null,null,null,null,null,null,null,null,"Payee Name:    ",null,null,null,null,null,null,null,{"$f":"IF(AL8>0,AL8,\"\")","v":""}]
[null,null,null,null,null,null,null,null,null,null,null,null,null,null,null,null,null,null,null,null,null,null,null,null,null,null,"Payee Address:    ",null,null,null,null,null,null,null,{"$f":"IF(AL9>0,AL9,\"\")","v":""},null,null,null,null,null,null,null,null,null,null,null,null,null,null,null,null,null,null,null,null,"E-mail:",null,null,null,{"$f":"IF(BJ7>0,BJ7,\"\")","v":""}]
[null,null,null,null,null,null,null,null,null,null,null,null,null,null,null,null,null,null,null,null,null,null,null,null,null,null,"Project Name:",null,null,null,null,null,null,null,{"$f":"IF(AL13>0,AL13,\"\")","v":""},null,null,null,null,null,null,null,null,null,null,null,null,null,null,null,"Project Address:",null,null,null,null,null,null,null,{"$f":"IF(AL15>0,AL15,\"\")","v":""}]
[null,null,null,null,null,null,null,null,null,null,null,null,null,null,null,null,null,null,null,null,null,null,null,null,null,null,"IDIS Activity #",null,null,null,null,null,null,{"$f":"IF(AJ17>0,AJ17,\"\")","v":""},null,null,null,null,null,null,"CDBG Project #",null,null,null,null,null,null,null,{"$f":"IF(BA17>0,BA17,\"\")","v":""},null,null,null,null,null,null,null,null,null,"CDBG Contract #",null,null,null,null,null,null,null,{"$f":"BV15","v":0}]
[]
[]
[null,null,null,null,null,null,null,null,null,null,null,null,null,null,null,null,null,null,null,null,null,null,null,null,null,null,"The funds being requested have been awarded to the State of California from the U.S. Department of Housing and Urban Development."]
[]
[]
[]
[null,null,null,null,null,null,null,null,null,null,null,null,null,null,null,null,null,null,null,null,null,null,null,null,null,null,"The undersigned certifies the following with respect to the above-named project or activity:"]
[]
[null,null,null,null,null,null,null,null,null,null,null,null,null,null,null,null,null,null,null,null,null,null,null,null,null,null,1,null,"The funds being requested are for work completed for the identified project or activity, and"]
[]
[null,null,null,null,null,null,null,null,null,null,null,null,null,null,null,null,null,null,null,null,null,null,null,null,null,null,2,null,"The work represented by the funds request has been inspected and/or verified as completed."]
[]
[null,null,null,null,null,null,null,null,null,null,null,null,null,null,null,null,null,null,null,null,null,null,null,null,null,null,3,null,"All invoices for the expenses represented in this funds request have been received, and"]
[]
{"$rows_left_out":27}
{"sheet":"Validation","index":1,"n_rows":67,"n_cols":8,"rows_kept":67,"cut":false,"hidden":true,"merged":[]}
[null,"Matrix Code",null,null,null,null,null,"Type"]
[null,"Select Option",null,"14/15","Select Option",null,null,"Select Option"]
[null,"(01) Acquisition of Real Property (for development) ",null,"15/16","Original","Yes",null,"General Administration Funds Request"]
[null,"(03) Public Facilities & Improvements (General) ",null,"16/17","Revised","No",null,"Project Funds Request"]
[null,"(03A) Senior Centers ",null,"17/18",null,null,null,"Program Funds request"]
[null,"(03B) Handicapped Centers ",null,"18/19"]
[null,"(03C) Homeless Facilities (not operating costs) ",null,"19/20"]
[null,"(03D) Youth Centers ",null,"20/21"]
[null,"(03E) Neighborhood Facilities  ",null,"21/22"]
[null,"(03F) Parks/ Recreational Facilities ",null,"22/23"]
[null,"(03G) Parking Facilities ",null,"23/24"]
[null,"(03H) Solid Waste Disposal Improvements "]
[null,"(03I) Flood/ Drainage Improvements ",null," "]
[null,"(03J) Water/ Sewer Improvements "]
[null,"(03K) Street Improvements "]
[null,"(03L) Sidewalks "]
[null,"(03M) Child Care Centers "]
[null,"(03N) Tree Planting "]
[null,"(03O) Fire Station/ Equipment "]
[null,"(03P) Health Facilities "]
[null,"(03Q) Abused and Neglected Children Facilities "]
[null,"(03R) Asbestos Removal "]
[null,"(03S) Facilities to AIDS Patients (not operating costs) "]
[null,"(03T) Operating Cost Homeless/ AIDS Patients "]
[null,"(04) Clearance, Demo, Remediation "]
[null,"(04A) Cleanup of Contaminated Sites "]
[null,"(05) Other Public Services "]
[null,"(05A) Senior Services "]
[null,"(05B) Handicapped Services "]
[null,"(05C) Legal Services "]
[null,"(05D) Youth Services "]
[null,"(05E) Transportation Services "]
[null,"(05F) Substance Abuse Services "]
[null,"(05G) Battered and Abused Spouses "]
[null,"(05H) Employment Training "]
[null,"(05I) Crime Awareness "]
[null,"(05J) Fair Housing Activities "]
[null,"(05K) Tenant/ Landlord Counseling "]
[null,"(05L) Child Care Services "]
[null,"(05M) Health Services "]
[null,"(05N) Abused/ Neglected Children "]
[null,"(05O) Mental Health Services "]
[null,"(05P) Screening for Lead-Based Paint/ Lead Hazards "]
[null,"(05Q) Subsistence Payments "]
[null,"(05T) Security Deposits "]
[null,"(05U) Housing Counseling "]
[null,"(05V) Neighborhood Cleanups "]
[null,"(05W) Food Banks - Operating Costs "]
[null,"(13) Homeownership Direct Assistance "]
[null,"(14A) Rehab; Single-Unit Residence "]
[null,"(14B) Rehab; Multi-Unit Residential "]
[null,"(14D) Rehab; Other than Public-Owned Residential Bids "]
[null,"(14E) Rehab; Pub./Private-Owned Commercial/Industrial "]
[null,"(14F) Energy Efficiency Improvements "]
[null,"(14G) Acquisition for Rehabilitation  "]
[null,"(14I) Lead Base Paint/Hazards Test/Abatement "]
[null,"(15) Code Enforcement (Public Service) "]
[null,"(16A) Residential Historic Preservation "]
[null,"(16B) Non-Residential Historic Preservation "]
[null,"(17B) C/I infrastructure Development "]
[null,"(17C) C/I Building Acq., Construction, Rehabilitation  "]
[null,"(17D) Other Commercial/ Industrial Improvements "]
[null,"(18A) ED Direct Financial Assistance to For-Profits  "]
[null,"(18C) Micro Financial Assistance "]
[null,"(18C) Micro Technical Assistance "]
[null,"(20A-CD) Planning for CD "]
[null,"(20A-ED) Planning for ED "]