{"text_format":"1","workbook":"xlsx","n_sheets":5,"sheets":["START HERE","Table A","Table B","Table C","DropdownLists"],"not_rendered":{"charts":0,"images":0,"macros":1,"external_links":0,"defined_names":3,"comments":0,"pivot_tables":0},"unopened":[],"bounds":{"document_bytes":16777216,"sheet_cells":100000,"rows_first":2000,"rows_last":500,"rows_between":2000,"halvings":0,"cell_chars":16384,"cell_head_chars":4096},"cells_cut":0,"cells_raw":0,"read":"whole","date_system":"1900"}

{"sheet":"START HERE","index":0,"n_rows":15,"n_cols":2,"rows_kept":15,"cut":false,"hidden":false,"merged":[]}
["Please Start Here, Instructions in Cell A2, Table in A3:B15","Form Fields"]
["Site Inventory Forms must be submitted to HCD for a housing element or amendment adopted on or after January 1, 2021. The following form is to be used for satisfying this requirement. To submit the form, complete the Excel spreadsheet and submit to HCD at sitesinventory@hcd.ca.gov. Please send the Excel workbook, not a scanned or PDF copy of the tables."]
["General Information "]
["Jurisidiction Name"]
["Housing Element Cycle"]
["Contact Information"]
["First Name"]
["Last Name"]
["Title"]
["Email"]
["Phone"]
["Mailing Address"]
["Street Address"]
["City"]
["Zip Code"]

{"sheet":"Table A","index":1,"n_rows":502,"n_cols":22,"rows_kept":502,"cut":false,"hidden":false,"merged":[]}
["Table A: Housing Element Sites Inventory, Table Starts in Cell A2"]
["Jurisdiction Name","Site Address/Intersection","5 Digit ZIP Code","Assessor Parcel Number","Consolidated Sites","General Plan Designation (Current)","Zoning Designation (Current)","Minimum Density Allowed (units/acre)","Max Density Allowed (units/acre)","Parcel Size (Acres)","Existing Use/Vacancy","Infrastructure","Publicly-Owned","Site Status","Identified in Last/Last Two Planning Cycle(s)","Lower Income Capacity","Moderate Income Capacity","Above Moderate Income Capacity","Total Capacity","Optional Information1","Optional Information2","Optional Information3"]
[{"$f":"IF('START HERE'!$B$4=0,\"\",'START HERE'!$B$4)","v":""},null,null,"",null,null,null,null,null,null,null,null,null,null,null,null,null,null,{"$f":"IF((R3+Q3+P3)=0,\"\",(R3+Q3+P3))","v":""}]
[{"$f":"IF('START HERE'!$B$4=0,\"\",'START HERE'!$B$4)","v":""},null,null,null,null,null,null,null,null,null,null,null,null,null,null,null,null,null,{"$f":"IF((R4+Q4+P4)=0,\"\",(R4+Q4+P4))","v":""}]
[{"$f":"IF('START HERE'!$B$4=0,\"\",'START HERE'!$B$4)","v":""},null,null,null,null,null,null,null,null,null,null,null,null,null,null,null,null,null,""]
[{"$f":"IF('START HERE'!$B$4=0,\"\",'START HERE'!$B$4)","v":""},null,null,null,null,null,null,null,null,null,null,null,null,null,null,null,null,null,""]
[{"$f":"IF('START HERE'!$B$4=0,\"\",'START HERE'!$B$4)","v":""},null,null,null,null,null,null,null,null,null,null,null,null,null,null,null,null,null,""]
[{"$f":"IF('START HERE'!$B$4=0,\"\",'START HERE'!$B$4)","v":""},null,null,null,null,null,null,null,null,null,null,null,null,null,null,null,null,null,""]
[{"$f":"IF('START HERE'!$B$4=0,\"\",'START HERE'!$B$4)","v":""},null,null,null,null,null,null,null,null,null,null,null,null,null,null,null,null,null,""]
[{"$f":"IF('START HERE'!$B$4=0,\"\",'START HERE'!$B$4)","v":""},null,null,null,null,null,null,null,null,null,null,null,null,null,null,null,null,null,""]
[{"$f":"IF('START HERE'!$B$4=0,\"\",'START HERE'!$B$4)","v":""},null,null,null,null,null,null,null,null,null,null,null,null,null,null,null,null,null,""]
[{"$f":"IF('START HERE'!$B$4=0,\"\",'START HERE'!$B$4)","v":""},null,null,null,null,null,null,null,null,null,null,null,null,null,null,null,null,null,""]
[{"$f":"IF('START HERE'!$B$4=0,\"\",'START HERE'!$B$4)","v":""},null,null,null,null,null,null,null,null,null,null,null,null,null,null,null,null,null,""]
[{"$f":"IF('START HERE'!$B$4=0,\"\",'START HERE'!$B$4)","v":""},null,null,null,null,null,null,null,null,null,null,null,null,null,null,null,null,null,""]
[{"$f":"IF('START HERE'!$B$4=0,\"\",'START HERE'!$B$4)","v":""},null,null,null,null,null,null,null,null,null,null,null,null,null,null,null,null,null,""]
[{"$f":"IF('START HERE'!$B$4=0,\"\",'START HERE'!$B$4)","v":""},null,null,null,null,null,null,null,null,null,null,null,null,null,null,null,null,null,""]
[{"$f":"IF('START HERE'!$B$4=0,\"\",'START HERE'!$B$4)","v":""},null,null,null,null,null,null,null,null,null,null,null,null,null,null,null,null,null,""]
[{"$f":"IF('START HERE'!$B$4=0,\"\",'START HERE'!$B$4)","v":""},null,null,null,null,null,null,null,null,null,null,null,null,null,null,null,null,null,""]
[{"$f":"IF('START HERE'!$B$4=0,\"\",'START HERE'!$B$4)","v":""},null,null,null,null,null,null,null,null,null,null,null,null,null,null,null,null,null,""]
[{"$f":"IF('START HERE'!$B$4=0,\"\",'START HERE'!$B$4)","v":""},null,null,null,null,null,null,null,null,null,null,null,null,null,null,null,null,null,""]
[{"$f":"IF('START HERE'!$B$4=0,\"\",'START HERE'!$B$4)","v":""},null,null,null,null,null,null,null,null,null,null,null,null,null,null,null,null,null,""]
[{"$f":"IF('START HERE'!$B$4=0,\"\",'START HERE'!$B$4)","v":""},null,null,null,null,null,null,null,null,null,null,null,null,null,null,null,null,null,""]
[{"$f":"IF('START HERE'!$B$4=0,\"\",'START HERE'!$B$4)","v":""},null,null,null,null,null,null,null,null,null,null,null,null,null,null,null,null,null,""]
[{"$f":"IF('START HERE'!$B$4=0,\"\",'START HERE'!$B$4)","v":""},null,null,null,null,null,null,null,null,null,null,null,null,null,null,null,null,null,""]
[{"$f":"IF('START HERE'!$B$4=0,\"\",'START HERE'!$B$4)","v":""},null,null,null,null,null,null,null,null,null,null,null,null,null,null,null,null,null,""]
[{"$f":"IF('START HERE'!$B$4=0,\"\",'START HERE'!$B$4)","v":""},null,null,null,null,null,null,null,null,null,null,null,null,null,null,null,null,null,""]
[{"$f":"IF('START HERE'!$B$4=0,\"\",'START HERE'!$B$4)","v":""},null,null,null,null,null,null,null,null,null,null,null,null,null,null,null,null,null,""]
[{"$f":"IF('START HERE'!$B$4=0,\"\",'START HERE'!$B$4)","v":""},null,null,null,null,null,null,null,null,null,null,null,null,null,null,null,null,null,""]
[{"$f":"IF('START HERE'!$B$4=0,\"\",'START HERE'!$B$4)","v":""},null,null,null,null,null,null,null,null,null,null,null,null,null,null,null,null,null,""]
[{"$f":"IF('START HERE'!$B$4=0,\"\",'START HERE'!$B$4)","v":""},null,null,null,null,null,null,null,null,null,null,null,null,null,null,null,null,null,""]
[{"$f":"IF('START HERE'!$B$4=0,\"\",'START HERE'!$B$4)","v":""},null,null,null,null,null,null,null,null,null,null,null,null,null,null,null,null,null,""]
[{"$f":"IF('START HERE'!$B$4=0,\"\",'START HERE'!$B$4)","v":""},null,null,null,null,null,null,null,null,null,null,null,null,null,null,null,null,null,""]
[{"$f":"IF('START HERE'!$B$4=0,\"\",'START HERE'!$B$4)","v":""},null,null,null,null,null,null,null,null,null,null,null,null,null,null,null,null,null,""]
[{"$f":"IF('START HERE'!$B$4=0,\"\",'START HERE'!$B$4)","v":""},null,null,null,null,null,null,null,null,null,null,null,null,null,null,null,null,null,""]
[{"$f":"IF('START HERE'!$B$4=0,\"\",'START HERE'!$B$4)","v":""},null,null,null,null,null,null,null,null,null,null,null,null,null,null,null,null,null,""]
[{"$f":"IF('START HERE'!$B$4=0,\"\",'START HERE'!$B$4)","v":""},null,null,null,null,null,null,null,null,null,null,null,null,null,null,null,null,null,""]
[{"$f":"IF('START HERE'!$B$4=0,\"\",'START HERE'!$B$4)","v":""},null,null,null,null,null,null,null,null,null,null,null,null,null,null,null,null,null,""]
[{"$f":"IF('START HERE'!$B$4=0,\"\",'START HERE'!$B$4)","v":""},null,null,null,null,null,null,null,null,null,null,null,null,null,null,null,null,null,""]
[{"$f":"IF('START HERE'!$B$4=0,\"\",'START HERE'!$B$4)","v":""},null,null,null,null,null,null,null,null,null,null,null,null,null,null,null,null,null,""]
[{"$f":"IF('START HERE'!$B$4=0,\"\",'START HERE'!$B$4)","v":""},null,null,null,null,null,null,null,null,null,null,null,null,null,null,null,null,null,""]
[{"$f":"IF('START HERE'!$B$4=0,\"\",'START HERE'!$B$4)","v":""},null,null,null,null,null,null,null,null,null,null,null,null,null,null,null,null,null,""]
[{"$f":"IF('START HERE'!$B$4=0,\"\",'START HERE'!$B$4)","v":""},null,null,null,null,null,null,null,null,null,null,null,null,null,null,null,null,null,""]
[{"$f":"IF('START HERE'!$B$4=0,\"\",'START HERE'!$B$4)","v":""},null,null,null,null,null,null,null,null,null,null,null,null,null,null,null,null,null,""]
[{"$f":"IF('START HERE'!$B$4=0,\"\",'START HERE'!$B$4)","v":""},null,null,null,null,null,null,null,null,null,null,null,null,null,null,null,null,null,""]
[{"$f":"IF('START HERE'!$B$4=0,\"\",'START HERE'!$B$4)","v":""},null,null,null,null,null,null,null,null,null,null,null,null,null,null,null,null,null,""]
[{"$f":"IF('START HERE'!$B$4=0,\"\",'START HERE'!$B$4)","v":""},null,null,null,null,null,null,null,null,null,null,null,null,null,null,null,null,null,""]
[{"$f":"IF('START HERE'!$B$4=0,\"\",'START HERE'!$B$4)","v":""},null,null,null,null,null,null,null,null,null,null,null,null,null,null,null,null,null,""]
[{"$f":"IF('START HERE'!$B$4=0,\"\",'START HERE'!$B$4)","v":""},null,null,null,null,null,null,null,null,null,null,null,null,null,null,null,null,null,""]
[{"$f":"IF('START HERE'!$B$4=0,\"\",'START HERE'!$B$4)","v":""},null,null,null,null,null,null,null,null,null,null,null,null,null,null,null,null,null,""]
[{"$f":"IF('START HERE'!$B$4=0,\"\",'START HERE'!$B$4)","v":""},null,null,null,null,null,null,null,null,null,null,null,null,null,null,null,null,null,""]
[{"$f":"IF('START HERE'!$B$4=0,\"\",'START HERE'!$B$4)","v":""},null,null,null,null,null,null,null,null,null,null,null,null,null,null,null,null,null,""]
[{"$f":"IF('START HERE'!$B$4=0,\"\",'START HERE'!$B$4)","v":""},null,null,null,null,null,null,null,null,null,null,null,null,null,null,null,null,null,""]
[{"$f":"IF('START HERE'!$B$4=0,\"\",'START HERE'!$B$4)","v":""},null,null,null,null,null,null,null,null,null,null,null,null,null,null,null,null,null,""]
[{"$f":"IF('START HERE'!$B$4=0,\"\",'START HERE'!$B$4)","v":""},null,null,null,null,null,null,null,null,null,null,null,null,null,null,null,null,null,""]
[{"$f":"IF('START HERE'!$B$4=0,\"\",'START HERE'!$B$4)","v":""},null,null,null,null,null,null,null,null,null,null,null,null,null,null,null,null,null,""]
[{"$f":"IF('START HERE'!$B$4=0,\"\",'START HERE'!$B$4)","v":""},null,null,null,null,null,null,null,null,null,null,null,null,null,null,null,null,null,""]
[{"$f":"IF('START HERE'!$B$4=0,\"\",'START HERE'!$B$4)","v":""},null,null,null,null,null,null,null,null,null,null,null,null,null,null,null,null,null,""]
[{"$f":"IF('START HERE'!$B$4=0,\"\",'START HERE'!$B$4)","v":""},null,null,null,null,null,null,null,null,null,null,null,null,null,null,null,null,null,""]
[{"$f":"IF('START HERE'!$B$4=0,\"\",'START HERE'!$B$4)","v":""},null,null,null,null,null,null,null,null,null,null,null,null,null,null,null,null,null,""]
[{"$f":"IF('START HERE'!$B$4=0,\"\",'START HERE'!$B$4)","v":""},null,null,null,null,null,null,null,null,null,null,null,null,null,null,null,null,null,""]
[{"$f":"IF('START HERE'!$B$4=0,\"\",'START HERE'!$B$4)","v":""},null,null,null,null,null,null,null,null,null,null,null,null,null,null,null,null,null,""]
[{"$f":"IF('START HERE'!$B$4=0,\"\",'START HERE'!$B$4)","v":""},null,null,null,null,null,null,null,null,null,null,null,null,null,null,null,null,null,""]
[{"$f":"IF('START HERE'!$B$4=0,\"\",'START HERE'!$B$4)","v":""},null,null,null,null,null,null,null,null,null,null,null,null,null,null,null,null,null,""]
[{"$f":"IF('START HERE'!$B$4=0,\"\",'START HERE'!$B$4)","v":""},null,null,null,null,null,null,null,null,null,null,null,null,null,null,null,null,null,""]
[{"$f":"IF('START HERE'!$B$4=0,\"\",'START HERE'!$B$4)","v":""},null,null,null,null,null,null,null,null,null,null,null,null,null,null,null,null,null,""]
[{"$f":"IF('START HERE'!$B$4=0,\"\",'START HERE'!$B$4)","v":""},null,null,null,null,null,null,null,null,null,null,null,null,null,null,null,null,null,""]
[{"$f":"IF('START HERE'!$B$4=0,\"\",'START HERE'!$B$4)","v":""},null,null,null,null,null,null,null,null,null,null,null,null,null,null,null,null,null,""]
[{"$f":"IF('START HERE'!$B$4=0,\"\",'START HERE'!$B$4)","v":""},null,null,null,null,null,null,null,null,null,null,null,null,null,null,null,null,null,{"$f":"IF((R68+Q68+P68)=0,\"\",(R68+Q68+P68))","v":""}]
[{"$f":"IF('START HERE'!$B$4=0,\"\",'START HERE'!$B$4)","v":""},null,null,null,null,null,null,null,null,null,null,null,null,null,null,null,null,null,""]
[{"$f":"IF('START HERE'!$B$4=0,\"\",'START HERE'!$B$4)","v":""},null,null,null,null,null,null,null,null,null,null,null,null,null,null,null,null,null,""]
[{"$f":"IF('START HERE'!$B$4=0,\"\",'START HERE'!$B$4)","v":""},null,null,null,null,null,null,null,null,null,null,null,null,null,null,null,null,null,""]
[{"$f":"IF('START HERE'!$B$4=0,\"\",'START HERE'!$B$4)","v":""},null,null,null,null,null,null,null,null,null,null,null,null,null,null,null,null,null,""]
[{"$f":"IF('START HERE'!$B$4=0,\"\",'START HERE'!$B$4)","v":""},null,null,null,null,null,null,null,null,null,null,null,null,null,null,null,null,null,""]
[{"$f":"IF('START HERE'!$B$4=0,\"\",'START HERE'!$B$4)","v":""},null,null,null,null,null,null,null,null,null,null,null,null,null,null,null,null,null,""]
[{"$f":"IF('START HERE'!$B$4=0,\"\",'START HERE'!$B$4)","v":""},null,null,null,null,null,null,null,null,null,null,null,null,null,null,null,null,null,""]
[{"$f":"IF('START HERE'!$B$4=0,\"\",'START HERE'!$B$4)","v":""},null,null,null,null,null,null,null,null,null,null,null,null,null,null,null,null,null,""]
[{"$f":"IF('START HERE'!$B$4=0,\"\",'START HERE'!$B$4)","v":""},null,null,null,null,null,null,null,null,null,null,null,null,null,null,null,null,null,""]
[{"$f":"IF('START HERE'!$B$4=0,\"\",'START HERE'!$B$4)","v":""},null,null,null,null,null,null,null,null,null,null,null,null,null,null,null,null,null,""]
[{"$f":"IF('START HERE'!$B$4=0,\"\",'START HERE'!$B$4)","v":""},null,null,null,null,null,null,null,null,null,null,null,null,null,null,null,null,null,""]
[{"$f":"IF('START HERE'!$B$4=0,\"\",'START HERE'!$B$4)","v":""},null,null,null,null,null,null,null,null,null,null,null,null,null,null,null,null,null,""]
{"$rows_left_out":423}
{"sheet":"Table B","index":2,"n_rows":502,"n_cols":22,"rows_kept":502,"cut":false,"hidden":false,"merged":[]}
["Table B: Candidate Sites Identified to be Rezoned to Accommodate Shortfall Housing Need, Table Starts in Cell A2"]
["Jurisdiction Name","Site Address/Intersection","5 Digit ZIP Code","Assessor Parcel Number","Very Low-Income","Low-Income","Moderate-Income","Above Moderate-Income","Type of Shortfall\n","Parcel Size\n(Acres)","Current General Plan Designation","Current Zoning","Proposed General Plan (GP) Designation","Proposed Zoning","Minimum Density Allowed ","Maximum Density Allowed","Total Capacity","Vacant/\nNonvacant","Description of Existing Uses","Optional Information1","Optional Information2","Optional Information3"]
[{"$f":"IF('START HERE'!$B$4=0,\"\",'START HERE'!$B$4)","v":""}]
[{"$f":"IF('START HERE'!$B$4=0,\"\",'START HERE'!$B$4)","v":""}]
[{"$f":"IF('START HERE'!$B$4=0,\"\",'START HERE'!$B$4)","v":""}]
[{"$f":"IF('START HERE'!$B$4=0,\"\",'START HERE'!$B$4)","v":""}]
[{"$f":"IF('START HERE'!$B$4=0,\"\",'START HERE'!$B$4)","v":""}]
[{"$f":"IF('START HERE'!$B$4=0,\"\",'START HERE'!$B$4)","v":""}]
[{"$f":"IF('START HERE'!$B$4=0,\"\",'START HERE'!$B$4)","v":""}]
[{"$f":"IF('START HERE'!$B$4=0,\"\",'START HERE'!$B$4)","v":""}]
[{"$f":"IF('START HERE'!$B$4=0,\"\",'START HERE'!$B$4)","v":""}]
[{"$f":"IF('START HERE'!$B$4=0,\"\",'START HERE'!$B$4)","v":""}]
[{"$f":"IF('START HERE'!$B$4=0,\"\",'START HERE'!$B$4)","v":""}]
[{"$f":"IF('START HERE'!$B$4=0,\"\",'START HERE'!$B$4)","v":""}]
[{"$f":"IF('START HERE'!$B$4=0,\"\",'START HERE'!$B$4)","v":""}]
[{"$f":"IF('START HERE'!$B$4=0,\"\",'START HERE'!$B$4)","v":""}]
[{"$f":"IF('START HERE'!$B$4=0,\"\",'START HERE'!$B$4)","v":""}]
[{"$f":"IF('START HERE'!$B$4=0,\"\",'START HERE'!$B$4)","v":""}]
[{"$f":"IF('START HERE'!$B$4=0,\"\",'START HERE'!$B$4)","v":""}]
[{"$f":"IF('START HERE'!$B$4=0,\"\",'START HERE'!$B$4)","v":""}]
[{"$f":"IF('START HERE'!$B$4=0,\"\",'START HERE'!$B$4)","v":""}]
[{"$f":"IF('START HERE'!$B$4=0,\"\",'START HERE'!$B$4)","v":""}]
[{"$f":"IF('START HERE'!$B$4=0,\"\",'START HERE'!$B$4)","v":""}]
[{"$f":"IF('START HERE'!$B$4=0,\"\",'START HERE'!$B$4)","v":""}]
[{"$f":"IF('START HERE'!$B$4=0,\"\",'START HERE'!$B$4)","v":""}]
[{"$f":"IF('START HERE'!$B$4=0,\"\",'START HERE'!$B$4)","v":""}]
[{"$f":"IF('START HERE'!$B$4=0,\"\",'START HERE'!$B$4)","v":""}]
[{"$f":"IF('START HERE'!$B$4=0,\"\",'START HERE'!$B$4)","v":""}]
[{"$f":"IF('START HERE'!$B$4=0,\"\",'START HERE'!$B$4)","v":""}]
[{"$f":"IF('START HERE'!$B$4=0,\"\",'START HERE'!$B$4)","v":""}]
[{"$f":"IF('START HERE'!$B$4=0,\"\",'START HERE'!$B$4)","v":""}]
[{"$f":"IF('START HERE'!$B$4=0,\"\",'START HERE'!$B$4)","v":""}]
[{"$f":"IF('START HERE'!$B$4=0,\"\",'START HERE'!$B$4)","v":""}]
[{"$f":"IF('START HERE'!$B$4=0,\"\",'START HERE'!$B$4)","v":""}]
[{"$f":"IF('START HERE'!$B$4=0,\"\",'START HERE'!$B$4)","v":""}]
[{"$f":"IF('START HERE'!$B$4=0,\"\",'START HERE'!$B$4)","v":""}]
[{"$f":"IF('START HERE'!$B$4=0,\"\",'START HERE'!$B$4)","v":""}]
[{"$f":"IF('START HERE'!$B$4=0,\"\",'START HERE'!$B$4)","v":""}]
[{"$f":"IF('START HERE'!$B$4=0,\"\",'START HERE'!$B$4)","v":""}]
[{"$f":"IF('START HERE'!$B$4=0,\"\",'START HERE'!$B$4)","v":""}]
[{"$f":"IF('START HERE'!$B$4=0,\"\",'START HERE'!$B$4)","v":""}]
[{"$f":"IF('START HERE'!$B$4=0,\"\",'START HERE'!$B$4)","v":""}]
[{"$f":"IF('START HERE'!$B$4=0,\"\",'START HERE'!$B$4)","v":""}]
[{"$f":"IF('START HERE'!$B$4=0,\"\",'START HERE'!$B$4)","v":""}]
[{"$f":"IF('START HERE'!$B$4=0,\"\",'START HERE'!$B$4)","v":""}]
[{"$f":"IF('START HERE'!$B$4=0,\"\",'START HERE'!$B$4)","v":""}]
[{"$f":"IF('START HERE'!$B$4=0,\"\",'START HERE'!$B$4)","v":""}]
[{"$f":"IF('START HERE'!$B$4=0,\"\",'START HERE'!$B$4)","v":""}]
[{"$f":"IF('START HERE'!$B$4=0,\"\",'START HERE'!$B$4)","v":""}]
[{"$f":"IF('START HERE'!$B$4=0,\"\",'START HERE'!$B$4)","v":""}]
[{"$f":"IF('START HERE'!$B$4=0,\"\",'START HERE'!$B$4)","v":""}]
[{"$f":"IF('START HERE'!$B$4=0,\"\",'START HERE'!$B$4)","v":""}]
[{"$f":"IF('START HERE'!$B$4=0,\"\",'START HERE'!$B$4)","v":""}]
[{"$f":"IF('START HERE'!$B$4=0,\"\",'START HERE'!$B$4)","v":""}]
[{"$f":"IF('START HERE'!$B$4=0,\"\",'START HERE'!$B$4)","v":""}]
[{"$f":"IF('START HERE'!$B$4=0,\"\",'START HERE'!$B$4)","v":""}]
[{"$f":"IF('START HERE'!$B$4=0,\"\",'START HERE'!$B$4)","v":""}]
[{"$f":"IF('START HERE'!$B$4=0,\"\",'START HERE'!$B$4)","v":""}]
[{"$f":"IF('START HERE'!$B$4=0,\"\",'START HERE'!$B$4)","v":""}]
[{"$f":"IF('START HERE'!$B$4=0,\"\",'START HERE'!$B$4)","v":""}]
[{"$f":"IF('START HERE'!$B$4=0,\"\",'START HERE'!$B$4)","v":""}]
[{"$f":"IF('START HERE'!$B$4=0,\"\",'START HERE'!$B$4)","v":""}]
[{"$f":"IF('START HERE'!$B$4=0,\"\",'START HERE'!$B$4)","v":""}]
[{"$f":"IF('START HERE'!$B$4=0,\"\",'START HERE'!$B$4)","v":""}]
[{"$f":"IF('START HERE'!$B$4=0,\"\",'START HERE'!$B$4)","v":""}]
[{"$f":"IF('START HERE'!$B$4=0,\"\",'START HERE'!$B$4)","v":""}]
[{"$f":"IF('START HERE'!$B$4=0,\"\",'START HERE'!$B$4)","v":""}]
[{"$f":"IF('START HERE'!$B$4=0,\"\",'START HERE'!$B$4)","v":""}]
[{"$f":"IF('START HERE'!$B$4=0,\"\",'START HERE'!$B$4)","v":""}]
[{"$f":"IF('START HERE'!$B$4=0,\"\",'START HERE'!$B$4)","v":""}]
[{"$f":"IF('START HERE'!$B$4=0,\"\",'START HERE'!$B$4)","v":""}]
[{"$f":"IF('START HERE'!$B$4=0,\"\",'START HERE'!$B$4)","v":""}]
[{"$f":"IF('START HERE'!$B$4=0,\"\",'START HERE'!$B$4)","v":""}]
[{"$f":"IF('START HERE'!$B$4=0,\"\",'START HERE'!$B$4)","v":""}]
[{"$f":"IF('START HERE'!$B$4=0,\"\",'START HERE'!$B$4)","v":""}]
[{"$f":"IF('START HERE'!$B$4=0,\"\",'START HERE'!$B$4)","v":""}]
[{"$f":"IF('START HERE'!$B$4=0,\"\",'START HERE'!$B$4)","v":""}]
[{"$f":"IF('START HERE'!$B$4=0,\"\",'START HERE'!$B$4)","v":""}]
[{"$f":"IF('START HERE'!$B$4=0,\"\",'START HERE'!$B$4)","v":""}]
[{"$f":"IF('START HERE'!$B$4=0,\"\",'START HERE'!$B$4)","v":""}]
{"$rows_left_out":423}
{"sheet":"Table C","index":3,"n_rows":2,"n_cols":2,"rows_kept":2,"cut":false,"hidden":false,"merged":[]}
["Table C: Land Use, Table Starts in A2"]
["Zoning Designation\n(From Table A, Column G)","General Land Uses Allowed"]

{"sheet":"DropdownLists","index":4,"n_rows":539,"n_cols":11,"rows_kept":539,"cut":false,"hidden":true,"merged":[]}
["ADELANTO","A","YES","NO - Not Eligible","Available","NO - Privately-Owned","4th","Used in Prior Housing Element - Non-Vacant",null,"Vacant","YES - Current"]
["AGOURA HILLS","B","NO","YES - Infill Cat. Ex. (CEQA Guidelines § 15332)","Pending Project","YES - City-Owned","5th","Used in Two Consecutive Prior Housing Elements - Vacant","Unaccommodated Need","Non-Vacant","YES - Planned"]
["ALAMEDA","C",null,"YES -  Infill Housing Exemption (Public Resources Code (PRC) § 21159.24)",null,"YES - County-Owned","6th","Not Used in Prior Housing Element","Shortfall of Sites",null,"YES - Potential"]
["ALAMEDA COUNTY","D",null,"YES – Infill Housing in Unincorporated Areas (PRC § 21159.25)",null,"YES - Special District-Owned","7th",null,"Both",null,"NO"]
["ALBANY","E",null,"YES – Transit Priority Area Covered by a Specific Plan (PRC § 21155.4)",null,"YES - State-Owned","8th"]
["ALHAMBRA","F",null,"YES – Planning Document Consistency (PRC) § 21083.3)",null,"YES - Federally-Owned","9th"]
["ALISO VIEJO","G",null,"YES - Other",null,"YES - Other Publicly-Owned"]
["ALPINE COUNTY","H"]
["ALTURAS","I"]
["AMADOR CITY","J"]
["AMADOR COUNTY","K"]
["AMERICAN CANYON","L"]
["ANAHEIM","M"]
["ANDERSON","N"]
["ANGELS CAMP","O"]
["ANTIOCH","P"]
["APPLE VALLEY","Q"]
["ARCADIA","R"]
["ARCATA","S"]
["ARROYO GRANDE","T"]
["ARTESIA","U"]
["ARVIN","V"]
["ATASCADERO","W"]
["ATHERTON","X"]
["ATWATER","Y"]
["AUBURN","Z"]
["AVALON","AA"]
["AVENAL","AB"]
["AZUSA","AC"]
["BAKERSFIELD","AD"]
["BALDWIN PARK","AE"]
["BANNING","AF"]
["BARSTOW","AG"]
["BEAUMONT","AH"]
["BELL","AI"]
["BELL GARDENS","AJ"]
["BELLFLOWER","AK"]
["BELMONT","AL"]
["BELVEDERE","AM"]
["BENICIA","AN"]
["BERKELEY","AO"]
["BEVERLY HILLS","AP"]
["BIG BEAR LAKE","AQ"]
["BIGGS","AR"]
["BISHOP","AS"]
["BLUE LAKE","AT"]
["BLYTHE","AU"]
["BRADBURY","AV"]
["BRAWLEY","AW"]
["BREA","AX"]
["BRENTWOOD","AY"]
["BRISBANE","AZ"]
["BUELLTON"]
["BUENA PARK"]
["BURBANK"]
["BURLINGAME"]
["BUTTE COUNTY"]
["CALABASAS"]
["CALAVERAS COUNTY"]
["CALEXICO"]
["CALIFORNIA CITY"]
["CALIMESA"]
["CALIPATRIA"]
["CALISTOGA"]
["CAMARILLO"]
["CAMPBELL"]
["CANYON LAKE"]
["CAPITOLA"]
["CARLSBAD"]
["CARMEL"]
["CARPINTERIA"]
["CARSON"]
["CATHEDRAL"]
["CERES"]
["CERRITOS"]
["CHICO"]
["CHINO"]
["CHINO HILLS"]
["CHOWCHILLA"]
["CHULA VISTA"]
{"$rows_left_out":459}