{"text_format":"1","workbook":"xlsx","n_sheets":19,"sheets":["MHP Cover Page","Instructions","Checklist","B - Project Requirements","B1 - Development Team Contacts","B2 - SH Experience","B3 - Supportive Services Plan","B4 - SS Verification","B5 -  At High Risk","C - Local & Env Verification","D - Max Loan & Unit Mix","E - Project Selection","F - Certification & Legal","Sponsor Org Docs","Application Support","Mapping","TCAC Map 2019","Dropdowns","Loan Limits"],"not_rendered":{"charts":0,"images":6,"macros":1,"external_links":2,"defined_names":241,"comments":7,"pivot_tables":0},"unopened":[],"bounds":{"document_bytes":16777216,"sheet_cells":100000,"rows_first":2000,"rows_last":500,"rows_between":2000,"halvings":0,"cell_chars":16384,"cell_head_chars":4096},"cells_cut":0,"cells_raw":0,"read":"whole","date_system":"1900"}

{"sheet":"MHP Cover Page","index":0,"n_rows":46,"n_cols":3,"rows_kept":46,"cut":false,"hidden":false,"merged":[[37,0,37,22],[38,0,38,22],[4,0,4,22],[6,0,6,22],[26,0,26,22],[27,0,27,22],[29,0,29,22],[7,0,7,22],[5,0,5,22],[30,0,30,22],[32,0,32,22],[33,0,33,22],[36,0,36,22],[45,0,45,1],[45,2,45,3],[39,0,39,22],[40,0,40,22],[44,0,44,22]]}
[]
[]
[]
[]
["Multifamily Housing Program"]
["Supplemental Application"]
["January 2020 Notice of Funding Availability"]
[]
[]
[]
[]
[]
[]
[]
[]
[]
[]
[]
[]
[]
[]
[]
[]
[]
[]
[]
["State of California"]
["Governor Gavin Newsom"]
[]
["Alexis Podesta, Secretary"]
["Business, Consumer Services and Housing Agency"]
[]
["Douglas R. McCauley, Acting Director"]
["Department of Housing and Community Development"]
[]
[]
["2020 West El Camino Avenue, Suite 150"]
["Sacramento, CA 95833"]
["Phone: (916) 263-2771  "]
["Email: MHP@hcd.ca.gov"]
["Website: http://www.hcd.ca.gov/grants-funding/active-funding/MHP.shtml"]
[]
[]
[]
["January 2, 2020"]
["Rev.",null,"2020-01-07"]

{"sheet":"Instructions","index":1,"n_rows":39,"n_cols":36,"rows_kept":39,"cut":false,"hidden":false,"merged":[[1,0,1,37],[2,0,2,37],[3,0,3,37],[4,0,4,37],[0,0,0,34],[0,35,0,37],[5,0,5,37],[6,0,6,37],[7,0,7,37],[8,0,8,37],[26,0,26,37],[9,0,9,37],[10,0,10,37],[11,0,11,37],[12,0,12,37],[13,0,13,37],[14,0,14,37],[15,0,15,37],[16,0,16,37],[18,0,18,37],[20,0,20,37],[21,0,21,37],[25,0,25,37],[38,0,38,37],[32,0,32,37],[33,0,33,37],[34,0,34,37],[36,0,36,37],[35,0,35,37],[37,0,37,37],[27,0,27,37],[28,0,28,37],[29,0,29,37],[30,0,30,37],[31,0,31,37],[17,0,17,37],[19,0,19,37],[22,0,22,37],[23,0,23,37],[24,0,24,37]]}
["Instructions",null,null,null,null,null,null,null,null,null,null,null,null,null,null,null,null,null,null,null,null,null,null,null,null,null,null,null,null,null,null,null,null,null,null,{"$f":"'B - Project Requirements'!AJ1","v":"2020-01-07"}]
["Application materials must be submitted electronically via the FAAST system. Requirements for uploading the Application Workbook, UA Workbook, and required supporting documentation, including naming conventions, are described in the application instructions available at https://www.hcd.ca.gov/grants-funding/active-funding/mhp.shtml. Sponsors must upload all application materials to the FAAST system no later than 5:00 p.m. Pacific Standard Time on March 2, 2020.\n\nSponsors must submit hardcopies of documents requiring wet signatures as identified in the Application Workbooks through a mail carrier service such as U.S. Postal Service, UPS, FedEx or other carrier services that provide date stamp verification confirming delivery. These documents must be received by the Department no later than 5:00 p.m., Pacific Standard Time on March 2, 2020 to the address below:\n\nMultifamily Housing Program (MHP)\nDivision of Financial Assistance, NOFA Section\nCalifornia Department of Housing and Community Development\n2020 W. El Camino Avenue, Suite 650\nSacramento, CA 95833\n\nPersonal deliveries will not be accepted. No late applications, incomplete applications, facsimiles, walk-ins or application revisions will be accepted. The hardcopy documents must match documents submitted via the FAAST system. In the event of discrepancies between hardcopies and electronically submitted workbooks, the electronic FAAST submission will prevail."]
["2020-03-02"]
["Applications must be on the Department’s forms and cannot be altered or modified by the Sponsor. Excel forms must be in Excel format and unprotected, not a .pdf document. Please fill-out the Application Support worksheet and email the entire workbook to Application Support for application errors at AppSupport@hcd.ca.gov."]
["General Instructions (Additional instructions and guidance are given throughout the Supplemental Application in \"red\" text and in cell comments. "]
["\"Yellow\" cells are for Sponsor input. Failure to provide the information may disqualify your application from consideration or may negatively impact your point score."]
["Required attachments are indicated in \"Orange\" throughout the Supplemental Application. Failure to provide the required attachments and documentation may disqualify your application from consideration or may negatively impact your point score. Electronically attached files must use the naming convention in the Supplemental Application. For Example: \"App1 Payee Data\" for Sponsor 1 Payee Data Record/ STD. 204."]
["Self score points awarded are in \"Blue\" cells in the 'E - Project Selection' worksheet. These are automated calculations based on the inputs provided by the Sponsor. "]
["\"Red\" shaded cells indicate the Sponsor has failed to meet a requirement of the program. Point cells in \"Scoring\" worksheet shaded in \"Red\" indicate that the Sponsor has failed to meet the minimum points required. "]
["Universal Application (UA) Instructions"]
["Sponsors must complete the following worksheets in the UA. "]
["General"]
["Narrative"]
["Site & Units"]
["Misc. "]
["Rents"]
["Subsidies"]
["Dev Sources"]
["Dev Budget"]
["Perm S&U"]
["TBL and High Cost Test"]
["Dev Fee 2019"]
["Supportive Services Costs"]
["Reserves"]
["Operating"]
["Cash Flow"]
["Supplemental Application Instructions"]
["Sponsor must complete the following worksheets in the Supplemental Application. "]
["B - Project Requirements"]
["B1 - Development Team Contacts"]
["B2 - SH Experience 7302(f)(1-3) (for any Supportive Housing or Special needs Units)"]
["B3 - Supportive Services Plan (for any Supportive Housing or Special needs Units)"]
["B4 - SS Verification (for any Supportive Housing or Special needs Units)"]
["B5 - At High Risk (At High Risk Projects Only)"]
["C - Local & Env Verification "]
["D - Max Loan & Unit Mix"]
["E - Project Selection"]
["F - Certification & Legal"]
["Disclosure of Application: Information provided in this application and attachments will become a public record available for review by the public pursuant to the Public Records Act.  As such, any materials provided will be disclosable to any person making a public records request.  Please use discretion in providing HCD with information that is not specifically requested, including but not limited to, bank account numbers, personal phone numbers and home addresses.  By providing this information to HCD, the Sponsor is waiving any claim of confidentiality and consents to the disclosure of all submitted material upon request."]

{"sheet":"Checklist","index":2,"n_rows":122,"n_cols":35,"rows_kept":122,"cut":false,"hidden":false,"merged":[[89,3,89,11],[89,12,89,33],[88,3,88,11],[88,12,88,33],[12,3,12,11],[12,12,12,33],[12,34,12,37],[120,34,120,37],[87,3,87,11],[87,12,87,33],[117,3,117,11],[117,12,117,33],[116,3,116,11],[116,12,116,33],[115,3,115,11],[115,12,115,33],[113,3,113,11],[113,12,113,33],[114,3,114,11],[86,3,86,11],[86,12,86,33],[110,3,110,11],[110,12,110,33],[58,3,58,11],[8,3,8,11],[8,12,8,33],[7,3,7,11],[7,12,7,33],[21,3,21,11],[21,12,21,33],[20,3,20,11],[20,12,20,33],[19,3,19,11],[19,12,19,33],[13,0,13,37],[16,3,16,11],[16,12,16,33],[17,12,17,33],[17,34,17,37],[18,34,18,37],[18,12,18,33],[21,34,21,37],[16,0,16,2],[17,0,17,2],[18,0,18,2],[19,0,19,2],[20,0,20,2],[21,0,21,2],[121,3,121,11],[121,12,121,33],[119,3,119,11],[119,12,119,33],[118,3,118,11],[118,12,118,33],[120,3,120,11],[120,12,120,33],[111,3,111,11],[111,12,111,33],[114,12,114,33],[58,12,58,33],[103,3,103,11],[103,12,103,33],[107,0,107,2],[108,3,108,11],[108,12,108,33],[109,3,109,11],[109,12,109,33],[108,0,108,2],[109,0,109,2],[91,3,91,11],[91,12,91,33],[94,3,94,11],[94,12,94,33],[93,3,93,11],[93,12,93,33],[91,0,91,2],[92,0,92,2],[93,0,93,2],[94,0,94,2],[73,0,73,2],[74,0,74,2],[75,0,75,2],[80,3,80,11],[110,0,110,2],[112,3,112,11],[112,12,112,33],[101,3,101,11],[101,12,101,33],[97,3,97,11],[97,12,97,33],[98,3,98,11],[98,12,98,33],[107,3,107,11],[107,12,107,33],[105,3,105,11],[105,12,105,33],[106,3,106,11],[106,12,106,33],[102,3,102,11],[102,12,102,33],[103,0,103,2],[105,0,105,2],[106,0,106,2],[99,0,99,2],[99,3,99,11],[99,12,99,33],[84,34,84,37],[85,34,85,37],[83,3,83,11],[83,12,83,33],[82,3,82,11],[82,12,82,33],[82,34,82,37],[83,34,83,37],[85,3,85,11],[85,12,85,33],[84,3,84,11],[84,12,84,33],[81,34,81,37],[76,3,76,11],[76,12,76,33],[77,3,77,11],[77,12,77,33],[76,34,76,37],[77,34,77,37],[81,3,81,11],[81,12,81,33],[76,0,76,2],[77,0,77,2],[79,0,79,2],[80,0,80,2],[71,34,71,37],[73,34,73,37],[74,3,74,11],[74,12,74,33],[75,3,75,11],[75,12,75,33],[74,34,74,37],[75,34,75,37],[73,3,73,11],[73,12,73,33],[80,12,80,33],[80,34,80,37],[70,3,70,11],[70,12,70,33],[71,3,71,11],[71,12,71,33],[67,3,67,11],[67,12,67,33],[67,0,67,2],[68,0,68,2],[70,0,70,2],[71,0,71,2],[63,3,63,11],[63,12,63,33],[64,0,64,2],[65,3,65,11],[65,12,65,33],[66,3,66,11],[66,12,66,33],[65,0,65,2],[66,0,66,2],[54,34,54,37],[55,34,55,37],[53,3,53,11],[57,3,57,11],[57,12,57,33],[56,3,56,11],[56,12,56,33],[56,34,56,37],[57,34,57,37],[49,3,49,11],[49,12,49,33],[48,3,48,11],[48,12,48,33],[48,34,48,37],[49,34,49,37],[48,0,48,2],[49,0,49,2],[53,12,53,33],[52,34,52,37],[53,34,53,37],[50,3,50,11],[50,12,50,33],[45,3,45,11],[45,12,45,33],[44,3,44,11],[44,12,44,33],[44,34,44,37],[45,34,45,37],[44,0,44,2],[45,0,45,2],[47,3,47,11],[47,12,47,33],[46,3,46,11],[46,12,46,33],[46,34,46,37],[47,34,47,37],[46,0,46,2],[47,0,47,2],[43,3,43,11],[43,12,43,33],[40,3,40,11],[40,12,40,33],[39,0,39,2],[40,0,40,2],[41,0,41,2],[43,0,43,2],[40,34,40,37],[43,34,43,37],[39,34,39,37],[42,0,42,37],[41,3,41,11],[41,12,41,33],[31,34,31,37],[97,34,97,37],[16,34,16,37],[0,34,0,37],[79,3,79,11],[79,12,79,33],[11,3,11,11],[11,12,11,33],[11,34,11,37],[79,34,79,37],[0,0,0,33],[5,3,5,11],[5,12,5,33],[14,3,14,11],[14,12,14,33],[15,3,15,11],[15,12,15,33],[14,34,14,37],[15,34,15,37],[14,0,14,2],[15,0,15,2],[19,34,19,37],[20,34,20,37],[18,3,18,11],[96,3,96,11],[96,12,96,33],[95,3,95,11],[6,3,6,11],[6,12,6,33],[4,3,4,11],[4,12,4,33],[111,34,111,37],[110,34,110,37],[109,34,109,37],[108,34,108,37],[107,34,107,37],[106,34,106,37],[105,34,105,37],[86,34,86,37],[87,34,87,37],[88,34,88,37],[89,34,89,37],[104,0,104,37],[93,34,93,37],[94,34,94,37],[95,34,95,37],[96,34,96,37],[100,0,100,37],[98,34,98,37],[101,34,101,37],[102,34,102,37],[103,34,103,37],[121,34,121,37],[119,34,119,37],[118,34,118,37],[117,34,117,37],[116,34,116,37],[115,34,115,37],[114,34,114,37],[113,34,113,37],[112,34,112,37],[99,34,99,37],[95,12,95,33],[51,0,51,37],[60,0,60,37],[69,0,69,37],[72,0,72,37],[78,0,78,37],[90,0,90,37],[91,34,91,37],[92,34,92,37],[58,34,58,37],[61,34,61,37],[62,34,62,37],[63,34,63,37],[64,34,64,37],[65,34,65,37],[66,34,66,37],[67,34,67,37],[70,34,70,37],[52,3,52,11],[52,12,52,33],[92,3,92,11],[92,12,92,33],[55,3,55,11],[55,12,55,33],[24,34,24,37],[25,34,25,37],[26,34,26,37],[27,34,27,37],[28,34,28,37],[29,34,29,37],[30,34,30,37],[1,0,1,37],[2,0,2,37],[3,0,3,37],[4,34,4,37],[5,34,5,37],[6,34,6,37],[7,34,7,37],[8,34,8,37],[9,3,9,11],[9,12,9,33],[10,3,10,11],[10,12,10,33],[9,34,9,37],[10,34,10,37],[17,3,17,11],[23,0,23,37],[25,3,25,11],[22,3,22,11],[22,12,22,33],[32,3,32,11],[32,12,32,33],[25,12,25,33],[24,3,24,11],[24,12,24,33],[27,3,27,11],[27,12,27,33],[26,3,26,11],[26,12,26,33],[29,3,29,11],[29,12,29,33],[28,3,28,11],[28,12,28,33],[31,3,31,11],[31,12,31,33],[30,3,30,11],[30,12,30,33],[32,0,32,2],[34,0,34,2],[35,0,35,2],[37,3,37,11],[37,12,37,33],[36,3,36,11],[36,12,36,33],[39,3,39,11],[39,12,39,33],[38,3,38,11],[38,12,38,33],[35,3,35,11],[35,12,35,33],[34,3,34,11],[34,12,34,33],[59,3,59,11],[59,12,59,33],[68,3,68,11],[68,12,68,33],[50,0,50,2],[52,0,52,2],[53,0,53,2],[54,0,54,2],[55,0,55,2],[56,0,56,2],[57,0,57,2],[58,0,58,2],[59,0,59,2],[61,0,61,2],[62,0,62,2],[63,0,63,2],[54,3,54,11],[54,12,54,33],[61,3,61,11],[61,12,61,33],[62,3,62,11],[62,12,62,33],[64,3,64,11],[64,12,64,33],[4,0,4,2],[5,0,5,2],[6,0,6,2],[7,0,7,2],[8,0,8,2],[9,0,9,2],[10,0,10,2],[11,0,11,2],[12,0,12,2],[22,0,22,2],[24,0,24,2],[25,0,25,2],[81,0,81,2],[82,0,82,2],[83,0,83,2],[84,0,84,2],[85,0,85,2],[86,0,86,2],[36,0,36,2],[37,0,37,2],[38,0,38,2],[33,0,33,37],[34,34,34,37],[35,34,35,37],[36,34,36,37],[37,34,37,37],[38,34,38,37],[26,0,26,2],[27,0,27,2],[28,0,28,2],[29,0,29,2],[30,0,30,2],[31,0,31,2],[87,0,87,2],[88,0,88,2],[89,0,89,2],[95,0,95,2],[96,0,96,2],[97,0,97,2],[98,0,98,2],[101,0,101,2],[102,0,102,2],[120,0,120,2],[121,0,121,2],[111,0,111,2],[112,0,112,2],[113,0,113,2],[114,0,114,2],[115,0,115,2],[116,0,116,2],[117,0,117,2],[118,0,118,2],[119,0,119,2]]}
["Multifamily Housing Program (MHP) Document Checklist",null,null,null,null,null,null,null,null,null,null,null,null,null,null,null,null,null,null,null,null,null,null,null,null,null,null,null,null,null,null,null,null,null,{"$f":"'B - Project Requirements'!AJ1","v":"2020-01-07"}]
["Packaging instructions for the MHP application submission:"]
["  (1) Submit hardcopies of documents requiring wet signatures as identified below through a mail carrier service such as U.S. Postal Service, UPS, FedEx or other carrier services that provide date stamp verification confirming delivery no later than 5:00 p.m. Pacific Standard Time on March 2, 2020."]
["  (2) Use the electronic file name descriptions below for the electronic submission via the FAAST system. Application materials, workbooks and supporting documentation to be submitted no later than 5:00 p.m. Pacific Standard Time on March 2, 2020."]
["Wet Signatures Required",null,null,"Electronic File Name",null,null,null,null,null,null,null,null,"Document Description",null,null,null,null,null,null,null,null,null,null,null,null,null,null,null,null,null,null,null,null,null,"Included?"]
[null,null,null,"1. Document Checklist",null,null,null,null,null,null,null,null,"Document Checklist."]
["X",null,null,"2. UA",null,null,null,null,null,null,null,null,"Universal Application."]
["X",null,null,"3. SA",null,null,null,null,null,null,null,null,"MHP Supplemental Application."]
[null,null,null,"4. LOE",null,null,null,null,null,null,null,null,"Letters of Explanation."]
[null,null,null,"5. Rehab Description",null,null,null,null,null,null,null,null,"Narrative of current condition of structure(s) and description of overall scope of work. Include a discussion of any proposed modification to unit configurations, unit mix, need for seismic retrofit, or modifications in use (e.g., commercial/tourist hotel to SRO or studio apartments) (rehab only)."]
[null,null,null,"6. PNA or CNA",null,null,null,null,null,null,null,null,"Physical Needs Assessment or Capital Needs Assessments by qualified independent third party contractor (rehab only)."]
[null,null,null,"7. Rent Roll",null,null,null,null,null,null,null,null,"Current rent roll, tenant income & household size info, submit by unit (rehab only)."]
[null,null,null,"8. Leg Letter",null,null,null,null,null,null,null,null,"Per Health & Safety Code §50675.7(e) Applicant must notify the local legislative body (City Council or County Board of Supervisors) of the Sponsor’s loan application prior to application submission."]
["Sponsor Organizational Documents"]
["X",null,null,"9a. Spon1 Cert & Legal Disclosure",null,null,null,null,null,null,null,null,"Certification & Legal Status."]
[null,null,null,"9b. Spon1 Resolution",null,null,null,null,null,null,null,null,"Resolution."]
[null,null,null,"9c. Spon1 OrgDoc1, OrgDoc2, etc…",null,null,null,null,null,null,null,null,"Organizational Documents for entity type (See \"Sponsor Org Docs\" worksheet)."]
[null,null,null,"9d. Spon1 OrgChart",null,null,null,null,null,null,null,null,"Organization Chart."]
[null,null,null,"9e. Spon1 Signature Block",null,null,null,null,null,null,null,null,"Signature Block (in Word format)."]
["X",null,null,"9f. Spon1 STD 204 Payee Data Record",null,null,null,null,null,null,null,null,"Payee Data Record STD 204 (required for private AND public entities)."]
["X",null,null,"9g. Spon1 Fi$CAL TIN Form",null,null,null,null,null,null,null,null,"Taxpayer Identification Number (TIN) (public entities ONLY)."]
[null,null,null,"9h. Spon1 Cert of Good Standing ",null,null,null,null,null,null,null,null,"Certificate of Good Standing must be dated 30 days or less from the application due date."]
[null,null,null,"9i. Spon1 Tax-Exempt Status",null,null,null,null,null,null,null,null,"Evidence of tax-exempt status from IRS and evidence of tax-exempt status from FTB for Corporations."]
["Sponsor 2 Org Documents (If Applicable)"]
["X",null,null,"10a. Spon2 Cert & Legal Disclosure",null,null,null,null,null,null,null,null,"Certification & Legal Status."]
[null,null,null,"10b. Spon2 Resolution",null,null,null,null,null,null,null,null,"Resolution."]
[null,null,null,"10c. Spon2 OrgDoc1, OrgDoc2, etc…",null,null,null,null,null,null,null,null,"Organizational Documents for entity type (See \"Sponsor Org Docs\" worksheet)."]
[null,null,null,"10d. Spon2 OrgChart",null,null,null,null,null,null,null,null,"Organization Chart."]
[null,null,null,"10e. Spon2 Signature Block",null,null,null,null,null,null,null,null,"Signature Block (in Word format)."]
["X",null,null,"10f. Spon2 STD 204 Payee Data Record",null,null,null,null,null,null,null,null,"Payee Data Record STD 204 (required for private AND public entities)."]
["X",null,null,"10g. Spon2 Fi$CAL TIN Form",null,null,null,null,null,null,null,null,"Taxpayer Identification Number (TIN) (public entities ONLY). "]
[null,null,null,"10h. Spon2 Cert of Good Standing ",null,null,null,null,null,null,null,null,"Certificate of Good Standing must be dated 30 days or less from the application due date."]
[null,null,null,"10i. Spon2 Tax-Exempt Status",null,null,null,null,null,null,null,null,"Evidence of tax-exempt status from IRS and evidence of tax-exempt status from FTB for Corporations."]
["Borrower Organizational Documents"]
["X",null,null,"11a. Bwr Cert & Legal Disclosure",null,null,null,null,null,null,null,null,"Certification & Legal Status."]
[null,null,null,"11b. Bwr Resolution",null,null,null,null,null,null,null,null,"Resolution."]
[null,null,null,"11c. Bwr OrgDoc1, OrgDoc2, etc…",null,null,null,null,null,null,null,null,"Organizational Documents for entity type (See \"Sponsor Org Docs\" worksheet)."]
[null,null,null,"11d. Bwr OrgChart",null,null,null,null,null,null,null,null,"Organization Chart."]
[null,null,null,"11e. Bwr Signature Block",null,null,null,null,null,null,null,null,"Signature Block (in Word format)."]
["X",null,null,"11f. Bwr STD 204 Payee Data Record",null,null,null,null,null,null,null,null,"Payee Data Record STD 204 (required for private AND public entities)."]
["X",null,null,"11g. Bwr Fi$CAL TIN Form",null,null,null,null,null,null,null,null,"Taxpayer Identification Number (TIN) (public entities ONLY)."]
[null,null,null,"11h. Bwr Tax-Exempt Status",null,null,null,null,null,null,null,null,"Evidence of tax-exempt status from IRS and evidence of tax-exempt status from FTB for Corporations."]
["MGP Org documents (if different from Sponsor)"]
["X",null,null,"12a. MGP Cert & Legal Disclosure",null,null,null,null,null,null,null,null,"Certification & Legal Status."]
[null,null,null,"12b. MGP Resolution",null,null,null,null,null,null,null,null,"Resolution."]
[null,null,null,"12c. MGP OrgDoc1, OrgDoc2, etc…",null,null,null,null,null,null,null,null,"Organizational Documents for entity type (See \"Sponsor Org Docs\" worksheet)."]
[null,null,null,"12d. MGP OrgChart",null,null,null,null,null,null,null,null,"Organization Chart."]
[null,null,null,"12e. MGP Signature Block",null,null,null,null,null,null,null,null,"Signature Block (in Word format)."]
["X",null,null,"12f. MGP STD 204 Payee Data Record",null,null,null,null,null,null,null,null,"Payee Data Record STD 204 (required for private AND public entities)."]
["X",null,null,"12g. MGP Fi$CAL TIN Form",null,null,null,null,null,null,null,null,"Taxpayer Identification Number (TIN) (public entities ONLY)."]
[null,null,null,"12h. MGP Tax-Exempt Status",null,null,null,null,null,null,null,null,"Evidence of tax-exempt status from IRS and evidence of tax-exempt status from FTB for Corporations."]
["AGP #1 Org documents (if different from Sponsor)"]
["X",null,null,"13a. AGP1 Cert & Legal Disclosure",null,null,null,null,null,null,null,null,"Certification & Legal Status."]
[null,null,null,"13b. AGP1 Resolution",null,null,null,null,null,null,null,null,"Resolution."]
[null,null,null,"13c. AGP1 OrgDoc1, OrgDoc2, etc…",null,null,null,null,null,null,null,null,"Organizational Documents for entity type (See \"Sponsor Org Docs\" workseet)."]
[null,null,null,"13d. AGP1 OrgChart",null,null,null,null,null,null,null,null,"Organization Chart."]
[null,null,null,"13e. AGP1 Signature Block",null,null,null,null,null,null,null,null,"Signature Block (in Word format)."]
["X",null,null,"13f. AGP1 STD 204 Payee Data Record",null,null,null,null,null,null,null,null,"Payee Data Record STD 204 (required for private AND public entities)."]
["X",null,null,"13g. AGP1 Fi$CAL TIN Form",null,null,null,null,null,null,null,null,"Taxpayer Identification Number (TIN) (public entities ONLY)."]
[null,null,null,"13h. AGP1 Tax-Exempt Status",null,null,null,null,null,null,null,null,"Evidence of tax-exempt status from IRS and evidence of tax-exempt status from FTB for Corporations."]
["AGP #2 Organizational documents"]
["X",null,null,"14a. AGP2 Cert & Legal Disclosure",null,null,null,null,null,null,null,null,"Certification & Legal Status."]
[null,null,null,"14b. AGP2 Resolution",null,null,null,null,null,null,null,null,"Resolution."]
[null,null,null,"14c. AGP2 OrgDoc1, OrgDoc2, etc…",null,null,null,null,null,null,null,null,"Organizational Documents for entity type (See \"Sponsor Org Docs\" worksheet)."]
[null,null,null,"14d. AGP2 OrgChart",null,null,null,null,null,null,null,null,"Organization Chart."]
[null,null,null,"14e. AGP2 Signature Block",null,null,null,null,null,null,null,null,"Signature Block (in Word format)."]
["X",null,null,"14f. AGP2 STD 204 Payee Data Record",null,null,null,null,null,null,null,null,"Payee Data Record STD 204 (required for private AND public entities)."]
["X",null,null,"14g. AGP2 Fi$CAL TIN Form",null,null,null,null,null,null,null,null,"Taxpayer Identification Number (TIN) (public entities ONLY)."]
[null,null,null,"14h. AGP2 Tax-Exempt Status",null,null,null,null,null,null,null,null,"Evidence of tax-exempt status from IRS and evidence of tax-exempt status from FTB for Corporations."]
["Site Control"]
[null,null,null,"15. Site Control",null,null,null,null,null,null,null,null,"Site Control Documents."]
[null,null,null,"16. Preliminary Title Report",null,null,null,null,null,null,null,null,"Preliminary Title Report (prepared within 30 days of application)."]
["Legal Opinion Letters"]
[null,null,null,"17. Article XXXIV Legal Opinion",null,null,null,null,null,null,null,null,"Legal Opinion Regarding Article XXXIV."]
[null,null,null,"18. Article XXXIV Authority",null,null,null,null,null,null,null,null,"Local Jurisdiction Letter Re: Allocation of Authority to This Project (if Applicable)."]
[null,null,null,"19. Fair Housing Legal Opinion",null,null,null,null,null,null,null,null,"Legal Opinion Regarding Compliance with Fair Housing Act (Senior Projects)."]
[null,null,null,"20. Relocation",null,null,null,null,null,null,null,null,"Relocation Plan OR Narrative Explanation of Why Relocation Not Required."]
[null,null,null,"21. Op Exp Compare",null,null,null,null,null,null,null,null,"Operating Expense Comparable."]
["Supportive Housing or Special Needs Units"]
[null,null,null,"22a. Integration Plan",null,null,null,null,null,null,null,null,"For Special Needs and Supportive Housing Projects provide and Integration Plan that demonstrates how the Sponsor will meet the requirements of §7302(g)."]
[null,null,null,"22b. Sponsor SOQ",null,null,null,null,null,null,null,null,"Statement of Qualifications regarding owing and managing Special Needs Projects include list of projects."]
[null,null,null,"22c. Property Management SOQ",null,null,null,null,null,null,null,null,"Property Management Statement of Qualifications regarding owing and managing Special Needs Projects include list of projects."]
[null,null,null,"22d. LSP SOQ",null,null,null,null,null,null,null,null,"Statement of Qualifications of LSP Company & Resumes of Principles."]
[null,null,null,"22e. LSP Exp Contracts",null,null,null,null,null,null,null,null,"Executed contracts must be attached for experience to count.  Attach only these pages of the contract:  page(s) identifying the Project name, scope of work; term of the contract or agreement; and execution page(s) showing all signatures of all parties to the contracts."]
[null,null,null,"22f. Supportive Service Plan",null,null,null,null,null,null,null,null,"Supportive Service Plan worksheet."]
[null,null,null,"22g. LSP NonSpon SS Contract Basic",null,null,null,null,null,null,null,null,"Lead Service Provider Contract, Agreement or Letter of Intent (non Sponsor provider)."]
[null,null,null,"22h. NonSpon SS Contract Enhanced",null,null,null,null,null,null,null,null,"Contract, Agreement or Letter of Intent to Provide Services (other non Sponsor providers)."]
[null,null,null,"22i. Duty Stmt1, Duty Stmt2, Duty Stmt3, Duty Stmt4",null,null,null,null,null,null,null,null,"Staff Duty Statements (all providers)."]
[null,null,null,"22j. SS Fund Ltr1, SS Fund Ltr2, SS Fund Ltr3, etc…",null,null,null,null,null,null,null,null,"Supportive Services Verification worksheet (completed & signed)."]
[null,null,null,"22k. SS Fund Ltr1, SS Fund Ltr2, SS Fund Ltr3, etc…",null,null,null,null,null,null,null,null,"Services Funding commitment Letter."]
["Project Selection"]
[null,null,null,"23. Opportunity Area ",null,null,null,null,null,null,null,null,"Documentation of TCAC/HCD Opportunity Area status."]
[null,null,null,"24. Utility Allowance",null,null,null,null,null,null,null,null,"Utility Allowance Schedule of Local PHA or other (i.e. CUAC)."]
[null,null,null,"25. Subsidy Commitment",null,null,null,null,null,null,null,null,"Letter of Intent or Contract for Rental Assistance/Operating Subsidy."]
[null,null,null,"26. Fair Market Rents",null,null,null,null,null,null,null,null,"Local Housing Authority Current Fair Market Rents or Payment Standard."]
[null,null,null,"27. Trans Res Calc",null,null,null,null,null,null,null,null,"Transition Reserve Calculation & Methodology."]
[null,null,null,"28. Rural Status Determination",null,null,null,null,null,null,null,null,"Rural Status Determination."]
[null,null,null,"29. Spon Comp1, Spon Comp2, Spon Comp3, etc…",null,null,null,null,null,null,null,null,"Document with Notice of Completion, Placed in Service, Certificate of Occupancy or equivalent."]
[null,null,null,"30. Dev Comp1, Dev Comp2, Dev Comp3, etc…",null,null,null,null,null,null,null,null,"Placed in Service, Certificate of Occupancy or equivalent."]
[null,null,null,"31. CES Narritive ",null,null,null,null,null,null,null,null,"Provide a narrative describing how vacancies will be filled by referrals from the local coordinated entry system, when and where this system is actively referring households to housing."]
["Special Needs Project Alternative Scoring Only"]
[null,null,null,"32a. Dev Cont1, Dev Cont2, Dev Cont3, etc…",null,null,null,null,null,null,null,null,"Proposed or executed development services agreement between sponsor and developer. "]
[null,null,null,"32b. SPOwn Comp1, SPOwn Comp2, SPOwn Comp3, etc…",null,null,null,null,null,null,null,null,"Notice of Completion, Placed in Service, Certificate of Occupancy or equivalent for Developer."]
[null,null,null,"32c. Own Nar1, Own Nar2, Own Nar3, etc…",null,null,null,null,null,null,null,null,"Narrative description of job title or position, roles, and responsibilities of Sponsor for each project listed above for Ownership/Operation Experience to document operation experience."]
["Reports"]
[null,null,null,"33. Appraisal",null,null,null,null,null,null,null,null,"Appraisal (required if land cost or value is included in development budget)."]
[null,null,null,"34. Market Study",null,null,null,null,null,null,null,null,"Market Study (prepared in accordance with TCAC 2019 Market Study Guideline)."]
[null,null,null,"35. Phase I",null,null,null,null,null,null,null,null,"Phase I Site Assessment & VES (prepared within 12 months prior to date of application)."]
[null,null,null,"36. Phase II",null,null,null,null,null,null,null,null,"Phase II Soils Report (If recommended by the Phase I)."]
[null,null,null,"37. Asbestos",null,null,null,null,null,null,null,null,"Asbestos Report (for structures built prior to 1978) (rehab only)."]
[null,null,null,"38. Lead Based Paint",null,null,null,null,null,null,null,null,"Lead Based Paint Report (for structures built prior to 1978) (rehab only)."]
[null,null,null,"39. Mold",null,null,null,null,null,null,null,null,"Mold Report (rehab only)."]
["X",null,null,"40. Local Approvals",null,null,null,null,null,null,null,null,"Local Jurisdiction & NEPA Verification Form (completed & signed)."]
[null,null,null,"41. NEPA",null,null,null,null,null,null,null,null,"Copy of Authority to Use Grant Funds (NHTF Verification from Responsible Entity)."]
[null,null,null,"42. CEQA",null,null,null,null,null,null,null,null,"Copy of CEQA Determination Documents."]
[null,null,null,"43. Const EFC #1, #2, etc",null,null,null,null,null,null,null,null,"Enforceable Construction Financing Commitments."]
[null,null,null,"44. Perm EFC #1, #2, etc",null,null,null,null,null,null,null,null,"Enforceable Permanent Financing Commitments."]
[null,null,null,"45. Adaptive Reuse Narrative",null,null,null,null,null,null,null,null,"Narrative Description of Infill Development & Adaptive Reuse Proposal."]
[null,null,null,"46. Scaled Distance Map",null,null,null,null,null,null,null,null,"Amenities Map (Scaled Distance Map of 1,2 and 3 miles as applicable)."]
[null,null,null,"47. Amenities List",null,null,null,null,null,null,null,null,"Amenities List (include name & address distance from project)."]
[null,null,null,"48. Sustainable Methods",null,null,null,null,null,null,null,null,"Provide supporting documentation of sustainable building methods, which can include Energy Scorecard, TCAC Application section signed by Architect, or letter from Architect confirming energy efficient methods to be used."]
[null,null,null,"49. Compliance and Verification",null,null,null,null,null,null,null,null,"Sustainable Building Methods Narrative & Commitment."]

{"sheet":"B - Project Requirements","index":3,"n_rows":174,"n_cols":76,"rows_kept":174,"cut":false,"hidden":false,"merged":[[124,30,124,35],[124,36,124,37],[125,0,125,4],[125,5,125,12],[125,13,125,29],[125,30,125,35],[125,36,125,37],[110,0,110,4],[110,5,110,12],[110,13,110,29],[110,30,110,35],[110,36,110,37],[111,0,111,4],[111,5,111,12],[111,13,111,29],[111,30,111,35],[111,36,111,37],[115,32,115,33],[123,36,123,37],[82,0,82,4],[82,5,82,12],[82,13,82,29],[82,30,82,35],[82,36,82,37],[83,0,83,4],[83,5,83,12],[83,13,83,29],[83,30,83,35],[83,36,83,37],[46,0,46,4],[46,5,46,12],[46,13,46,29],[46,30,46,35],[46,36,46,37],[47,0,47,4],[47,5,47,12],[47,13,47,29],[47,30,47,35],[47,36,47,37],[79,36,79,37],[78,36,78,37],[77,36,77,37],[76,13,76,29],[77,13,77,29],[76,30,76,35],[77,30,77,35],[78,5,78,12],[76,5,76,12],[77,5,77,12],[78,13,78,29],[76,36,76,37],[78,30,78,35],[79,13,79,29],[79,30,79,35],[74,20,74,22],[74,23,74,29],[72,34,72,37],[72,22,72,27],[73,34,73,37],[75,22,75,27],[75,28,75,29],[75,2,75,20],[68,0,68,7],[74,0,74,3],[74,4,74,11],[74,33,74,37],[72,28,72,29],[72,30,72,32],[69,0,69,35],[69,36,69,37],[75,30,75,32],[68,29,68,31],[73,25,73,31],[71,0,71,2],[73,0,73,3],[73,4,73,12],[73,14,73,19],[73,20,73,24],[52,23,52,30],[52,31,52,32],[52,20,52,22],[58,0,58,4],[67,29,67,31],[63,0,63,37],[58,36,58,37],[67,35,67,37],[59,13,59,29],[60,0,60,4],[60,5,60,12],[66,8,66,16],[53,0,53,1],[56,0,56,4],[53,28,53,29],[60,13,60,29],[60,30,60,35],[61,0,61,4],[61,5,61,12],[61,13,61,29],[61,30,61,35],[61,36,61,37],[62,0,62,4],[62,5,62,12],[58,5,58,12],[56,30,56,35],[53,34,53,37],[53,2,53,20],[54,0,54,4],[55,30,55,35],[59,5,59,12],[66,17,66,28],[67,17,67,28],[55,13,55,29],[55,0,55,4],[57,5,57,12],[56,5,56,12],[55,5,55,12],[62,13,62,29],[62,30,62,35],[62,36,62,37],[30,5,30,12],[52,13,52,19],[35,22,35,27],[35,2,35,20],[45,0,45,4],[45,5,45,12],[45,13,45,29],[45,30,45,35],[51,34,51,37],[51,4,51,12],[36,20,36,24],[38,0,38,1],[38,2,38,20],[37,21,37,22],[48,11,48,13],[48,14,48,37],[42,36,42,37],[40,30,40,35],[37,31,37,32],[37,33,37,37],[41,36,41,37],[52,33,52,37],[32,0,32,37],[51,0,51,3],[49,0,49,10],[49,11,49,27],[59,36,59,37],[55,36,55,37],[50,34,50,37],[59,0,59,4],[79,5,79,12],[59,30,59,35],[57,0,57,4],[57,30,57,35],[75,34,75,37],[75,0,75,1],[79,0,79,4],[76,0,76,4],[77,0,77,4],[78,0,78,4],[53,22,53,27],[53,30,53,32],[66,35,66,37],[65,0,65,35],[54,30,54,35],[54,13,54,29],[58,13,58,29],[58,30,58,35],[86,34,86,37],[90,0,90,4],[95,5,95,12],[100,2,100,20],[100,22,100,27],[100,30,100,32],[100,34,100,37],[34,34,34,37],[50,0,50,1],[35,34,35,37],[57,36,57,37],[54,5,54,12],[57,13,57,29],[56,13,56,29],[51,14,51,19],[39,13,39,29],[51,32,51,33],[40,36,40,37],[36,32,36,33],[43,30,43,35],[44,5,44,12],[51,20,51,24],[51,25,51,31],[50,30,50,32],[101,0,101,3],[101,4,101,12],[99,0,99,2],[99,3,99,25],[99,26,99,29],[99,30,99,37],[95,13,95,29],[95,0,95,4],[100,0,100,1],[100,28,100,29],[96,0,96,4],[96,5,96,12],[96,13,96,29],[96,30,96,35],[96,36,96,37],[97,0,97,4],[97,5,97,12],[97,13,97,29],[97,30,97,35],[97,36,97,37],[142,0,142,4],[117,0,117,1],[117,2,117,20],[117,22,117,27],[117,28,117,29],[122,0,122,4],[136,5,136,12],[142,30,142,35],[142,5,142,12],[139,5,139,12],[138,5,138,12],[139,13,139,29],[138,13,138,29],[141,0,141,35],[136,0,136,4],[137,0,137,4],[121,30,121,35],[121,13,121,29],[120,0,120,4],[122,13,122,29],[140,0,140,35],[124,0,124,4],[124,5,124,12],[124,13,124,29],[31,36,31,37],[31,30,31,35],[120,13,120,29],[120,30,120,35],[34,11,34,27],[34,0,34,10],[42,5,42,12],[41,5,41,12],[40,5,40,12],[39,5,39,12],[33,11,33,13],[34,28,34,33],[35,30,35,32],[33,0,33,10],[35,0,35,1],[35,28,35,29],[89,0,89,1],[89,2,89,20],[90,36,90,37],[93,36,93,37],[95,30,95,35],[101,32,101,33],[94,36,94,37],[95,36,95,37],[86,28,86,29],[109,36,109,37],[119,13,119,29],[109,13,109,29],[116,13,116,19],[116,20,116,22],[116,23,116,30],[116,31,116,32],[116,33,116,37],[118,30,118,35],[118,36,118,37],[119,36,119,37],[119,30,119,35],[104,30,104,35],[103,2,103,20],[104,0,104,4],[103,30,103,32],[115,25,115,31],[113,30,113,37],[119,0,119,4],[104,5,104,12],[93,30,93,35],[102,0,102,3],[101,14,101,19],[141,36,141,37],[129,36,129,37],[105,0,105,4],[118,5,118,12],[116,0,116,3],[115,34,115,37],[114,34,114,37],[113,0,113,2],[113,3,113,25],[114,2,114,20],[114,22,114,27],[114,28,114,29],[114,30,114,32],[113,26,113,29],[115,4,115,12],[115,14,115,19],[115,20,115,24],[114,0,114,1],[119,5,119,12],[116,4,116,11],[118,13,118,29],[117,30,117,32],[117,34,117,37],[108,36,108,37],[173,30,173,35],[173,36,173,37],[88,33,88,37],[88,13,88,19],[88,20,88,22],[80,13,80,29],[87,34,87,37],[81,36,81,37],[87,25,87,31],[88,23,88,30],[88,31,88,32],[87,14,87,19],[87,20,87,24],[104,36,104,37],[87,32,87,33],[86,2,86,20],[86,22,86,27],[136,13,136,29],[130,0,130,35],[137,13,137,29],[123,0,123,4],[85,30,85,37],[91,36,91,37],[93,0,93,4],[9,0,9,10],[0,32,0,34],[31,13,31,29],[31,0,31,4],[115,0,115,3],[0,0,0,28],[1,0,1,37],[3,17,3,21],[27,36,27,37],[29,36,29,37],[65,36,65,37],[66,0,66,7],[67,0,67,7],[67,32,67,34],[66,29,66,31],[66,32,66,34],[67,8,67,16],[48,0,48,10],[49,28,49,33],[49,34,49,37],[56,36,56,37],[52,0,52,3],[52,4,52,11],[91,30,91,35],[0,35,0,37],[2,0,2,37],[7,0,7,35],[7,36,7,37],[4,30,4,32],[4,33,4,37],[3,0,3,3],[3,22,3,29],[3,34,3,37],[4,22,4,29],[4,0,4,4],[4,5,4,17],[4,18,4,21],[6,0,6,35],[6,36,6,37],[3,30,3,33],[3,4,3,16],[5,0,5,8],[5,9,5,37],[0,29,0,31],[81,13,81,29],[43,0,43,4],[40,0,40,4],[39,0,39,4],[64,36,64,37],[80,5,80,12],[80,30,80,35],[87,0,87,3],[102,4,102,11],[41,13,41,29],[42,0,42,4],[94,30,94,35],[94,5,94,12],[94,0,94,4],[102,33,102,37],[102,31,102,32],[92,5,92,12],[42,13,42,29],[41,0,41,4],[41,30,41,35],[89,28,89,29],[89,30,89,32],[90,13,90,29],[54,36,54,37],[103,0,103,1],[103,34,103,37],[105,5,105,12],[105,36,105,37],[36,25,36,31],[86,30,86,32],[85,26,85,29],[87,4,87,12],[80,0,80,4],[88,0,88,3],[81,0,81,4],[86,0,86,1],[91,13,91,29],[90,30,90,35],[91,5,91,12],[74,30,74,32],[50,28,50,29],[50,2,50,20],[37,4,37,12],[37,14,37,20],[72,0,72,1],[72,2,72,20],[71,3,71,37],[85,0,85,2],[89,22,89,27],[90,5,90,12],[107,13,107,29],[102,13,102,19],[102,20,102,22],[102,23,102,30],[106,30,106,35],[105,30,105,35],[103,22,103,27],[103,28,103,29],[105,13,105,29],[104,13,104,29],[94,13,94,29],[92,13,92,29],[93,5,93,12],[93,13,93,29],[101,34,101,37],[101,20,101,24],[101,25,101,31],[106,5,106,12],[106,13,106,29],[31,5,31,12],[68,32,68,34],[68,8,68,16],[68,35,68,37],[68,17,68,28],[73,32,73,33],[74,13,74,19],[92,30,92,35],[88,4,88,11],[80,36,80,37],[81,30,81,35],[81,5,81,12],[89,34,89,37],[85,3,85,25],[92,0,92,4],[91,0,91,4],[92,36,92,37],[64,0,64,35],[33,14,33,37],[50,22,50,27],[43,36,43,37],[44,13,44,29],[36,0,36,3],[44,0,44,4],[106,0,106,4],[109,30,109,35],[109,5,109,12],[109,0,109,4],[118,0,118,4],[106,36,106,37],[107,36,107,37],[108,0,108,4],[107,0,107,4],[107,30,107,35],[107,5,107,12],[108,5,108,12],[108,13,108,29],[108,30,108,35],[148,36,148,37],[135,30,135,35],[133,36,133,37],[123,30,123,35],[123,5,123,12],[123,13,123,29],[135,5,135,12],[132,36,132,37],[132,0,132,35],[128,36,128,37],[130,36,130,37],[135,36,135,37],[147,0,147,37],[138,36,138,37],[145,34,145,37],[145,25,145,33],[145,11,145,24],[145,0,145,10],[143,20,143,21],[143,22,143,28],[143,31,143,35],[138,30,138,35],[139,30,139,35],[144,36,144,37],[152,9,152,10],[152,0,152,8],[151,0,151,37],[154,0,154,35],[154,36,154,37],[155,30,155,35],[155,36,155,37],[120,36,120,37],[121,0,121,4],[121,5,121,12],[120,5,120,12],[121,36,121,37],[122,36,122,37],[122,30,122,35],[122,5,122,12],[149,13,149,29],[148,13,148,29],[149,0,149,4],[149,30,149,35],[149,36,149,37],[149,5,149,12],[148,5,148,12],[148,30,148,35],[148,0,148,4],[173,5,173,12],[173,13,173,29],[173,0,173,4],[161,13,161,29],[166,0,166,37],[172,36,172,37],[170,0,170,37],[162,0,162,37],[163,0,163,35],[163,36,163,37],[164,0,164,37],[165,0,165,35],[165,36,165,37],[169,0,169,35],[169,36,169,37],[167,0,167,35],[167,36,167,37],[168,0,168,37],[161,0,161,4],[161,36,161,37],[172,0,172,4],[172,5,172,12],[161,5,161,12],[171,0,171,37],[172,13,172,29],[172,30,172,35],[160,0,160,35],[150,14,150,35],[150,12,150,13],[156,30,156,35],[156,36,156,37],[153,0,153,37],[152,36,152,37],[156,5,156,12],[155,5,155,12],[158,0,158,35],[158,36,158,37],[159,0,159,37],[157,0,157,37],[155,13,155,29],[160,36,160,37],[161,30,161,35],[150,0,150,11],[156,13,156,29],[150,36,150,37],[152,11,152,35],[156,0,156,4],[155,0,155,4],[23,0,23,35],[23,36,23,37],[30,0,30,4],[24,36,24,37],[24,0,24,35],[29,0,29,4],[28,0,28,4],[30,36,30,37],[28,30,28,35],[27,30,27,35],[27,13,27,29],[28,13,28,29],[29,13,29,29],[27,5,27,12],[28,5,28,12],[29,5,29,12],[25,0,25,35],[25,36,25,37],[27,0,27,4],[30,13,30,29],[30,30,30,35],[26,0,26,37],[28,36,28,37],[29,30,29,35],[8,0,8,35],[8,36,8,37],[16,0,16,35],[16,36,16,37],[18,0,18,35],[18,36,18,37],[19,0,19,35],[19,36,19,37],[22,0,22,35],[22,36,22,37],[21,0,21,35],[21,36,21,37],[12,0,12,4],[12,5,12,11],[12,30,12,35],[12,36,12,37],[10,0,10,35],[12,12,12,29],[10,36,10,37],[14,0,14,31],[17,0,17,35],[9,11,9,37],[17,36,17,37],[14,32,14,37],[39,36,39,37],[44,36,44,37],[43,5,43,12],[43,13,43,29],[36,34,36,37],[42,30,42,35],[36,4,36,12],[36,14,36,19],[40,13,40,29],[38,28,38,29],[38,30,38,32],[38,22,38,27],[37,23,37,30],[142,36,142,37],[137,5,137,12],[136,30,136,35],[137,36,137,37],[139,36,139,37],[136,36,136,37],[11,26,11,37],[11,0,11,25],[128,0,128,4],[128,5,128,12],[128,13,128,29],[13,0,13,35],[15,5,15,11],[15,12,15,29],[15,30,15,35],[15,0,15,4],[13,36,13,37],[15,36,15,37],[20,0,20,35],[20,36,20,37],[37,0,37,3],[44,30,44,35],[38,34,38,37],[39,30,39,35],[146,0,146,37],[137,30,137,35],[126,10,126,11],[133,0,133,35],[134,0,134,37],[135,0,135,4],[129,0,129,35],[131,25,131,26],[131,0,131,24],[131,27,131,35],[128,30,128,35],[135,13,135,29],[126,0,126,9],[131,36,131,37],[126,12,126,37],[127,0,127,37],[143,29,143,30],[142,13,142,29],[143,36,143,37],[138,0,138,4],[139,0,139,4],[144,0,144,35],[143,0,143,19],[140,36,140,37]]}
["Project Requirements",null,null,null,null,null,null,null,null,null,null,null,null,null,null,null,null,null,null,null,null,null,null,null,null,null,null,null,null,"FAAST#:",null,null,null,null,null,{"$f":"'MHP Cover Page'!C46","v":"2020-01-07"}]
["Projects with one or more Supportive Housing or Special Needs units must also complete: B2 - SH Experience, B3 - Supportive Services Plan, and B4 - SS Verification. At High Risk projects must also complete the At High Risk worksheet."]
["Eligible Project §7302, §7320(a)(2)"]
["Project Name:",null,null,null,null,null,null,null,null,null,null,null,null,null,null,null,null,"(a) Project Development Type:",null,null,null,null,null,null,null,null,null,null,null,null,"Project County:"]
["Project Address:",null,null,null,null,null,null,null,null,null,null,null,null,null,null,null,null,null,"Project City:",null,null,null,null,null,null,null,null,null,null,null,"Project Zip:"]
["Assessor Parcel Numbers (APNs):"]
["(b) Do you certify other development funding sources, including all tax credit equity generated by the Project, are insufficient to cover Project development costs?"]
["(c) Do you certify that at the time of the application due date, the construction or rehabilitation work has not commenced, except for emergency repairs to existing structures required to eliminate hazards or threats to health and safety?"]
["(d) Do you certify that the Project does not use federal 9 percent low income housing tax credits?"]
["(e) Project Type(s) - Select all that apply:",null,null,null,null,null,null,null,null,null,null,null,null,null,null,null,null,null,null,null,null,null,null,null,null,null,null,null,null,null,null,null,null,null,null,null,null,null,null,{"$f":"IF(AO10=TRUE,1,0)","v":0},false,{"$f":"IF(AO10=TRUE,\"Large Family \",\"\")","v":""},{"$f":"IF(AND(AO10=TRUE,'D - Max Loan & Unit Mix'!AK38<0.25,'D - Max Loan & Unit Mix'!AK39<0.5),1,0)","v":0}]
["Is Project in a Rural Area as defined by H&S Code §50199.21. Sponsors must use the TCAC Method for determining rural status. Reference document on the MHP webpage and include documentation of rural status.",null,null,null,null,null,null,null,null,null,null,null,null,null,null,null,null,null,null,null,null,null,null,null,null,null,null,null,null,null,null,null,null,null,null,null,null,null,null,{"$f":"IF(AO11=TRUE,1,0)","v":0},false,{"$f":"IF(AO11=TRUE,\"Special Needs \",\"\")","v":""}]
["If Project is in a Rural Area, which methodology is being used to demonstrate that the project area is rural?",null,null,null,null,null,null,null,null,null,null,null,null,null,null,null,null,null,null,null,null,null,null,null,null,null,null,null,null,null,null,null,null,null,null,null,null,null,null,{"$f":"IF(AO12=TRUE,1,0)","v":0},false,{"$f":"IF(AO12=TRUE,\"Senior \",\"\")","v":""}]
["File Name:",null,null,null,null,{"$f":"Checklist!D97","v":"28. Rural Status Determination"},null,null,null,null,null,null,"TCAC Method for determining rural status.",null,null,null,null,null,null,null,null,null,null,null,null,null,null,null,null,null,"Uploaded to FAAST?",null,null,null,null,null,null,null,null,{"$f":"IF(AO13=TRUE,1,0)","v":0},false,{"$f":"IF(AO13=TRUE,\"Supportive Housing \",\"\")","v":""}]
["Is Project located in a High or Highest Resource Area per TCAC/HCD Opportunity Area Map? §7307(b)(2), 7320(b)(2)(A), 7320(b)(4)(C), 7320(b)(6)(D)\nhttps://www.treasurer.ca.gov/ctcac/opportunity.asp",null,null,null,null,null,null,null,null,null,null,null,null,null,null,null,null,null,null,null,null,null,null,null,null,null,null,null,null,null,null,null,null,null,null,null,null,null,null,{"$f":"IF(AO14=TRUE,1,0)","v":0},false,{"$f":"IF(AO14=TRUE,\"At High Risk \",\"\")","v":""}]
["If Yes, enter the entire TCAC/HCD Opportunity Area Map Tract ID #:"]
["File Name:",null,null,null,null,{"$f":"Checklist!D92","v":"23. Opportunity Area "},null,null,null,null,null,null,"Documentation of TCAC/HCD Opportunity Area status.",null,null,null,null,null,null,null,null,null,null,null,null,null,null,null,null,null,"Uploaded to FAAST?"]
["(1) Large Family Project: Do you certify that of the Restricted Units at least 25 percent will have three or more bedrooms, and at least an additional 25 percent will have two or more bedrooms?"]
["Does Project have more than 10 Special Needs Units?"]
["(2) Special Needs Project: Do you certify that at least 25 percent of the Restricted Units will be restricted to occupancy by Special Needs Populations, and the Project will comply with the integration requirements specified in subdivision (g) hereof?"]
["(3) Senior Project: Do you certify that all units will be restricted to residents who are 62 years of age or older under applicable provisions of Cal. Civ. Code, §51.3 and the federal Fair Housing Act (except for Projects utilizing federal funds whose programs have differing definitions for senior projects, or have the Rehabilitation of occupied developments restricted to residents 55 or older, or have Supportive Housing or Special Needs Projects also restricting occupancy to residents who are 55 years of age or older), and further be subject to state and federal fair housing laws with respect to senior housing?"]
["Does Project have more that 10 Supportive Housing Units?"]
["(4) Supportive Housing Project: Do you certify that at least 15 percent of the Restricted Units, and not less than 10 units, will be restricted to occupancy by people experiencing Chronic Homelessness, and that the Project will meet the requirements set forth in subsection (f) below. Where the local Coordinated Entry System prioritizes placements in supportive housing using an acuity measure that considers factors beyond chronic homelessness, the local measure may be employed, in lieu of requiring occupancy by people experiencing Chronic Homelessness? (must complete 'B2 - SH Experience 7302(f)(1-3)'; 'B3 - Supportive Services Plan'; and 'B4 - SS Verification' worksheets)"]
["(5) At High Risk Project: Do you certify that the Project will meet the requirements for at-risk projects set forth in TCAC Regulation, §10325(g)(4) and all of the additional characteristics in §7302(e)(5)? (must complete 'B5 - At High Risk' worksheet)"]
["Welfare and Institutions Code §8255; and §7302(f)(4) - Sponsor certifies the Project will adhere to Housing First? (required for all project types)"]
["(g) For Special Needs & Supportive Housing Projects: Project will demonstrate integration of targeted disabled populations with the general public by:\n(1) Physically integrating Assisted Units restricted to disabled persons with other units, to the maximum extent feasible and subject to reasonable health and safety requirements, consistent with 24 CFR, §8.26.\n(2) In Projects with more than 20 units, have no more than 49% of total units restricted to occupancy by persons with disabilities by Department Funding Sources, as defined in §7302(h). This limitation shall not be interpreted to preclude occupancy of any Project Units by persons with disabilities, or restrictions by other funding sources, including but not limited to TCAC, that result in more than 49% of total Project Units being restricted to persons with disabilities. It shall also not apply to projects complying with alternative requirements for demonstrating Olmstead compliance adopted by counties and approved by the Deptartment."]
["(h) Sponsor Acknowledges that the use of multiple Department Funding Sources on the same Assisted Units (subsidy stacking) is prohibited. "]
["For Acq/Rehab and Rehab projects ONLY: Provide a description of the current condition of the structure(s) and a general description of the overall scope of work. Include a discussion of any proposed modification to the unit configurations, unit mix, need for seismic retrofit, or modifications in use (e.g., commercial/tourist hotel to SRO or studio apartments). All projects must submit a Physical Needs Assessment (PNA) or Capital Needs Assessment (CNA) by a qualified independent third party contractor, which supports the proposed scope of work. Both the contractor and the PNA are subject to HCD approval. Attach a copy of the current rent roll and tenant income and household size information, submit by unit."]
["File Name:",null,null,null,null,{"$f":"Checklist!D10","v":"5. Rehab Description"},null,null,null,null,null,null,null,"Narrative of current condition of structure(s) and description of overall scope of work. Include a discussion of any proposed modification to unit configurations, unit mix, need for seismic retrofit, or modifications in use (e.g., commercial/tourist hotel to SRO or studio apartments).",null,null,null,null,null,null,null,null,null,null,null,null,null,null,null,null,"Uploaded to FAAST?"]
["File Name:",null,null,null,null,{"$f":"Checklist!D11","v":"6. PNA or CNA"},null,null,null,null,null,null,null,"PNA or CNA by qualified independent third party contractor.",null,null,null,null,null,null,null,null,null,null,null,null,null,null,null,null,"Uploaded to FAAST?"]
["File Name:",null,null,null,null,{"$f":"Checklist!D12","v":"7. Rent Roll"},null,null,null,null,null,null,null,"Current rent roll, tenant income & household size info, submit by unit. ",null,null,null,null,null,null,null,null,null,null,null,null,null,null,null,null,"Uploaded to FAAST?"]
["File Name:",null,null,null,null,{"$f":"Checklist!D80","v":"22a. Integration Plan"},null,null,null,null,null,null,null,"For Special Needs and Supportive Housing Projects provide an Integration Plan that demonstrates how Sponsor will meet §7302(g) requirements.",null,null,null,null,null,null,null,null,null,null,null,null,null,null,null,null,"Uploaded to FAAST?"]
["File Name:",null,null,null,null,{"$f":"Checklist!D13","v":"8. Leg Letter"},null,null,null,null,null,null,null,"Per Health & Safety Code §50675.7(e) Applicant must notify the local legislative body (City Council or County Board of Supervisors) of the Sponsor’s loan application prior to application submission.",null,null,null,null,null,null,null,null,null,null,null,null,null,null,null,null,"Uploaded to FAAST?"]
["Eligible Sponsor §7303, §7320(a)(1)"]
["(a) Sponsor #1",null,null,null,null,null,null,null,null,null,null,"Entity Name:",null,null,null,null,null,null,null,null,null,null,null,null,null,null,null,null,null,null,null,null,null,null,null,null,null,null,null,null,{"$f":"O34","v":0}]
["Eligible Sponsor Type:",null,null,null,null,null,null,null,null,null,null,null,null,null,null,null,null,null,null,null,null,null,null,null,null,null,null,null,"(b) Organization Type:",null,null,null,null,null,null,null,null,null,null,null,{"$f":"O49","v":0}]
["Address",null,null,null,null,null,null,null,null,null,null,null,null,null,null,null,null,null,null,null,null,"City",null,null,null,null,null,null,"State",null,null,null,null,"Zip"]
["Auth Rep Name",null,null,null,null,null,null,null,null,null,null,null,null,"Title",null,null,null,null,null,null,"Email",null,null,null,null,null,null,null,null,null,null,null,"Phone"]
["Contact Name",null,null,null,null,null,null,null,null,null,null,null,null,"Title",null,null,null,null,null,null,null,"Email",null,null,null,null,null,null,null,null,null,"Phone"]
["Address",null,null,null,null,null,null,null,null,null,null,null,null,null,null,null,null,null,null,null,null,"City",null,null,null,null,null,null,"State",null,null,null,null,"Zip"]
["File Name:",null,null,null,null,{"$f":"Checklist!D15","v":"9a. Spon1 Cert & Legal Disclosure"},null,null,null,null,null,null,null,"Reference 'Certifications & Legal Status' Worksheet.",null,null,null,null,null,null,null,null,null,null,null,null,null,null,null,null,"Uploaded to FAAST?"]
["File Name:",null,null,null,null,{"$f":"Checklist!D16","v":"9b. Spon1 Resolution"},null,null,null,null,null,null,null,"Reference MHP webpage for Resolution Document.",null,null,null,null,null,null,null,null,null,null,null,null,null,null,null,null,"Uploaded to FAAST?"]
["File Name:",null,null,null,null,{"$f":"Checklist!D17","v":"9c. Spon1 OrgDoc1, OrgDoc2, etc…"},null,null,null,null,null,null,null,"Reference Sponsor Org Docs worksheet.",null,null,null,null,null,null,null,null,null,null,null,null,null,null,null,null,"Uploaded to FAAST?"]
["File Name:",null,null,null,null,{"$f":"Checklist!D18","v":"9d. Spon1 OrgChart"},null,null,null,null,null,null,null,"Sponsor Organization Chart",null,null,null,null,null,null,null,null,null,null,null,null,null,null,null,null,"Uploaded to FAAST?",null,null,null,null,null,null,null,null,null,null,null,null,null,null,null,null,null,null,null,null,null,null,null,null,null,null,null,null,null,null,null,null,null,null,null,null,null,null,null,null,null,null,null,null,"X"]
["File Name:",null,null,null,null,{"$f":"Checklist!D19","v":"9e. Spon1 Signature Block"},null,null,null,null,null,null,null,"Signature Block - upload in Microsoft Word Document.",null,null,null,null,null,null,null,null,null,null,null,null,null,null,null,null,"Uploaded to FAAST?"]
["File Name:",null,null,null,null,{"$f":"Checklist!D20","v":"9f. Spon1 STD 204 Payee Data Record"},null,null,null,null,null,null,null,"Reference Payee Data Record STD-204 and Taxpayer Identification Number (TIN) Documents on the MHP webpage.",null,null,null,null,null,null,null,null,null,null,null,null,null,null,null,null,"Uploaded to FAAST?"]
["File Name:",null,null,null,null,{"$f":"Checklist!D21","v":"9g. Spon1 Fi$CAL TIN Form"},null,null,null,null,null,null,null,{"$f":"Checklist!M21","v":"Taxpayer Identification Number (TIN) (public entities ONLY)."},null,null,null,null,null,null,null,null,null,null,null,null,null,null,null,null,"Uploaded to FAAST?"]
["File Name:",null,null,null,null,{"$f":"Checklist!D22","v":"9h. Spon1 Cert of Good Standing "},null,null,null,null,null,null,null,{"$f":"Checklist!M22","v":"Certificate of Good Standing must be dated 30 days or less from the application due date."},null,null,null,null,null,null,null,null,null,null,null,null,null,null,null,null,"Uploaded to FAAST?"]
["File Name:",null,null,null,null,{"$f":"Checklist!D23","v":"9i. Spon1 Tax-Exempt Status"},null,null,null,null,null,null,null,{"$f":"Checklist!M23","v":"Evidence of tax-exempt status from IRS and evidence of tax-exempt status from FTB for Corporations."},null,null,null,null,null,null,null,null,null,null,null,null,null,null,null,null,"Uploaded to FAAST?"]
["(a) Sponsor #2 ",null,null,null,null,null,null,null,null,null,null,"Entity Name:"]
["Eligible Sponsor Type:",null,null,null,null,null,null,null,null,null,null,null,null,null,null,null,null,null,null,null,null,null,null,null,null,null,null,null,"(b) Organization Type:"]
["Address",null,null,null,null,null,null,null,null,null,null,null,null,null,null,null,null,null,null,null,null,"City",null,null,null,null,null,null,"State",null,null,null,null,"Zip"]
["Auth Rep Name",null,null,null,null,null,null,null,null,null,null,null,null,"Title",null,null,null,null,null,null,"Authorized Rep. Email",null,null,null,null,null,null,null,null,null,null,null,"Phone"]
["Contact Name",null,null,null,null,null,null,null,null,null,null,null,"Title",null,null,null,null,null,null,null,"Contact Email",null,null,null,null,null,null,null,null,null,null,"Phone"]
["Address",null,null,null,null,null,null,null,null,null,null,null,null,null,null,null,null,null,null,null,null,"City",null,null,null,null,null,null,"State",null,null,null,null,"Zip"]
["File Name:",null,null,null,null,{"$f":"Checklist!D25","v":"10a. Spon2 Cert & Legal Disclosure"},null,null,null,null,null,null,null,"Reference 'Certifications & Legal Status' Worksheet.",null,null,null,null,null,null,null,null,null,null,null,null,null,null,null,null,"Uploaded to FAAST?"]
["File Name:",null,null,null,null,{"$f":"Checklist!D26","v":"10b. Spon2 Resolution"},null,null,null,null,null,null,null,"Reference MHP webpage for Resolution Document.",null,null,null,null,null,null,null,null,null,null,null,null,null,null,null,null,"Uploaded to FAAST?"]
["File Name:",null,null,null,null,{"$f":"Checklist!D27","v":"10c. Spon2 OrgDoc1, OrgDoc2, etc…"},null,null,null,null,null,null,null,"Reference Sponsor Org Docs worksheet.",null,null,null,null,null,null,null,null,null,null,null,null,null,null,null,null,"Uploaded to FAAST?"]
["File Name:",null,null,null,null,{"$f":"Checklist!D28","v":"10d. Spon2 OrgChart"},null,null,null,null,null,null,null,"Sponsor Organization Chart",null,null,null,null,null,null,null,null,null,null,null,null,null,null,null,null,"Uploaded to FAAST?"]
["File Name:",null,null,null,null,{"$f":"Checklist!D29","v":"10e. Spon2 Signature Block"},null,null,null,null,null,null,null,"Signature Block - upload in Microsoft Word Document.",null,null,null,null,null,null,null,null,null,null,null,null,null,null,null,null,"Uploaded to FAAST?"]
["File Name:",null,null,null,null,{"$f":"Checklist!D30","v":"10f. Spon2 STD 204 Payee Data Record"},null,null,null,null,null,null,null,"Reference Payee Data Record STD-204 and Taxpayer Identification Number (TIN) Documents on the MHP webpage.",null,null,null,null,null,null,null,null,null,null,null,null,null,null,null,null,"Uploaded to FAAST?"]
["File Name:",null,null,null,null,{"$f":"Checklist!D31","v":"10g. Spon2 Fi$CAL TIN Form"},null,null,null,null,null,null,null,"Taxpayer Identification Number (TIN) (public entities ONLY). ",null,null,null,null,null,null,null,null,null,null,null,null,null,null,null,null,"Uploaded to FAAST?"]
["File Name:",null,null,null,null,{"$f":"Checklist!D32","v":"10h. Spon2 Cert of Good Standing "},null,null,null,null,null,null,null,"Certificate of Good Standing must be dated 30 days or less from the application due date.",null,null,null,null,null,null,null,null,null,null,null,null,null,null,null,null,"Uploaded to FAAST?"]
["File Name:",null,null,null,null,{"$f":"Checklist!D33","v":"10i. Spon2 Tax-Exempt Status"},null,null,null,null,null,null,null,"Evidence of tax-exempt status from IRS and evidence of tax-exempt status from FTB for Corporations.",null,null,null,null,null,null,null,null,null,null,null,null,null,null,null,null,"Uploaded to FAAST?"]
["(c) Sponsor must demonstrate experience relevant to owning and developing affordable rental housing through one or more of the following (must select \"Yes\" to at least one below)"]
["(c)(1) Does Sponsor have successful prior ownership and development of affordable rental housing?"]
["(c)(2) Will Sponsor employ staff with demonstrated experience owning and developing affordable rental housing?"]
["(c) Name of Sponsor/Person who has experience",null,null,null,null,null,null,null,"Name of Affordable Rental Housing Project",null,null,null,null,null,null,null,null,"Project Address and City",null,null,null,null,null,null,null,null,null,null,null,"Owner of Project",null,null,"Developer of Project",null,null,"Date completed"]
[]
[]
["(d) Joint Venture Sponsor: if Sponsor is using experience of only one joint venture partner, does that partner have a controlling interest in the joint venture and a substantial and continued role in the Project’s ongoing operations, as evidenced in the organizational documents governing the joint venture."]
["Owner/Borrower Entity"]
["Legal Name",null,null,null,null,null,null,null,null,null,null,null,null,null,null,null,null,null,null,null,null,null,null,null,null,null,null,null,null,null,null,null,null,null,null,null,null,null,null,null,null,null,null,null,null,{"$f":"IF(AND(D72>\"\",C73>\"\",W73>\"\",AE73>\"\",AI73>\"\",E74>\"\",O74>\"\",Z74>\"\",AI74>\"\",AK77=\"Yes\",AK78=\"Yes\",AK79=\"Yes\",AK80=\"Yes\",AK81=\"Yes\",AK82=\"Yes\"),1,0)","v":0}]
["Address",null,null,null,null,null,null,null,null,null,null,null,null,null,null,null,null,null,null,null,null,"City",null,null,null,null,null,null,"State",null,null,null,null,"Zip"]
["Auth Rep Name",null,null,null,null,null,null,null,null,null,null,null,null,"Title",null,null,null,null,null,null,"Authorized Rep. Email",null,null,null,null,null,null,null,null,null,null,null,"Phone"]
["Contact Name",null,null,null,null,null,null,null,null,null,null,null,"Title",null,null,null,null,null,null,null,"Contact Email",null,null,null,null,null,null,null,null,null,"Contact Phone"]
["Address",null,null,null,null,null,null,null,null,null,null,null,null,null,null,null,null,null,null,null,null,"City",null,null,null,null,null,null,"State",null,null,null,null,"Zip"]
["File Name:",null,null,null,null,{"$f":"Checklist!D35","v":"11a. Bwr Cert & Legal Disclosure"},null,null,null,null,null,null,null,"Reference 'Certifications & Legal Status' Worksheet.",null,null,null,null,null,null,null,null,null,null,null,null,null,null,null,null,"Uploaded to FAAST?"]
["File Name:",null,null,null,null,{"$f":"Checklist!D36","v":"11b. Bwr Resolution"},null,null,null,null,null,null,null,"Reference MHP webpage for Resolution Document.",null,null,null,null,null,null,null,null,null,null,null,null,null,null,null,null,"Uploaded to FAAST?"]
["File Name:",null,null,null,null,{"$f":"Checklist!D37","v":"11c. Bwr OrgDoc1, OrgDoc2, etc…"},null,null,null,null,null,null,null,"Reference Sponsor Org Docs worksheet.",null,null,null,null,null,null,null,null,null,null,null,null,null,null,null,null,"Uploaded to FAAST?"]
["File Name:",null,null,null,null,{"$f":"Checklist!D38","v":"11d. Bwr OrgChart"},null,null,null,null,null,null,null,"Must  demonstrate Sponsor control of the Borrower consistent with UMR §8313.2",null,null,null,null,null,null,null,null,null,null,null,null,null,null,null,null,"Uploaded to FAAST?"]
["File Name:",null,null,null,null,{"$f":"Checklist!D39","v":"11e. Bwr Signature Block"},null,null,null,null,null,null,null,"Signature Block - upload in Microsoft Word Document.",null,null,null,null,null,null,null,null,null,null,null,null,null,null,null,null,"Uploaded to FAAST?"]
["File Name:",null,null,null,null,{"$f":"Checklist!D40","v":"11f. Bwr STD 204 Payee Data Record"},null,null,null,null,null,null,null,"Reference Payee Data Record STD-204 and Taxpayer Identification Number (TIN) Documents on the MHP webpage.",null,null,null,null,null,null,null,null,null,null,null,null,null,null,null,null,"Uploaded to FAAST?"]
["File Name:",null,null,null,null,{"$f":"Checklist!D41","v":"11g. Bwr Fi$CAL TIN Form"},null,null,null,null,null,null,null,"Taxpayer Identification Number (TIN) (public entities ONLY).",null,null,null,null,null,null,null,null,null,null,null,null,null,null,null,null,"Uploaded to FAAST?"]
["File Name:",null,null,null,null,{"$f":"Checklist!D42","v":"11h. Bwr Tax-Exempt Status"},null,null,null,null,null,null,null,"Evidence of tax-exempt status from IRS and evidence of tax-exempt status from FTB for Corporations.",null,null,null,null,null,null,null,null,null,null,null,null,null,null,null,null,"Uploaded to FAAST?"]
["Managing General Partner"]
["Legal Name",null,null,null,null,null,null,null,null,null,null,null,null,null,null,null,null,null,null,null,null,null,null,null,null,null,"Organization Type"]
["Address",null,null,null,null,null,null,null,null,null,null,null,null,null,null,null,null,null,null,null,null,"City",null,null,null,null,null,null,"State",null,null,null,null,"Zip"]
["Auth Rep Name",null,null,null,null,null,null,null,null,null,null,null,null,"Title",null,null,null,null,null,null,"Authorized Rep. Email",null,null,null,null,null,null,null,null,null,null,null,"Phone"]
["Contact Name",null,null,null,null,null,null,null,null,null,null,null,"Title",null,null,null,null,null,null,null,"Contact Email",null,null,null,null,null,null,null,null,null,null,"Phone"]
["Address",null,null,null,null,null,null,null,null,null,null,null,null,null,null,null,null,null,null,null,null,"City",null,null,null,null,null,null,"State",null,null,null,null,"Zip"]
["File Name:",null,null,null,null,{"$f":"Checklist!D44","v":"12a. MGP Cert & Legal Disclosure"},null,null,null,null,null,null,null,"Reference 'Certifications & Legal Status' Worksheet.",null,null,null,null,null,null,null,null,null,null,null,null,null,null,null,null,"Uploaded to FAAST?"]
["File Name:",null,null,null,null,{"$f":"Checklist!D45","v":"12b. MGP Resolution"},null,null,null,null,null,null,null,"Reference MHP webpage for Resolution Document.",null,null,null,null,null,null,null,null,null,null,null,null,null,null,null,null,"Uploaded to FAAST?"]
["File Name:",null,null,null,null,{"$f":"Checklist!D46","v":"12c. MGP OrgDoc1, OrgDoc2, etc…"},null,null,null,null,null,null,null,"Reference Sponsor Org Docs worksheet.",null,null,null,null,null,null,null,null,null,null,null,null,null,null,null,null,"Uploaded to FAAST?"]
["File Name:",null,null,null,null,{"$f":"Checklist!D47","v":"12d. MGP OrgChart"},null,null,null,null,null,null,null,"Must depict organizational structure of the entities in relation to Sponsor.",null,null,null,null,null,null,null,null,null,null,null,null,null,null,null,null,"Uploaded to FAAST?"]
["File Name:",null,null,null,null,{"$f":"Checklist!D48","v":"12e. MGP Signature Block"},null,null,null,null,null,null,null,"Signature Block - upload in Microsoft Word Document.",null,null,null,null,null,null,null,null,null,null,null,null,null,null,null,null,"Uploaded to FAAST?"]
["File Name:",null,null,null,null,{"$f":"Checklist!D49","v":"12f. MGP STD 204 Payee Data Record"},null,null,null,null,null,null,null,"Reference Payee Data Record STD-204 and Taxpayer Identification Number (TIN) Documents on the MHP webpage.",null,null,null,null,null,null,null,null,null,null,null,null,null,null,null,null,"Uploaded to FAAST?",null,null,null,null,null,null,null,"X"]
["File Name:",null,null,null,null,{"$f":"Checklist!D50","v":"12g. MGP Fi$CAL TIN Form"},null,null,null,null,null,null,null,"Taxpayer Identification Number (TIN) (public entities ONLY).",null,null,null,null,null,null,null,null,null,null,null,null,null,null,null,null,"Uploaded to FAAST?"]
["File Name:",null,null,null,null,{"$f":"Checklist!D51","v":"12h. MGP Tax-Exempt Status"},null,null,null,null,null,null,null,"Evidence of tax-exempt status from IRS and evidence of tax-exempt status from FTB for Corporations.",null,null,null,null,null,null,null,null,null,null,null,null,null,null,null,null,"Uploaded to FAAST?"]
["Administrative General Partner #1"]
["Legal Name",null,null,null,null,null,null,null,null,null,null,null,null,null,null,null,null,null,null,null,null,null,null,null,null,null,"Organization Type"]
["Address",null,null,null,null,null,null,null,null,null,null,null,null,null,null,null,null,null,null,null,null,"City",null,null,null,null,null,null,"State",null,null,null,null,"Zip"]
["Auth Rep Name",null,null,null,null,null,null,null,null,null,null,null,null,"Title",null,null,null,null,null,null,"Authorized Rep. Email",null,null,null,null,null,null,null,null,null,null,null,"Phone"]
["Contact Name",null,null,null,null,null,null,null,null,null,null,null,"Title",null,null,null,null,null,null,null,"Contact Email",null,null,null,null,null,null,null,null,null,null,"Phone"]
["Address",null,null,null,null,null,null,null,null,null,null,null,null,null,null,null,null,null,null,null,null,"City",null,null,null,null,null,null,"State",null,null,null,null,"Zip"]
["File Name:",null,null,null,null,{"$f":"Checklist!D53","v":"13a. AGP1 Cert & Legal Disclosure"},null,null,null,null,null,null,null,"Reference 'Certifications & Legal Status' Worksheet.",null,null,null,null,null,null,null,null,null,null,null,null,null,null,null,null,"Uploaded to FAAST?"]
["File Name:",null,null,null,null,{"$f":"Checklist!D54","v":"13b. AGP1 Resolution"},null,null,null,null,null,null,null,"Reference MHP webpage for Resolution Document.",null,null,null,null,null,null,null,null,null,null,null,null,null,null,null,null,"Uploaded to FAAST?"]
["File Name:",null,null,null,null,{"$f":"Checklist!D55","v":"13c. AGP1 OrgDoc1, OrgDoc2, etc…"},null,null,null,null,null,null,null,"Reference Sponsor Org Docs worksheet.",null,null,null,null,null,null,null,null,null,null,null,null,null,null,null,null,"Uploaded to FAAST?"]
["File Name:",null,null,null,null,{"$f":"Checklist!D56","v":"13d. AGP1 OrgChart"},null,null,null,null,null,null,null,"Must depict organizational structure of the entities in relation to Sponsor.",null,null,null,null,null,null,null,null,null,null,null,null,null,null,null,null,"Uploaded to FAAST?"]
["File Name:",null,null,null,null,{"$f":"Checklist!D57","v":"13e. AGP1 Signature Block"},null,null,null,null,null,null,null,"Signature Block - upload in Microsoft Word Document.",null,null,null,null,null,null,null,null,null,null,null,null,null,null,null,null,"Uploaded to FAAST?"]
["File Name:",null,null,null,null,{"$f":"Checklist!D58","v":"13f. AGP1 STD 204 Payee Data Record"},null,null,null,null,null,null,null,"Reference Payee Data Record STD-204 and Taxpayer Identification Number (TIN) Documents on the MHP webpage.",null,null,null,null,null,null,null,null,null,null,null,null,null,null,null,null,"Uploaded to FAAST?"]
["File Name:",null,null,null,null,{"$f":"Checklist!D59","v":"13g. AGP1 Fi$CAL TIN Form"},null,null,null,null,null,null,null,"Taxpayer Identification Number (TIN) (public entities ONLY).",null,null,null,null,null,null,null,null,null,null,null,null,null,null,null,null,"Uploaded to FAAST?"]
["File Name:",null,null,null,null,{"$f":"Checklist!D60","v":"13h. AGP1 Tax-Exempt Status"},null,null,null,null,null,null,null,"Evidence of tax-exempt status from IRS and evidence of tax-exempt status from FTB for Corporations.",null,null,null,null,null,null,null,null,null,null,null,null,null,null,null,null,"Uploaded to FAAST?"]
["Administrative General Partner #2"]
["Legal Name",null,null,null,null,null,null,null,null,null,null,null,null,null,null,null,null,null,null,null,null,null,null,null,null,null,"Organization Type"]
["Address",null,null,null,null,null,null,null,null,null,null,null,null,null,null,null,null,null,null,null,null,"City",null,null,null,null,null,null,"State",null,null,null,null,"Zip"]
["Auth Rep Name",null,null,null,null,null,null,null,null,null,null,null,null,"Title",null,null,null,null,null,null,"Authorized Rep. Email",null,null,null,null,null,null,null,null,null,null,null,"Phone"]
["Contact Name",null,null,null,null,null,null,null,null,null,null,null,"Title",null,null,null,null,null,null,null,"Contact Email",null,null,null,null,null,null,null,null,null,null,"Phone"]
["Address",null,null,null,null,null,null,null,null,null,null,null,null,null,null,null,null,null,null,null,null,"City",null,null,null,null,null,null,"State",null,null,null,null,"Zip"]
["File Name:",null,null,null,null,{"$f":"Checklist!D62","v":"14a. AGP2 Cert & Legal Disclosure"},null,null,null,null,null,null,null,"Reference 'Certifications & Legal Status' Worksheet.",null,null,null,null,null,null,null,null,null,null,null,null,null,null,null,null,"Uploaded to FAAST?"]
["File Name:",null,null,null,null,{"$f":"Checklist!D63","v":"14b. AGP2 Resolution"},null,null,null,null,null,null,null,"Reference MHP webpage for Resolution Document.",null,null,null,null,null,null,null,null,null,null,null,null,null,null,null,null,"Uploaded to FAAST?"]
["File Name:",null,null,null,null,{"$f":"Checklist!D64","v":"14c. AGP2 OrgDoc1, OrgDoc2, etc…"},null,null,null,null,null,null,null,"Reference Sponsor Org Docs worksheet.",null,null,null,null,null,null,null,null,null,null,null,null,null,null,null,null,"Uploaded to FAAST?"]
["File Name:",null,null,null,null,{"$f":"Checklist!D65","v":"14d. AGP2 OrgChart"},null,null,null,null,null,null,null,"Must depict organizational structure of the entities in relation to Sponsor.",null,null,null,null,null,null,null,null,null,null,null,null,null,null,null,null,"Uploaded to FAAST?"]
["File Name:",null,null,null,null,{"$f":"Checklist!D66","v":"14e. AGP2 Signature Block"},null,null,null,null,null,null,null,"Signature Block - upload in Microsoft Word Document.",null,null,null,null,null,null,null,null,null,null,null,null,null,null,null,null,"Uploaded to FAAST?"]
["File Name:",null,null,null,null,{"$f":"Checklist!D67","v":"14f. AGP2 STD 204 Payee Data Record"},null,null,null,null,null,null,null,"Reference Payee Data Record STD-204 Document on the MHP webpage.",null,null,null,null,null,null,null,null,null,null,null,null,null,null,null,null,"Uploaded to FAAST?"]
["File Name:",null,null,null,null,{"$f":"Checklist!D68","v":"14g. AGP2 Fi$CAL TIN Form"},null,null,null,null,null,null,null,"Taxpayer Identification Number (TIN) (public entities ONLY).",null,null,null,null,null,null,null,null,null,null,null,null,null,null,null,null,"Uploaded to FAAST?"]
["File Name:",null,null,null,null,{"$f":"Checklist!D69","v":"14h. AGP2 Tax-Exempt Status"},null,null,null,null,null,null,null,"Evidence of tax-exempt status from IRS and evidence of tax-exempt status from FTB for Corporations.",null,null,null,null,null,null,null,null,null,null,null,null,null,null,null,null,"Uploaded to FAAST?"]
["§7315 Does Project trigger State Relocation Assistance Law (CA Gov Code §7260-7277)? ",null,null,null,null,null,null,null,null,null,null,null,"If Yes, applicant must submit an initial relocation plan prepared in accordance with 24 CFR 93.352. If No, provide a narrative explanation supporting why relocation is not required. \"N/A\" or \"Vacant Land\" is not sufficient. "]
[]
["File Name:",null,null,null,null,{"$f":"Checklist!D77","v":"20. Relocation"},null,null,null,null,null,null,null,{"$f":"IF(K127=\"No\",\"Provide narrative explanation and identify documents supporting no relocation required.\",\"Provide a relocation plan prepared in accordance with 24 CFR 93.352.\")","v":"Provide a relocation plan prepared in accordance with 24 CFR 93.352."},null,null,null,null,null,null,null,null,null,null,null,null,null,null,null,null,"Uploaded to FAAST?"]
["§7304, §7320(a)(3) Does the Project's Development Budget in the Universal Application request funds for eligible costs?"]
["§7305 Do the costs within the Project's Development Budget in the Universal Application comply with these development cost limitations?"]
["§7320(a)(4), §7318 Is the Project application complete and submitted meeting these application requirements?",null,null,null,null,null,null,null,null,null,null,null,null,null,null,null,null,null,null,null,null,null,null,null,null,null,null,"Will Project be a TCAC hybrid project?"]
["§7320(a)(5) Will the Project maintain Fiscal Integrity with the proposed Assisted Unit Rents and will it be feasible pursuant to UMR §8310?"]
["§7320(a)(6) Is the Project free from severe adverse environmental conditions that are economically infeasible to remove and cannot be mitigated? "]
["Attach all available Phase I and Phase II Environmental Site Assessments (ESA). Include any follow-up analysis, (e.g., asbestos or lead-based paint analysis), or information on mitigation completed. It is NOT necessary to include a copy of the Database Records Search section of the ESA. If no Phase I or Phase II has been done for new construction projects, HCD highly recommends submission of a Phase I and Phase II, if recommended by the Phase I, and any follow-up reports with your Application so that environmental remediation costs can be properly assessed and budgeted for. For acquisition/rehabilitation projects, submission of lead-based paint, mold, and asbestos reports is required. Failure to submit the necessary environmental reports with your Application may delay evaluation of your Application. Evidence of completion of all necessary environmental remediation will be required prior to award of funds."]
["File Name:",null,null,null,null,"Env. Report 1: ",null,null,null,null,null,null,null,null,null,null,null,null,null,null,null,null,null,null,null,null,null,null,null,null,"Uploaded to FAAST?"]
["File Name:",null,null,null,null,"Env. Report 2: ",null,null,null,null,null,null,null,null,null,null,null,null,null,null,null,null,null,null,null,null,null,null,null,null,"Uploaded to FAAST?"]
["File Name:",null,null,null,null,"Env. Report 3: ",null,null,null,null,null,null,null,null,null,null,null,null,null,null,null,null,null,null,null,null,null,null,null,null,"Uploaded to FAAST?"]
["File Name:",null,null,null,null,"Env. Report 4: ",null,null,null,null,null,null,null,null,null,null,null,null,null,null,null,null,null,null,null,null,null,null,null,null,"Uploaded to FAAST?"]
["File Name:",null,null,null,null,"Env. Report 5:",null,null,null,null,null,null,null,null,null,null,null,null,null,null,null,null,null,null,null,null,null,null,null,null,"Uploaded to FAAST?"]
["§7320(a)(7) Is the Project site reasonably accessible to public transportation, shopping, medical services, recreation, schools, and employment in relation to the needs of the Project's tenants? "]
["§7320(a)(8) Projects targeting Special Needs Populations or including Supportive Housing Units: will Project provide services suitable to tenant needs & does application demonstrate a specific, feasible plan for delivery & funding of those services including identification of service partners and funding sources?"]
["File Name:",null,null,null,null,"SS Plan",null,null,null,null,null,null,null,"Complete and attach the Supportive Services Plan Worksheet.",null,null,null,null,null,null,null,null,null,null,null,null,null,null,null,null,"Uploaded to FAAST?"]
["§7320(a)(9) New Construction Project: will it require demolition of existing residential units per UMR §8302",null,null,null,null,null,null,null,null,null,null,null,null,null,null,null,null,null,null,null,null,null,{"$f":"IF(U144=\"Yes\",\"# of bdrms in demolished structures?\",\"\")","v":""},null,null,null,null,null,null,null,null,{"$f":"IF(U144=\"Yes\",\"# of bedrms in new Project?\",\"\")","v":""}]
["§7320(a)(9) Does Sponsor have site control that complies with UMR §8303? If yes, enter form of site control and most recent execution date."]
["Form of site control:",null,null,null,null,null,null,null,null,null,null,null,null,null,null,null,null,null,null,null,null,null,null,null,null,"Most recent document execution date:"]
["Provide details below for unusual site control special circumstances:"]
[]
["File Name:",null,null,null,null,{"$f":"Checklist!D71","v":"15. Site Control"},null,null,null,null,null,null,null,"Provide documentation of the form of site control selected above meeting UMR §8303.",null,null,null,null,null,null,null,null,null,null,null,null,null,null,null,null,"Uploaded to FAAST?"]
["File Name:",null,null,null,null,{"$f":"Checklist!D72","v":"16. Preliminary Title Report"},null,null,null,null,null,null,null,"Provide a current preliminary report. ",null,null,null,null,null,null,null,null,null,null,null,null,null,null,null,null,"Uploaded to FAAST?"]
["§7320(a)(9) Is the Project a scattered site housing project?",null,null,null,null,null,null,null,null,null,null,null,null,null,"If yes, will Project meet the UMR §8303(b) requirements? (If yes, complete a separate Universal Application - 'Site & Units' worksheet for each site)"]
["Federal, State and Local Requirements"]
["Is the Project on a permanent foundation?",null,null,null,null,null,null,null,null,null,null,"Will the project meet all applicable State and local requirements, including but not limited to, minimum square footage requirements, and requirements for maintaining the property in a safe and sanitary condition?"]
["Article XXXIV"]
["Article XXXIV legal opinion submitted to HCD demonstrates that the Sponsor has considered both the legal requirements of Article XXXIV and the relevant facts of the project. Any conclusion that the project is exempt from Article XXXIV is supported by specific facts and a specific legal theory for exemption that itself is supported by the Constitution, statue, and/or case law. Documentation provided shall be subject to Department review and approval."]
["File Name:",null,null,null,null,{"$f":"Checklist!D74","v":"17. Article XXXIV Legal Opinion"},null,null,null,null,null,null,null,"If the Sponsor includes an Article XXXIV legal opinion, provide a copy of legal opinion.",null,null,null,null,null,null,null,null,null,null,null,null,null,null,null,null,"Uploaded to FAAST?"]
["File Name:",null,null,null,null,{"$f":"Checklist!D75","v":"18. Article XXXIV Authority"},null,null,null,null,null,null,null,"If the locality has sufficient Article XXXIV authority, provide documentation per NOFA.",null,null,null,null,null,null,null,null,null,null,null,null,null,null,null,null,"Uploaded to FAAST?"]
["Tenant Selection UMR §8305"]
["Sponsor certifies the Project will comply with the requirements of UMR §8305 as applicable."]
["Fair Housing Act"]
["Does your Project propose to restrict occupancy based on gender or age? If yes, include in legal opinion how your Project satisfies fair housing laws (include supporting materials). Attach a Project-specific legal opinion labeled \"Fair Housing\" with supporting materials describing how the Project complies with fair housing laws. For senior Projects, attach evidence that units are lawfully restricted to senior households in compliance with state and federal fair housing laws."]
["File Name:",null,null,null,null,{"$f":"Checklist!D76","v":"19. Fair Housing Legal Opinion"},null,null,null,null,null,null,null,"Attach a Project-specific legal opinion labeled \"Fair Housing\" with supporting materials describing how the Project complies with fair housing laws. ",null,null,null,null,null,null,null,null,null,null,null,null,null,null,null,null,"Uploaded to FAAST?"]
["Americans with Disabilities Act "]
["Sponsor certifies Project will comply with Americans with Disabilities Act and its implementing regulations."]
["Violence Against Women Act"]
["Sponsor certifies Project will comply with Violence Against Women Act."]
["Pet Friendly Housing Act"]
["Sponsor certifies that residents of the housing development will be authorized to own or otherwise maintain one or more common household pets pursuant to the Pet Friendly Housing Act of 2017 (California Health & Safety Code, Section 50466)"]
["Davis-Bacon Wage & State Prevailing Wage Requirements"]
["Sponsor certifies the Project will comply with Davis-Bacon wage requirements and State prevailing wage law, as set forth in Labor Code Section 1720 et seq., which requires the payment of prevailing wages unless the project meets one of the exceptions of Labor Code 1720 (c) as determined by the Department of Industrial Relations (DIR). Sponsors are urged to seek professional advice as to how to comply with State prevailing wage law."]
["Explanations "]
["Provide a letter of explanation providing details for all \"No\" answers that are shaded red above."]
["File Name:",null,null,null,null,{"$f":"Checklist!D9","v":"4. LOE"},null,null,null,null,null,null,null,"Letter of explanation for any \"red\" shaded cells above. ",null,null,null,null,null,null,null,null,null,null,null,null,null,null,null,null,"Uploaded to FAAST?"]
["File Name:",null,null,null,null,{"$f":"Checklist!D78","v":"21. Op Exp Compare"},null,null,null,null,null,null,null,"Submit a min. of 3 comparables for the most recent 2 years from projects located in same market area. They must be of similar unit count, building type, amenity level and tenant population (i.e., senior or family). Comparables should be from affordable (TCAC or similarly restricted) housing projects. One comparable may be from a 100% market rate project if unable to locate affordable comparables. Info must be submitted in original form. Most recent two years audited statements for each comparable is preferred, if available. Additional info may be required.",null,null,null,null,null,null,null,null,null,null,null,null,null,null,null,null,"Uploaded to FAAST?"]

{"sheet":"B1 - Development Team Contacts","index":4,"n_rows":40,"n_cols":36,"rows_kept":40,"cut":false,"hidden":false,"merged":[[0,0,0,34],[0,35,0,37],[2,0,2,2],[2,3,2,14],[2,27,2,29],[2,30,2,37],[3,31,3,32],[3,34,3,37],[2,15,2,18],[2,19,2,26],[5,0,5,2],[5,3,5,14],[5,27,5,29],[5,30,5,37],[3,0,3,1],[3,2,3,6],[3,7,3,8],[3,9,3,20],[3,22,3,28],[3,29,3,30],[5,15,5,18],[5,19,5,26],[6,31,6,32],[6,34,6,37],[8,0,8,2],[8,3,8,14],[8,27,8,29],[8,30,8,37],[6,0,6,1],[6,2,6,6],[6,7,6,8],[6,9,6,20],[6,22,6,28],[6,29,6,30],[8,15,8,18],[8,19,8,26],[9,31,9,32],[9,34,9,37],[11,0,11,2],[11,3,11,14],[11,27,11,29],[11,30,11,37],[9,0,9,1],[9,2,9,6],[9,7,9,8],[9,9,9,20],[9,22,9,28],[9,29,9,30],[11,15,11,18],[11,19,11,26],[12,31,12,32],[12,34,12,37],[14,0,14,2],[14,3,14,14],[14,27,14,29],[14,30,14,37],[12,0,12,1],[12,2,12,6],[12,7,12,8],[12,9,12,20],[12,22,12,28],[12,29,12,30],[14,15,14,18],[14,19,14,26],[15,31,15,32],[15,34,15,37],[17,0,17,2],[17,3,17,14],[17,27,17,29],[17,30,17,37],[15,0,15,1],[15,2,15,6],[15,7,15,8],[15,9,15,20],[15,22,15,28],[15,29,15,30],[17,15,17,18],[17,19,17,26],[18,31,18,32],[18,34,18,37],[20,0,20,2],[20,3,20,14],[20,27,20,29],[20,30,20,37],[18,0,18,1],[18,2,18,6],[18,7,18,8],[18,9,18,20],[18,22,18,28],[18,29,18,30],[20,15,20,18],[20,19,20,26],[21,31,21,32],[21,34,21,37],[23,0,23,2],[23,3,23,14],[23,27,23,29],[23,30,23,37],[21,0,21,1],[21,2,21,6],[21,7,21,8],[21,9,21,20],[21,22,21,28],[21,29,21,30],[23,15,23,18],[23,19,23,26],[24,31,24,32],[24,34,24,37],[26,0,26,2],[26,3,26,14],[26,27,26,29],[26,30,26,37],[24,0,24,1],[24,2,24,6],[24,7,24,8],[24,9,24,20],[24,22,24,28],[24,29,24,30],[26,15,26,18],[26,19,26,26],[27,31,27,32],[27,34,27,37],[29,0,29,2],[29,3,29,14],[29,27,29,29],[29,30,29,37],[27,0,27,1],[27,2,27,6],[27,7,27,8],[27,9,27,20],[27,22,27,28],[27,29,27,30],[29,15,29,18],[29,19,29,26],[30,31,30,32],[30,34,30,37],[32,0,32,2],[32,3,32,14],[32,27,32,29],[32,30,32,37],[30,0,30,1],[30,2,30,6],[30,7,30,8],[30,9,30,20],[30,22,30,28],[30,29,30,30],[32,15,32,18],[32,19,32,26],[33,31,33,32],[33,34,33,37],[35,0,35,2],[35,3,35,14],[35,27,35,29],[35,30,35,37],[33,0,33,1],[33,2,33,6],[33,7,33,8],[33,9,33,20],[33,22,33,28],[33,29,33,30],[35,15,35,18],[35,19,35,26],[39,31,39,32],[39,34,39,37],[39,0,39,1],[39,2,39,6],[39,7,39,8],[39,9,39,20],[39,22,39,28],[39,29,39,30],[36,31,36,32],[36,34,36,37],[38,0,38,2],[38,3,38,14],[38,27,38,29],[38,30,38,37],[36,0,36,1],[36,2,36,6],[36,7,36,8],[36,9,36,20],[36,22,36,28],[36,29,36,30],[38,15,38,18],[38,19,38,26]]}
["Development Team Contacts",null,null,null,null,null,null,null,null,null,null,null,null,null,null,null,null,null,null,null,null,null,null,null,null,null,null,null,null,null,null,null,null,null,null,{"$f":"'B - Project Requirements'!AJ1:AL1","v":"2020-01-07"}]
["Property Management Agent"]
["Legal Name",null,null,null,null,null,null,null,null,null,null,null,null,null,null,"Contact Name",null,null,null,null,null,null,null,null,null,null,null,"Contact Email"]
["Phone",null,null,null,null,null,null,"Address",null,null,null,null,null,null,null,null,null,null,null,null,null,"City",null,null,null,null,null,null,null,"State",null,null,null,"Zip"]
["Financial Consultant"]
["Legal Name",null,null,null,null,null,null,null,null,null,null,null,null,null,null,"Contact Name",null,null,null,null,null,null,null,null,null,null,null,"Contact Email"]
["Phone",null,null,null,null,null,null,"Address",null,null,null,null,null,null,null,null,null,null,null,null,null,"City",null,null,null,null,null,null,null,"State",null,null,null,"Zip"]
["Lead (primary) Service Provider"]
["Legal Name",null,null,null,null,null,null,null,null,null,null,null,null,null,null,"Contact Name",null,null,null,null,null,null,null,null,null,null,null,"Contact Email"]
["Phone",null,null,null,null,null,null,"Address",null,null,null,null,null,null,null,null,null,null,null,null,null,"City",null,null,null,null,null,null,null,"State",null,null,null,"Zip"]
["Borrower Legal Counsel"]
["Legal Name",null,null,null,null,null,null,null,null,null,null,null,null,null,null,"Contact Name",null,null,null,null,null,null,null,null,null,null,null,"Contact Email"]
["Phone",null,null,null,null,null,null,"Address",null,null,null,null,null,null,null,null,null,null,null,null,null,"City",null,null,null,null,null,null,null,"State",null,null,null,"Zip"]
["General Contractor"]
["Legal Name",null,null,null,null,null,null,null,null,null,null,null,null,null,null,"Contact Name",null,null,null,null,null,null,null,null,null,null,null,"Contact Email"]
["Phone",null,null,null,null,null,null,"Address",null,null,null,null,null,null,null,null,null,null,null,null,null,"City",null,null,null,null,null,null,null,"State",null,null,null,"Zip"]
["Architect"]
["Legal Name",null,null,null,null,null,null,null,null,null,null,null,null,null,null,"Contact Name",null,null,null,null,null,null,null,null,null,null,null,"Contact Email"]
["Phone",null,null,null,null,null,null,"Address",null,null,null,null,null,null,null,null,null,null,null,null,null,"City",null,null,null,null,null,null,null,"State",null,null,null,"Zip"]
["Development Funding Source "]
["Legal Name",null,null,null,null,null,null,null,null,null,null,null,null,null,null,"Contact Name",null,null,null,null,null,null,null,null,null,null,null,"Contact Email"]
["Phone",null,null,null,null,null,null,"Address",null,null,null,null,null,null,null,null,null,null,null,null,null,"City",null,null,null,null,null,null,null,"State",null,null,null,"Zip"]
["Development Funding Source "]
["Legal Name",null,null,null,null,null,null,null,null,null,null,null,null,null,null,"Contact Name",null,null,null,null,null,null,null,null,null,null,null,"Contact Email"]
["Phone",null,null,null,null,null,null,"Address",null,null,null,null,null,null,null,null,null,null,null,null,null,"City",null,null,null,null,null,null,null,"State",null,null,null,"Zip"]
["Development Funding Source "]
["Legal Name",null,null,null,null,null,null,null,null,null,null,null,null,null,null,"Contact Name",null,null,null,null,null,null,null,null,null,null,null,"Contact Email"]
["Phone",null,null,null,null,null,null,"Address",null,null,null,null,null,null,null,null,null,null,null,null,null,"City",null,null,null,null,null,null,null,"State",null,null,null,"Zip"]
["Development Funding Source "]
["Legal Name",null,null,null,null,null,null,null,null,null,null,null,null,null,null,"Contact Name",null,null,null,null,null,null,null,null,null,null,null,"Contact Email"]
["Phone",null,null,null,null,null,null,"Address",null,null,null,null,null,null,null,null,null,null,null,null,null,"City",null,null,null,null,null,null,null,"State",null,null,null,"Zip"]
["Development Funding Source "]
["Legal Name",null,null,null,null,null,null,null,null,null,null,null,null,null,null,"Contact Name",null,null,null,null,null,null,null,null,null,null,null,"Contact Email"]
["Phone",null,null,null,null,null,null,"Address",null,null,null,null,null,null,null,null,null,null,null,null,null,"City",null,null,null,null,null,null,null,"State",null,null,null,"Zip"]
["Rent/Operating Subsidy Source "]
["Legal Name",null,null,null,null,null,null,null,null,null,null,null,null,null,null,"Contact Name",null,null,null,null,null,null,null,null,null,null,null,"Contact Email"]
["Phone",null,null,null,null,null,null,"Address",null,null,null,null,null,null,null,null,null,null,null,null,null,"City",null,null,null,null,null,null,null,"State",null,null,null,"Zip"]
["Rent/Operating Subsidy Source "]
["Legal Name",null,null,null,null,null,null,null,null,null,null,null,null,null,null,"Contact Name",null,null,null,null,null,null,null,null,null,null,null,"Contact Email"]
["Phone",null,null,null,null,null,null,"Address",null,null,null,null,null,null,null,null,null,null,null,null,null,"City",null,null,null,null,null,null,null,"State",null,null,null,"Zip"]

{"sheet":"B2 - SH Experience","index":5,"n_rows":22,"n_cols":37,"rows_kept":22,"cut":false,"hidden":true,"merged":[[21,0,21,4],[21,5,21,12],[21,13,21,29],[21,30,21,35],[21,36,21,37],[20,0,20,4],[20,5,20,12],[20,13,20,29],[20,30,20,35],[20,36,20,37],[17,35,17,37],[16,33,16,34],[16,35,16,37],[18,35,18,37],[19,1,19,21],[19,22,19,32],[19,33,19,34],[19,35,19,37],[16,0,16,21],[16,22,16,32],[18,1,18,21],[18,22,18,32],[18,33,18,34],[17,1,17,21],[17,22,17,32],[17,33,17,34],[2,0,2,37],[15,36,15,37],[4,17,4,18],[9,0,9,33],[9,34,9,35],[9,36,9,37],[15,34,15,35],[10,1,10,16],[10,17,10,18],[10,19,10,29],[10,30,10,37],[13,30,13,37],[8,0,8,4],[8,5,8,12],[8,13,8,29],[8,30,8,35],[4,1,4,16],[7,19,7,29],[15,0,15,33],[7,30,7,32],[7,33,7,37],[8,36,8,37],[14,0,14,4],[14,5,14,12],[14,13,14,29],[14,30,14,35],[14,36,14,37],[13,17,13,18],[13,19,13,29],[12,30,12,37],[11,1,11,16],[11,17,11,18],[0,0,0,34],[0,35,0,37],[6,17,6,18],[6,30,6,32],[6,33,6,37],[5,17,5,18],[5,30,5,32],[4,30,4,32],[4,33,4,37],[5,33,5,37],[1,0,1,20],[1,21,1,37],[6,19,6,29],[5,19,5,29],[4,19,4,29],[3,0,3,37],[11,19,11,29],[11,30,11,37],[12,1,12,16],[12,17,12,18],[12,19,12,29],[13,1,13,16],[7,17,7,18],[7,1,7,16],[6,1,6,16],[5,1,5,16]]}
["Supportive Housing Experience\nThis worksheet must be completed if Project has one or more Supportive Housing or Special Needs units",null,null,null,null,null,null,null,null,null,null,null,null,null,null,null,null,null,null,null,null,null,null,null,null,null,null,null,null,null,null,null,null,null,null,{"$f":"'B - Project Requirements'!AJ1","v":"2020-01-07"}]
["Enter the name of the entity qualifying for experience:"]
["Supportive Housing Experience, §7302(f)"]
["(1) Sponsor Experience: Sponsor must have at least two years of experience during the past five years owning or operating (under a long-term master lease or similar arrangement) a rental housing development with at least 10 units occupied by people experiencing Homelessness, with on-site Comprehensive Case Management services. "]
[null,"Project Name and Address ",null,null,null,null,null,null,null,null,null,null,null,null,null,null,null,"# of units",null,"Were units occupied by people experiencing Homelessness, with on-site Comprehensive Case Management services?",null,null,null,null,null,null,null,null,null,null,"Experience Type",null,null,"Year Owned or Operated"]
[1]
[2]
[3]
["File Name:",null,null,null,null,{"$f":"Checklist!D81","v":"22b. Sponsor SOQ"},null,null,null,null,null,null,null,{"$f":"Checklist!M81","v":"Statement of Qualifications regarding owing and managing Special Needs Projects include list of projects."},null,null,null,null,null,null,null,null,null,null,null,null,null,null,null,null,"Uploaded to FAAST?"]
["(2) Property Manager Experience: Property Manager must have managed for at least three years, rental housing developments with at least 10 units occupied by people experiencing Homelessness, with on-site Comprehensive Case Management services. ",null,null,null,null,null,null,null,null,null,null,null,null,null,null,null,null,null,null,null,null,null,null,null,null,null,null,null,null,null,null,null,null,null,"Total Years:",null,{"$f":"SUM(AE12:AL14)/12","v":0}]
[null,"Project Name and Address ",null,null,null,null,null,null,null,null,null,null,null,null,null,null,null,"# of units",null,"Were units occupied by people experiencing Homelessness, with on-site Comprehensive Case Management services?",null,null,null,null,null,null,null,null,null,null,"# of months serving"]
[1]
[2]
[3]
["File Name:",null,null,null,null,{"$f":"Checklist!D82","v":"22c. Property Management SOQ"},null,null,null,null,null,null,null,{"$f":"Checklist!M82","v":"Property Management Statement of Qualifications regarding owing and managing Special Needs Projects include list of projects."},null,null,null,null,null,null,null,null,null,null,null,null,null,null,null,null,"Uploaded to FAAST?"]
["(3) Lead Service Provider Experience: Sponsor must utilize a lead service provider with at least three years of experience providing services to people experiencing Homelessness that includes on-site Comprehensive Case Management in at least two publicly-assisted supportive housing projects or through a tenant-based housing assistance program in which Comprehensive Case Management Services are provided on-site to at least 20 persons at a time, and are not time-limited. A written agreement between the lead service provider and Sponsor or project owner satisfactory to the Department, must be submitted with the Program application.",null,null,null,null,null,null,null,null,null,null,null,null,null,null,null,null,null,null,null,null,null,null,null,null,null,null,null,null,null,null,null,null,null,"Total Years:",null,{"$f":"SUM(AJ18:AL20)/12","v":0}]
["Project Name and Address or Description of other Experience",null,null,null,null,null,null,null,null,null,null,null,null,null,null,null,null,null,null,null,null,null,"Did this experience serve the Target Population in Supportive Housing and include comprehensive case management?",null,null,null,null,null,null,null,null,null,null,"# of units",null,"# of months serving"]
[1]
[2]
[3]
["File Name:",null,null,null,null,{"$f":"Checklist!D83","v":"22d. LSP SOQ"},null,null,null,null,null,null,null,{"$f":"Checklist!M83","v":"Statement of Qualifications of LSP Company & Resumes of Principles."},null,null,null,null,null,null,null,null,null,null,null,null,null,null,null,null,"Uploaded to FAAST?"]
["File Name:",null,null,null,null,{"$f":"Checklist!D84","v":"22e. LSP Exp Contracts"},null,null,null,null,null,null,null,{"$f":"Checklist!M84","v":"Executed contracts must be attached for experience to count.  Attach only these pages of the contract:  page(s) identifying the Project name, scope of work; term of the contract or agreement; and execution page(s) showing all signatures of all parties to the contracts."},null,null,null,null,null,null,null,null,null,null,null,null,null,null,null,null,"Uploaded to FAAST?"]

{"sheet":"B3 - Supportive Services Plan","index":6,"n_rows":291,"n_cols":44,"rows_kept":291,"cut":false,"hidden":true,"merged":[[181,0,181,3],[181,4,181,24],[181,25,181,28],[181,29,181,34],[181,35,181,37],[182,0,182,3],[182,4,182,24],[182,25,182,28],[182,29,182,34],[182,35,182,37],[188,0,188,3],[188,4,188,24],[188,25,188,28],[188,29,188,34],[188,35,188,37],[189,0,189,3],[189,4,189,24],[189,25,189,28],[189,29,189,34],[189,35,189,37],[186,0,186,3],[186,4,186,24],[186,25,186,28],[186,29,186,34],[186,35,186,37],[187,0,187,3],[187,4,187,24],[187,25,187,28],[187,29,187,34],[187,35,187,37],[287,0,287,37],[288,0,288,37],[289,0,289,37],[290,0,290,37],[291,0,291,37],[276,0,276,37],[213,0,213,37],[157,0,157,37],[158,0,158,37],[162,0,162,37],[284,0,284,11],[284,12,284,24],[284,25,284,37],[285,0,285,11],[285,12,285,24],[285,25,285,37],[286,0,286,11],[286,12,286,24],[286,25,286,37],[275,0,275,37],[277,0,277,37],[278,0,278,37],[279,0,279,37],[280,0,280,37],[281,0,281,37],[282,0,282,37],[283,0,283,11],[283,12,283,24],[283,25,283,37],[191,0,191,37],[193,35,193,37],[194,35,194,37],[195,35,195,37],[192,0,192,37],[203,35,203,37],[230,0,230,18],[230,20,230,21],[230,22,230,24],[230,25,230,27],[230,28,230,33],[230,34,230,37],[231,0,231,18],[231,20,231,21],[231,22,231,24],[231,25,231,27],[231,28,231,33],[231,34,231,37],[232,0,232,18],[0,35,0,37],[0,0,0,34],[116,30,116,35],[116,36,116,37],[123,0,123,4],[122,0,122,4],[121,0,121,4],[120,0,120,4],[121,5,121,17],[121,18,121,24],[121,25,121,28],[119,0,119,4],[118,0,118,4],[4,2,4,3],[7,2,7,3],[7,4,7,25],[1,0,1,37],[2,2,2,3],[13,4,13,25],[14,2,14,3],[14,4,14,25],[15,4,15,25],[16,4,16,25],[17,2,17,3],[17,4,17,25],[8,4,8,25],[9,4,9,25],[10,4,10,25],[11,2,11,3],[11,4,11,25],[12,4,12,25],[16,2,16,3],[18,4,18,25],[15,2,15,3],[13,2,13,3],[19,4,19,25],[20,4,20,25],[22,0,22,37],[21,16,21,23],[21,24,21,32],[23,0,23,37],[24,0,24,26],[25,0,25,26],[18,2,18,3],[19,2,19,3],[20,2,20,3],[55,24,55,25],[26,0,26,8],[40,0,40,26],[44,0,44,37],[42,0,42,37],[43,0,43,37],[41,0,41,37],[35,0,35,37],[37,0,37,37],[39,0,39,37],[38,0,38,37],[36,0,36,37],[27,0,27,37],[28,0,28,37],[30,0,30,37],[32,0,32,37],[31,0,31,37],[29,0,29,37],[33,0,33,37],[34,0,34,37],[26,9,26,10],[49,0,49,26],[50,0,50,26],[46,0,46,37],[48,0,48,37],[47,0,47,37],[51,24,51,25],[52,24,52,25],[53,24,53,25],[54,24,54,25],[69,0,69,8],[66,9,66,20],[67,9,67,20],[68,9,68,20],[51,0,51,22],[52,0,52,22],[53,0,53,22],[54,0,54,22],[55,0,55,22],[67,0,67,8],[68,0,68,8],[57,0,57,37],[61,0,61,4],[61,5,61,26],[62,0,62,5],[62,6,62,26],[63,0,63,15],[63,16,63,17],[63,18,63,19],[63,20,63,21],[63,22,63,23],[58,0,58,26],[59,0,59,26],[60,0,60,37],[64,0,64,23],[64,25,64,26],[66,0,66,8],[65,0,65,37],[81,0,81,37],[82,36,82,37],[82,0,82,35],[84,0,84,35],[77,0,77,37],[72,27,72,28],[72,30,72,31],[73,0,73,37],[75,0,75,37],[74,36,74,37],[76,36,76,37],[78,36,78,37],[80,36,80,37],[79,0,79,37],[72,0,72,26],[95,0,95,37],[91,0,91,37],[93,0,93,37],[87,0,87,37],[89,0,89,37],[84,36,84,37],[86,36,86,37],[83,0,83,37],[85,0,85,37],[86,0,86,35],[88,0,88,35],[90,0,90,35],[92,0,92,35],[94,0,94,35],[88,36,88,37],[90,36,90,37],[92,36,92,37],[94,36,94,37],[103,0,103,37],[105,0,105,37],[107,0,107,37],[110,0,110,4],[110,25,110,28],[110,29,110,32],[110,33,110,37],[109,0,109,4],[109,25,109,28],[109,29,109,32],[109,33,109,37],[109,18,109,24],[109,5,109,17],[104,0,104,35],[110,18,110,24],[106,0,106,37],[108,0,108,37],[104,36,104,37],[114,25,114,28],[114,0,114,4],[114,29,114,32],[114,33,114,37],[111,0,111,4],[111,25,111,28],[111,29,111,32],[111,33,111,37],[112,0,112,4],[111,18,111,24],[111,5,111,17],[112,5,112,17],[113,5,113,17],[114,5,114,17],[112,25,112,28],[112,29,112,32],[112,33,112,37],[113,0,113,4],[113,25,113,28],[113,29,113,32],[113,33,113,37],[112,18,112,24],[113,18,113,24],[114,18,114,24],[124,0,124,4],[124,5,124,17],[124,18,124,24],[124,25,124,28],[131,0,131,4],[130,0,130,4],[130,5,130,17],[130,18,130,24],[130,25,130,28],[129,0,129,4],[128,0,128,4],[127,0,127,4],[127,25,127,28],[125,0,125,4],[126,0,126,4],[127,5,127,17],[127,18,127,24],[126,5,126,17],[126,18,126,24],[126,25,126,28],[129,25,129,28],[129,29,129,32],[129,33,129,37],[135,0,135,37],[137,0,137,37],[136,0,136,37],[132,0,132,4],[132,5,132,12],[132,13,132,29],[132,30,132,35],[132,36,132,37],[134,0,134,37],[130,29,130,32],[130,33,130,37],[131,29,131,32],[131,33,131,37],[154,0,154,37],[155,0,155,37],[148,0,148,3],[148,4,148,7],[144,0,144,37],[145,0,145,37],[146,13,146,16],[147,13,147,16],[140,0,140,37],[141,0,141,37],[142,0,142,37],[143,0,143,37],[147,0,147,9],[146,0,146,9],[146,11,146,12],[147,11,147,12],[146,35,146,36],[147,35,147,36],[147,18,147,19],[146,18,146,19],[147,21,147,33],[171,0,171,37],[173,0,173,37],[165,0,165,37],[167,0,167,37],[169,0,169,37],[156,0,156,37],[161,0,161,37],[163,0,163,37],[160,0,160,37],[164,0,164,37],[166,0,166,37],[168,0,168,37],[170,0,170,37],[172,0,172,37],[178,0,178,3],[178,25,178,26],[178,27,178,28],[178,29,178,34],[178,35,178,37],[176,0,176,37],[177,0,177,37],[178,4,178,24],[174,0,174,37],[175,0,175,37],[179,0,179,3],[179,25,179,28],[179,29,179,34],[179,35,179,37],[180,0,180,3],[180,25,180,28],[180,29,180,34],[180,35,180,37],[179,4,179,24],[180,4,180,24],[185,0,185,3],[185,25,185,28],[185,29,185,34],[185,35,185,37],[185,4,185,24],[183,0,183,3],[183,25,183,28],[183,29,183,34],[183,35,183,37],[184,0,184,3],[184,25,184,28],[184,29,184,34],[184,35,184,37],[183,4,183,24],[184,4,184,24],[200,35,200,37],[201,35,201,37],[202,35,202,37],[205,0,205,1],[204,0,204,1],[203,0,203,1],[202,0,202,1],[202,2,202,34],[205,2,205,34],[204,2,204,34],[200,2,200,34],[203,2,203,34],[274,23,274,25],[274,26,274,29],[273,23,273,25],[273,26,273,29],[271,26,271,29],[266,23,266,25],[266,26,266,29],[263,0,263,37],[260,0,260,37],[262,0,262,37],[261,0,261,37],[264,0,264,5],[267,0,267,12],[271,0,271,12],[264,6,264,26],[265,6,265,26],[274,0,274,12],[274,30,274,37],[266,13,266,22],[267,13,267,22],[271,13,271,22],[272,13,272,22],[273,13,273,22],[274,13,274,22],[242,0,242,21],[243,0,243,21],[240,22,240,24],[240,25,240,27],[240,28,240,33],[240,34,240,37],[232,20,232,21],[232,22,232,24],[272,0,272,12],[258,30,258,35],[259,0,259,37],[258,36,258,37],[252,1,252,23],[252,24,252,26],[253,0,253,26],[255,0,255,37],[256,0,256,37],[244,25,244,27],[244,28,244,33],[250,24,250,26],[251,1,251,23],[249,0,249,26],[244,22,244,24],[257,0,257,37],[216,22,216,24],[216,25,216,27],[216,28,216,33],[216,34,216,37],[215,0,215,37],[45,0,45,37],[150,0,150,37],[152,0,152,37],[239,22,239,24],[239,25,239,27],[239,28,239,33],[239,34,239,37],[236,22,236,24],[236,25,236,27],[236,28,236,33],[236,34,236,37],[237,22,237,24],[237,25,237,27],[237,28,237,33],[237,34,237,37],[234,34,234,37],[149,0,149,37],[205,35,205,37],[199,0,199,26],[216,0,216,21],[204,35,204,37],[221,22,221,24],[221,34,221,37],[123,29,123,32],[123,33,123,37],[124,29,124,32],[124,33,124,37],[125,5,125,17],[125,18,125,24],[190,36,190,37],[220,25,220,27],[220,28,220,33],[220,34,220,37],[219,0,219,21],[220,0,220,21],[217,22,217,24],[217,25,217,27],[219,22,219,24],[146,21,146,33],[148,8,148,37],[159,0,159,37],[214,0,214,37],[219,34,219,37],[115,5,115,17],[119,5,119,17],[119,18,119,24],[119,25,119,28],[117,0,117,37],[115,0,115,4],[115,25,115,28],[115,29,115,32],[115,33,115,37],[115,18,115,24],[116,13,116,29],[116,0,116,4],[116,5,116,12],[239,0,239,21],[240,0,240,21],[241,0,241,21],[131,5,131,17],[131,18,131,24],[196,0,196,37],[222,34,222,37],[221,0,221,21],[222,0,222,21],[225,20,225,21],[225,22,225,24],[225,25,225,27],[225,28,225,33],[225,34,225,37],[224,20,224,21],[224,22,224,24],[224,25,224,27],[224,28,224,33],[235,34,235,37],[222,25,222,27],[222,28,222,33],[217,28,217,33],[217,34,217,37],[234,0,234,21],[266,30,266,37],[267,30,267,37],[271,30,271,37],[272,30,272,37],[273,30,273,37],[266,0,266,12],[235,0,235,21],[236,0,236,21],[237,0,237,21],[272,23,272,25],[272,26,272,29],[267,23,267,25],[267,26,267,29],[271,23,271,25],[258,5,258,10],[258,11,258,29],[243,22,243,24],[243,25,243,27],[243,28,243,33],[243,34,243,37],[273,0,273,12],[246,25,246,27],[246,28,246,33],[238,0,238,21],[242,25,242,27],[242,28,242,33],[242,34,242,37],[228,22,228,24],[228,25,228,27],[228,28,228,33],[233,28,233,33],[233,34,233,37],[235,22,235,24],[242,22,242,24],[232,25,232,27],[232,28,232,33],[232,34,232,37],[233,22,233,24],[233,25,233,27],[241,22,241,24],[241,25,241,27],[241,28,241,33],[241,34,241,37],[238,25,238,27],[238,34,238,37],[229,25,229,27],[229,28,229,33],[229,34,229,37],[228,34,228,37],[228,0,228,18],[229,0,229,18],[223,0,223,21],[224,0,224,18],[224,34,224,37],[225,0,225,18],[226,0,226,18],[226,20,226,21],[226,22,226,24],[226,25,226,27],[226,28,226,33],[226,34,226,37],[227,0,227,18],[227,20,227,21],[227,22,227,24],[227,25,227,27],[227,28,227,33],[227,34,227,37],[246,34,246,37],[247,22,247,24],[247,34,247,37],[244,34,244,37],[245,22,245,24],[245,25,245,27],[245,28,245,33],[245,34,245,37],[258,0,258,4],[245,0,245,21],[246,0,246,21],[247,0,247,21],[254,0,254,37],[244,0,244,21],[246,22,246,24],[248,0,248,37],[251,24,251,26],[250,1,250,23],[190,0,190,4],[190,13,190,29],[190,5,190,12],[125,25,125,28],[118,29,118,32],[238,28,238,33],[234,22,234,24],[234,25,234,27],[234,28,234,33],[228,20,228,21],[190,30,190,35],[125,29,125,32],[125,33,125,37],[201,0,201,1],[200,0,200,1],[201,2,201,34],[195,0,195,1],[194,0,194,1],[193,0,193,1],[217,0,217,21],[218,0,218,21],[238,22,238,24],[229,20,229,21],[229,22,229,24],[126,29,126,32],[126,33,126,37],[220,22,220,24],[219,25,219,27],[219,28,219,33],[218,22,218,24],[218,25,218,27],[218,28,218,33],[222,22,222,24],[218,34,218,37],[127,29,127,32],[127,33,127,37],[128,18,128,24],[128,25,128,28],[128,29,128,32],[195,2,195,34],[194,2,194,34],[193,2,193,34],[197,30,197,37],[198,30,198,37],[198,0,198,12],[197,0,197,12],[198,13,198,21],[197,13,197,21],[233,0,233,18],[233,20,233,21],[2,4,2,25],[6,4,6,25],[5,4,5,25],[4,4,4,25],[3,4,3,25],[74,0,74,35],[76,0,76,35],[78,0,78,35],[80,0,80,35],[3,2,3,3],[5,2,5,3],[6,2,6,3],[8,2,8,3],[9,2,9,3],[10,2,10,3],[12,2,12,3],[56,0,56,37],[66,21,66,37],[67,21,67,37],[68,21,68,37],[70,0,70,8],[71,0,71,37],[69,9,69,20],[69,21,69,37],[102,0,102,35],[96,36,96,37],[98,36,98,37],[100,36,100,37],[102,36,102,37],[120,5,120,17],[120,18,120,24],[120,25,120,28],[120,29,120,32],[120,33,120,37],[118,5,118,17],[118,18,118,24],[118,25,118,28],[110,5,110,17],[118,33,118,37],[119,33,119,37],[101,0,101,37],[99,0,99,37],[97,0,97,37],[96,0,96,35],[98,0,98,35],[100,0,100,35],[198,22,198,29],[197,22,197,29],[123,5,123,17],[123,18,123,24],[123,25,123,28],[128,33,128,37],[129,5,129,17],[129,18,129,24],[119,29,119,32],[153,0,153,37],[151,0,151,37],[121,29,121,32],[121,33,121,37],[122,5,122,17],[122,18,122,24],[122,25,122,28],[122,29,122,32],[122,33,122,37],[128,5,128,17],[138,0,138,20],[138,21,138,25],[139,0,139,37],[133,0,133,37],[131,25,131,28],[206,2,206,34],[206,35,206,37],[211,0,211,1],[211,2,211,34],[211,35,211,37],[212,0,212,1],[212,2,212,34],[212,35,212,37],[207,2,207,37],[208,2,208,37],[209,2,209,37],[210,2,210,37],[206,0,210,1],[270,0,270,12],[270,13,270,22],[270,23,270,25],[270,26,270,29],[270,30,270,37],[268,0,268,12],[268,13,268,22],[268,23,268,25],[268,26,268,29],[268,30,268,37],[269,0,269,12],[269,13,269,22],[269,23,269,25],[269,26,269,29],[269,30,269,37]]}
["Supportive Services Plan\nThis worksheet must be completed if Project has one or more Supportive Housing or Special Needs units",null,null,null,null,null,null,null,null,null,null,null,null,null,null,null,null,null,null,null,null,null,null,null,null,null,null,null,null,null,null,null,null,null,null,{"$f":"'B - Project Requirements'!AJ1:AL1","v":"2020-01-07"},null,null,"Adult day care"]
["Instructions: All Projects that include Supportive Housing units must complete a Supportive Services Plan for the MHP units. The checklist below shall serve as a guide to ensure that the Supportive Services Plan is complete. ",null,null,null,null,null,null,null,null,null,null,null,null,null,null,null,null,null,null,null,null,null,null,null,null,null,null,null,null,null,null,null,null,null,null,null,null,null,"Attendant care"]
[null,null,"Part I.",null,"Tenant Selection Narrative",null,null,null,null,null,null,null,null,null,null,null,null,null,null,null,null,null,null,null,null,null,null,null,null,null,null,null,null,null,null,null,null,null,"Educational services"]
[null,null,null,null,"Section 1: Tenant Selection Criteria",null,null,null,null,null,null,null,null,null,null,null,null,null,null,null,null,null,null,null,null,null,null,null,null,null,null,null,null,null,null,null,null,null,"Legal assistance"]
[null,null,"Part II.",null,"Lead Service Provider (LSP) Detail",null,null,null,null,null,null,null,null,null,null,null,null,null,null,null,null,null,null,null,null,null,null,null,null,null,null,null,null,null,null,null,null,null,"Life skills training"]
[null,null,null,null,"Section 1: Lead Service Provider (LSP)",null,null,null,null,null,null,null,null,null,null,null,null,null,null,null,null,null,null,null,null,null,null,null,null,null,null,null,null,null,null,null,null,null,"Linkage to out-placements"]
[null,null,null,null,"Section 2: Best Practices in Service Delivery",null,null,null,null,null,null,null,null,null,null,null,null,null,null,null,null,null,null,null,null,null,null,null,null,null,null,null,null,null,null,null,null,null,"Medication management"]
[null,null,"Part III. ",null,"Supportive Services Detail ",null,null,null,null,null,null,null,null,null,null,null,null,null,null,null,null,null,null,null,null,null,null,null,null,null,null,null,null,null,null,null,null,null,"Parenting education (family Projects)"]
[null,null,null,null,"Section 1:  Supportive Services Chart",null,null,null,null,null,null,null,null,null,null,null,null,null,null,null,null,null,null,null,null,null,null,null,null,null,null,null,null,null,null,null,null,null,"Peer support & advocacy"]
[null,null,null,null,"Section 2: Supportive Services Coordination",null,null,null,null,null,null,null,null,null,null,null,null,null,null,null,null,null,null,null,null,null,null,null,null,null,null,null,null,null,null,null,null,null,"Representative payee"]
[null,null,null,null,"Section 3: Verification from Appropriate Public or Non-Profit Funding Agency",null,null,null,null,null,null,null,null,null,null,null,null,null,null,null,null,null,null,null,null,null,null,null,null,null,null,null,null,null,null,null,null,null,"Social & rec activities"]
[null,null,"Part IV. ",null,"Tenant Safety and Engagement"]
[null,null,null,null,"Section 1: Tenant Engagement"]
[null,null,null,null,"Section 2: Safety and Security"]
[null,null,"Part V. ",null,"Staffing"]
[null,null,null,null,"Section 1: Staffing Chart"]
[null,null,null,null,"Section 2: Staffing Ratios"]
[null,null,"Part VI. ",null,"Supportive Services Budget"]
[null,null,null,null,"Section 1: Supportive Services Budget Table & Cost Per Unit Table"]
[null,null,null,null,"Section 2: Budget Narrative and Funding Commitments"]
[null,null,null,null,"Section 3: Service Funding History Table"]
[]
["Part I. Tenant Selection Narrative"]
["This section asks for a detailed description of your tenant selection process. Using the titled sections below, your narrative should be as specific as possible, delineating the roles of property management and the Lead Service Provider and how these functions will be coordinated. Your description should clearly and conclusively document processes to ensure MHP tenant households as reported in the Max Loan & Unit Mix worksheet occupy MHP assisted units following tenant selection and Housing First Practices. "]
["Section 1: Tenant Selection Criteria"]
["1. Target Tenant Population and Eligibility Criteria"]
["a. Do you use Housing First Practices? "]
["b. Describe the criteria that will be used to ensure that applicants are eligible to occupy the MHP assisted units. "]
[]
["c. If your tenants may include minor children and/or adult dependents, describe any additional criteria that will be used to ensure applicants are eligible to occupy the MHP assisted units. "]
[]
["d. If not stated in question (b) in this Section, describe the criteria relating to the applicant's income eligibility, homeless status (SH Chronic Homeless, SNP Homeless with Disability, and SNP Other Homeless ), and disability, if applicable to the Project's target population. "]
[]
["e. Describe any additional eligibility criteria other than those indicated above, i.e., information needed to determine if applicant can comply with lease terms. Note: Selection criteria designed to assess anything other than the ability to comply with lease terms generally run afoul of fair housing laws designed to protect equal access to housing for people with disabilities."]
["See Between the Lines, A Question and Answer Guide on Legal Issues in Supportive Housing Chapter 4."]
[]
["f. List the tenant disclosures you provide to applicants/tenants. Example: Megan's Law disclosures. "]
[]
["g. How you will use the local Coordinated Entry System (CES) for selecting tenants? If the local Coordinated Entry System is not yet operational, describe your plan to use it for tenant selection when it is established. In your response, include the name and contact information for your system contact person."]
[]
["2. Marketing/Outreach"]
["a. Describe marketing/outreach efforts to publicize MHP to potential tenants."]
[]
["b. If your tenants will include minor children and / or adult dependents, describe the specific marketing outreach that will be used to publicize unit availability. "]
[]
["c. For units restricted to Supportive Housing (SH) and Special Need Populations (SNP), describe your plan to prioritize highly vulnerable households referred by the local CES."]
[]
["d. Describe your plan to coordinate directly and accept referrals for homeless from emergency shelters, safe havens, drop-in centers, domestic violence shelters, family shelters and street outreach programs frequented by the vulnerable experiencing homelessness. "]
[]
["3. Characteristics of SH and SNP"]
["a. Please confirm compliance by checking all of the characteristics that apply to the MHP units in your Project:"]
["Tenant holds a lease in his/her name and is responsible for paying rent?"]
["Tenant has his/her own room or apt. and is individually responsible for selecting a roommate in any shared tenancy?"]
["Tenant may stay as long as he/she pays his or her share of rent and complies with the terms of his/her lease? "]
["Unit is subject to applicable state and federal landlord tenant laws?"]
["Participation in services or any particular service shall not be required as a condition of tenancy?"]
["b. Typically, all the characteristics listed above must be present in order for the Project to be eligible as SH and SNP. Please explain mitigating circumstances for any missing characteristic:"]
[]
["Part II. Lead Service Provider (LSP) Detail"]
["Section 1: LSP"]
["The LSP is the entity that has overall responsibility for the provision of supportive services & implementation of the Supportive Services Plan. The LSP provides comprehensive case management services (individualized services planning & the provision of connections to mental health, substance use, employment, health, housing retention) and may also coordinate with other agencies that do so. "]
["1. LSP name:"]
["Relationship to Sponsor:"]
["How Long has the LSP been providing services to homeless:",null,null,null,null,null,null,null,null,null,null,null,null,null,null,null,null,null,"years",null,null,null,"months"]
["How many Projects have the Sponsor and LSP completed together? (Provide list of completed Projects when submitting) "]
["2. List any additional agencies that will be providing comprehensive case management services to residents. Describe population(s) they will serve and how their services will be coordinated by the LSP. "]
["Agency Name",null,null,null,null,null,null,null,null,"Populations the Agency will serve",null,null,null,null,null,null,null,null,null,null,null,"How Services will be Coordinated"]
[]
[]
[]
["Section 2: Best Practices in Service Delivery"]
["1. Fully describe in the yellow cells below for each question how best practices will be utilized in your service delivery model. Include a description of policies and periodic training plans. For the clinical interventions in this section, include a description of how the intervention is used and to describe training. Note: Do not include definitions of these practices. "]
["Supplemental Security Income/Social Security Disability Ins. Outreach, Access, and Recovery (SOAR): Staff trained prior to lease up?"]
[]
["Critical Time Intervention: Staff trained prior to lease up?"]
[]
["Trauma-Informed Care: Staff trained prior to lease up?"]
[]
["Motivational Interviewing: Staff trained prior to lease up?"]
[]
["Voluntary Moving-on strategies: Staff trained prior to lease up?"]
[]
["Safety and security of staff and residents: Staff trained prior to lease up?"]
[]
["Peer Support (include length of time Peer Support program used, if applicable): Staff trained prior to lease up?"]
[]
["Case conferencing: Staff trained prior to lease up?"]
[]
["Communicating the Sponsor's and LSP's program philosophy, values, and principles: Staff trained prior to lease up?"]
[]
["Rent by residents during periods of hospitalization: Staff trained prior to lease up?"]
[]
["Resident Privacy and Confidentiality: Staff trained prior to lease up?"]
[]
["Appropriate communication between property management and service providers: Staff trained prior to lease up?"]
[]
["Making applicants aware of the reasonable accommodations procedure: Staff trained prior to lease up?"]
[]
["Receiving and resolving tenant grievances: Staff trained prior to lease up?"]
[]
["Appropriate responses to tenant crises: Staff trained prior to lease up?"]
[]
["Retention of tenants regardless of their use of substances: Staff trained prior to lease up?"]
[]
["Cultural Competency: Staff trained prior to lease up?"]
[]
["Part III. Supportive Services Detail"]
["Section 1: Supportive Services Chart"]
["Minimum Services: List and describe all minimum services to be provided to tenants of the MHP assisted units. Please be sure that the services listed address all the service needs of all the target populations listed in Occupancy Restrictions. The chart must include each of the services listed. Attach the agreement for each of the minimum services listed."]
[" Resident Service",null,null,null,null,"Service Description",null,null,null,null,null,null,null,null,null,null,null,null,"Service Provider(s)",null,null,null,null,null,null,"Relationship to Sponsor",null,null,null,"Agreement",null,null,null,"Off-site Service Location"]
["List each service separately",null,null,null,null,"Describe service, including the frequency and degree to which services are provided.",null,null,null,null,null,null,null,null,null,null,null,null,"Provider's Name",null,null,null,null,null,null,"Sponsor, separate division of Sponsor’s organization, or a Project Partner",null,null,null,"If service will be provided by a non-Sponsor entity, indicate type of agreement under which service will be provided.",null,null,null,"If service is on-site, leave blank. Enter distance, in miles, to off-site service and resident commuting plan."]
["Case management with individual service plans"]
["Benefits counseling and advocacy"]
["Mental health care"]
["Physical health care"]
["Substance use services"]
["File Name:",null,null,null,null,{"$f":"Checklist!D86","v":"22g. LSP NonSpon SS Contract Basic"},null,null,null,null,null,null,null,{"$f":"Checklist!M86","v":"Lead Service Provider Contract, Agreement or Letter of Intent (non Sponsor provider)."},null,null,null,null,null,null,null,null,null,null,null,null,null,null,null,null,"Hard Copy and on USB?"]
["Enhanced Services: List and describe all enhanced services to be provided to tenants of the MHP assisted units. Indicate on the chart if a particular service is not needed for the target population and insert or attach a justification. Examples of specific services are provided in the left hand column below. If multiple services will be provided in the service categories provided below, attach any additional description. Empty spaces are available at the bottom of the table for the applicant to describe services not listed."]
[" Resident Service",null,null,null,null,"Service Description",null,null,null,null,null,null,null,null,null,null,null,null,"Service Provider(s)",null,null,null,null,null,null,"Relationship to Sponsor",null,null,null,"Agreement",null,null,null,"Off-site Service Location"]
["List each service separately",null,null,null,null,"Describe service, including the frequency and degree to which services are provided.",null,null,null,null,null,null,null,null,null,null,null,null,"Provider's Name",null,null,null,null,null,null,"Sponsor, separate division of Sponsor’s organization, or a Project Partner",null,null,null,"If service will be provided by a non-Sponsor entity, indicate type of agreement under which service will be provided.",null,null,null,"If service is on-site, leave blank. Enter distance, in miles, to off-site service and resident commuting plan."]
["Employment & OJT placement/training:\n-job search\n-resume writing\n-interview assistance\n-job placement\n-OJT training"]
["Education assistance/benefits information:\n-GI Bill counseling\n-college application assistance\n-financial aid assistance"]
["Financial counseling/debt counseling:\n-debt mitigation\n-budgeting\n-emergency savings\n-predatory practices"]
["Childcare assistance/services:\n-transportation to/from\n-onsite daycare\n-afterschool care\nfinancial assistance\n-parenting education"]
["Family law service:\n-pro bono legal advice\n-no/low cost legal serv.\n-custody disputes\n-divorce\n-domestic violence restraining orders"]
["Life skills/soft skills:\n-grooming\n-nutrition/cooking\n-interpersonal communication\n-laundry/household maintenance"]
["Legal services:\n-reinstatement of benefits after incarceration\n-discharge upgrades\n-pro bono legal advice\n-diversion courts"]
["Out-patient family therapy/counseling:\n-family counseling\n-individual counseling\n-couple's counseling\n"]
["Domestic violence support:\n-DV center\n-restraining order assist.\n-safety plan\n-contact w/law enforcement\n-credit/identity locks"]
["Food bank/meal support services:\n-no cost/low cost food\n-SNAP/TANF support"]
[]
[]
["File Name:",null,null,null,null,{"$f":"Checklist!D87","v":"22h. NonSpon SS Contract Enhanced"},null,null,null,null,null,null,null,{"$f":"Checklist!M87","v":"Contract, Agreement or Letter of Intent to Provide Services (other non Sponsor providers)."},null,null,null,null,null,null,null,null,null,null,null,null,null,null,null,null,"Attached and on USB?"]
["Section 2: Supportive Services Coordination"]
["1. Describe the accessibility of community services to which you propose linkages, whether they are on-site or in close proximity to the Project, including the hours they are available, and the frequency, travel time and cost to the tenant for transportation required to access the services to include both public transportation and private transportation services (e.g. van owned by the provider). Additionally, describe how services will accommodate cultural, trauma-based, and disability related barriers to services. Provide documentation, in the form of Memorandum of Understanding, Memorandum of Agreement, letters of support or contracts demonstrating who will be responsible for ensuring access to services and how accessibility will be accomplished if not already included in agreement provided for service provision."]
[]
["2. Describe which community/county/state funded programs will be utilized to meet the needs of your residents, particularly if those residents are dependents of tenants. "]
[]
["3. How long have you worked with the Homeless program Coordinators in your area?"]
["Section 3: Verification from Appropriate Public or Non-profit Funding Agency"]
["All applications shall include a verification from an appropriate funding entity (either public or non-profit) knowledgeable about the supportive service needs of the targeted population, indicating that the proposed services are appropriate to meet the needs of the targeted SH and SNP population(s). The verification shall endorse the primary service provider as a known provider of support services to the target population the sponsor is proposing to serve. The Project Sponsor and/or Service Provider are not eligible to provide the Funding Agency Verification. "]
["Please use the attached Supportive Service Verification form from the Appropriate Public or Non-Profit Agency. Please submit one verification for each target population checked in Part 1, Section 2. If appropriate, a single funder may provide a verification for multiple populations (i.e. a County Department of Health Services could provide a verification for a Project serving individuals with HIV/AIDS, Chronic Substance Abuse and Other Chronic Health Conditions). Please be sure to indicate on the verification form the target populations to which each verification applies."]
["Part IV. Tenant Safety And Engagement "]
["Section 1: Tenant Engagement"]
["Sponsor should describe strategies to engage residents in services, services planning/operations, and in building community and facility operations. Note: The tenant engagement plan is distinct from your marketing and outreach efforts for attracting applicants to the Project. "]
["1. Will your services engagement outreach strategy include:"]
["Outreach to both applicants and residents?",null,null,null,null,null,null,null,null,null,null,null,null,"Door-knocking?",null,null,null,null,null,null,null,"Leafleting?"]
["Assessment prior to leasing?",null,null,null,null,null,null,null,null,null,null,null,null,"Peer contacts?",null,null,null,null,null,null,null,"Outreach to organizations that work directly with target population? "]
["Other strategies?",null,null,null,"Please describe:"]
["2. Describe your strategies to engage residents in social interaction, building operations, and community involvement within the Project."]
[]
["3. Describe your strategies to engage residents in planning and delivery of resident's services."]
[]
["4. Describe how the physical building space supports social interaction and the provision of services."]
[]
["5. If you plan to conduct tenant satisfaction surveys, describe types of questions asked, how they are reviewed, what you do with results, and how often you conduct this survey."]
[]
["6. Describe your strategies to engage residents in services, services planning/operations, and in building community and facility operations. Also indicate how those with disabilities will be connected to the community within the building. "]
[]
["Section 2: Safety and Security"]
["1. Summarize your written policies and procedures on privacy and confidentiality of residents."]
[]
["2. Summarize your written policies and procedures on sign in/out procedures, fire/safety drills, posted local contacts in case of emergency."]
[]
["3. Describe your building design safety features for ensuring resident and staff safety (include lighting, entrance/exits, locked doors, common area locations)."]
[]
["4. Summarize your written policies and procedures on ensuring staff safety."]
[]
["5. Summarize your written policies for addressing violations of resident/staff safety by residents or staff. "]
[]
["6. Describe your guest/visitor policy for residents."]
[]
["7. Summarize your written policies for coordination with property management for resolution of tenant issue. "]
[]
["Part V. Staffing"]
["Section 1: Staffing Chart "]
["List all staff positions that will provide services to the tenants of the MHP assisted units. Include Sponsor or LSP staff positions, and any staff positions of partnering organizations who have committed time to the Project. Include your services coordination staff.  For each position, list the position title, minimum requirements, the full-time equivalent (FTE), the organization under which the position resides, and the location of the position (on-site or off-site). Do not include staff which serve non-MHP units. If a staff position serves both tenants in MHP and non-MHP units, include only that portion (i.e., % FTE) of the staff position dedicated to MHP assisted units. Attach a copy of each positions duty statement."]
["Note: All staff positions listed here must be reflected in the Supportive Services Budget Table. Be sure to indicate which staff position will be responsible for Homeless Management Information System data entry. If the cost of supportive service position is included as part of the Project’s operating budget and the position will serve SH and SNP units, that position must be included in this chart."]
["Title",null,null,null,"Minimum requirements",null,null,null,null,null,null,null,null,null,null,null,null,null,null,null,null,null,null,null,null,"Total FTE:",null,{"$f":"SUM(Z181:AC190)","v":0},null,"Employing Organization",null,null,null,null,null,"Location"]
["List each staff position ",null,null,null,"Enter a summary of required staff's experience and education. Note: doesn't take the place of the job description or duty statement.",null,null,null,null,null,null,null,null,null,null,null,null,null,null,null,null,null,null,null,null,"Indicate FTE staff positions for MHP units (half-time is 0.5 FTE)",null,null,null,"This could be the LSP, Sponsor or a Project Partner",null,null,null,null,null,"Select \"On-Site\" or \"Off-Site\""]
[]
[]
[]
[]
[]
[]
[]
[]
[]
[]
["File Name:",null,null,null,null,{"$f":"Checklist!D88","v":"22i. Duty Stmt1, Duty Stmt2, Duty Stmt3, Duty Stmt4"},null,null,null,null,null,null,null,{"$f":"Checklist!M88","v":"Staff Duty Statements (all providers)."},null,null,null,null,null,null,null,null,null,null,null,null,null,null,null,null,"Hard Copy and on USB?"]
["Section 2: Staffing Ratios "]
["1. Indicate the overall services staffing level for your Project by completing the calculation below. "]
["a.",null,"Total MHP Assisted units",null,null,null,null,null,null,null,null,null,null,null,null,null,null,null,null,null,null,null,null,null,null,null,null,null,null,null,null,null,null,null,null,{"$f":"'D - Max Loan & Unit Mix'!G36","v":0}]
["b.",null,"Total FTE Service Staff from the Staffing Chart for the MHP Assisted units"]
["c.",null,"Number of MHP units per FTE Staff Person (a÷b)",null,null,null,null,null,null,null,null,null,null,null,null,null,null,null,null,null,null,null,null,null,null,null,null,null,null,null,null,null,null,null,null,{"$f":"IF(AJ195=0,0,AJ194/AJ195)","v":0}]
["2. Complete case manager staffing ratio chart. Include all case mgmt. staff in staffing & budget forms, requires FTE case mgr. to resident ratios be appropriate to specific MHP populations as follows. Higher level staffing resulting in higher ratio is allowable:"]
["Population Type",null,null,null,null,null,null,null,null,null,null,null,null,"SH Chronic Homeless",null,null,null,null,null,null,null,null,"SNP Homeless with Disability",null,null,null,null,null,null,null,"SNP Other"]
["Minimum Case Mgr. Ratio",null,null,null,null,null,null,null,null,null,null,null,null,"1:20",null,null,null,null,null,null,null,null,"1:25",null,null,null,null,null,null,null,"1:40"]
["Case Manager Staffing Ratio",null,null,null,null,null,null,null,null,null,null,null,null,null,null,null,null,null,null,null,null,null,null,null,null,null,null,null,null,null,null,null,null,null,null,null,null,null,null,null,null,null,null,"Agricultural workers"]
["a.",null,"Total MHP Assisted units for SH Chronic Homeless",null,null,null,null,null,null,null,null,null,null,null,null,null,null,null,null,null,null,null,null,null,null,null,null,null,null,null,null,null,null,null,null,null,null,null,"SH Chronic Homeless",null,null,null,null,"Individuals living with physical or sensory disabilities and transitioning from hospitals, nursing homes, development centers, or other care facilities"]
["b.",null,"Total case manager FTE devoted to tenants in units reserved for the above population",null,null,null,null,null,null,null,null,null,null,null,null,null,null,null,null,null,null,null,null,null,null,null,null,null,null,null,null,null,null,null,null,null,null,null,"SNP Homeless with Disability",null,null,null,null,"Individuals living with developmental disabilities, serious mental illness or substance abuse disorders"]
["c.",null,"Number of MHP Assisted units for the above population per case manager FTE (a÷b)",null,null,null,null,null,null,null,null,null,null,null,null,null,null,null,null,null,null,null,null,null,null,null,null,null,null,null,null,null,null,null,null,{"$f":"IF(AJ202=0,0,AJ201/AJ202)","v":0},null,null,"SNP Other Homeless",null,null,null,null,"Individuals who are survivors of domestic violence, sexual assault, and human trafficking"]
["d.",null,"Total MHP Assisted units for SNP Homeless with Disability per §7301(z)",null,null,null,null,null,null,null,null,null,null,null,null,null,null,null,null,null,null,null,null,null,null,null,null,null,null,null,null,null,null,null,null,null,null,null,null,null,null,null,null,"Individuals who are experiencing Homelessness"]
["e.",null,"Total case manager FTE devoted to tenants in units reserved for the above population",null,null,null,null,null,null,null,null,null,null,null,null,null,null,null,null,null,null,null,null,null,null,null,null,null,null,null,null,null,null,null,null,null,null,null,null,null,null,null,null,"Individuals with HIV"]
["f.",null,"Number of MHP Assisted units for the above population per case manager FTE (e÷f)",null,null,null,null,null,null,null,null,null,null,null,null,null,null,null,null,null,null,null,null,null,null,null,null,null,null,null,null,null,null,null,null,{"$f":"IFERROR((AJ204/AJ205),0)","v":0},null,null,null,null,null,null,null,"Homeless youth as defined in Government Code (GC) Section 12957(e)(2)"]
["g.",null,"Total MHP Assisted units for SNP Other per §7301(z) - select 'SNP Other' categories below",null,null,null,null,null,null,null,null,null,null,null,null,null,null,null,null,null,null,null,null,null,null,null,null,null,null,null,null,null,null,null,null,null,null,null,null,null,null,null,null,"Families in the child welfare system for whom the absence of housing is a barrier to family reunification, as certified by a county"]
[null,null,null,null,null,null,null,null,null,null,null,null,null,null,null,null,null,null,null,null,null,null,null,null,null,null,null,null,null,null,null,null,null,null,null,null,null,null,null,null,null,null,null,"Frequent users of public health or mental health services, as identified by a public health or mental health agency"]
[null,null,null,null,null,null,null,null,null,null,null,null,null,null,null,null,null,null,null,null,null,null,null,null,null,null,null,null,null,null,null,null,null,null,null,null,null,null,null,null,null,null,null,"Frail Elderly persons"]
[null,null,null,null,null,null,null,null,null,null,null,null,null,null,null,null,null,null,null,null,null,null,null,null,null,null,null,null,null,null,null,null,null,null,null,null,null,null,null,null,null,null,null,"Other specific groups with unique housing needs as determined by the Department"]
[]
["h.",null,"Total case manager FTE devoted to tenants in units reserved for the above population"]
["i.",null,"Number of MHP Assisted units for the above population per case manager FTE (g÷h)",null,null,null,null,null,null,null,null,null,null,null,null,null,null,null,null,null,null,null,null,null,null,null,null,null,null,null,null,null,null,null,null,{"$f":"IFERROR((AJ207/AJ212),0)","v":0}]
["Part VI. Supportive Services Budget"]
["Section 1: Supportive Services Budget Table.\nProvide a line item Supportive Services Budget for Project using format below. Complete both income and expense portions of the budget. Include all costs associated with implementing your Supportive Services Plan, including any in-kind services. Include income and expenses for Sponsor or LSP staff positions, and also any staff positions of partnering organizations who have committed time to the Project. Total expenses should equal total income. Add expense item categories & lines as necessary. Don't include costs associated with providing services in non-MHP assisted units. If costs are associated with both MHP & non-MHP assisted units, include only that portion of costs associated with MHP assisted units."]
["Note: If the cost of supportive services is included as part of the Project's Operating Budget (as documented in the UA) and the funds will serve MHP units, this position/expense item and the dollars associated with it (or that portion connected to the MHP units) must be included in this Supportive Services Budget Table. These funds should be categorized as \"Not Committed\" in the Status column."]
["Income Source/Program Name",null,null,null,null,null,null,null,null,null,null,null,null,null,null,null,null,null,null,null,null,null,"Amount",null,null,"Type",null,null,"Status",null,null,null,null,null,"% of Total Budget"]
[null,null,null,null,null,null,null,null,null,null,null,null,null,null,null,null,null,null,null,null,null,null,null,null,null,null,null,null,null,null,null,null,null,null,{"$f":"IF($W$222=0,0,W218/$W$222)","v":0}]
[null,null,null,null,null,null,null,null,null,null,null,null,null,null,null,null,null,null,null,null,null,null,null,null,null,null,null,null,null,null,null,null,null,null,{"$f":"IF($W$222=0,0,W219/$W$222)","v":0}]
[null,null,null,null,null,null,null,null,null,null,null,null,null,null,null,null,null,null,null,null,null,null,null,null,null,null,null,null,null,null,null,null,null,null,{"$f":"IF($W$222=0,0,W220/$W$222)","v":0}]
[null,null,null,null,null,null,null,null,null,null,null,null,null,null,null,null,null,null,null,null,null,null,null,null,null,null,null,null,null,null,null,null,null,null,{"$f":"IF($W$222=0,0,W221/$W$222)","v":0}]
["Total Revenue:",null,null,null,null,null,null,null,null,null,null,null,null,null,null,null,null,null,null,null,null,null,{"$f":"SUM(W218:Y221)","v":0},null,null,null,null,null,null,null,null,null,null,null,{"$f":"SUM(AI218:AL221)","v":0}]
["Expense Item",null,null,null,null,null,null,null,null,null,null,null,null,null,null,null,null,null,null,null,null,null,"Amount",null,null,"Type",null,null,"Status",null,null,null,null,null,"% of Total Budget"]
["Staff Salaries: List by title of position. (This list must match the Staffing Chart above.)"]
["Staff Position",null,null,null,null,null,null,null,null,null,null,null,null,null,null,null,null,null,null,"FTE:",null,null,null,null,null,null,null,null,null,null,null,null,null,null,{"$f":"IF($W$248=0,0,W225/$W$248)","v":0}]
["Staff Position",null,null,null,null,null,null,null,null,null,null,null,null,null,null,null,null,null,null,"FTE:",null,null,null,null,null,null,null,null,null,null,null,null,null,null,0]
["Staff Position",null,null,null,null,null,null,null,null,null,null,null,null,null,null,null,null,null,null,"FTE:",null,null,null,null,null,null,null,null,null,null,null,null,null,null,{"$f":"IF($W$248=0,0,W227/$W$248)","v":0}]
["Staff Position",null,null,null,null,null,null,null,null,null,null,null,null,null,null,null,null,null,null,"FTE:",null,null,null,null,null,null,null,null,null,null,null,null,null,null,0]
["Staff Position",null,null,null,null,null,null,null,null,null,null,null,null,null,null,null,null,null,null,"FTE:",null,null,null,null,null,null,null,null,null,null,null,null,null,null,0]
["Staff Position",null,null,null,null,null,null,null,null,null,null,null,null,null,null,null,null,null,null,"FTE:",null,null,null,null,null,null,null,null,null,null,null,null,null,null,0]
["Staff Position",null,null,null,null,null,null,null,null,null,null,null,null,null,null,null,null,null,null,"FTE:",null,null,null,null,null,null,null,null,null,null,null,null,null,null,{"$f":"IF($W$248=0,0,W231/$W$248)","v":0}]
["Staff Position",null,null,null,null,null,null,null,null,null,null,null,null,null,null,null,null,null,null,"FTE:",null,null,null,null,null,null,null,null,null,null,null,null,null,null,0]
["Staff Position",null,null,null,null,null,null,null,null,null,null,null,null,null,null,null,null,null,null,"FTE:",null,null,null,null,null,null,null,null,null,null,null,null,null,null,0]
["Staff Position",null,null,null,null,null,null,null,null,null,null,null,null,null,null,null,null,null,null,"FTE:",null,null,null,null,null,null,null,null,null,null,null,null,null,null,0]
["Fringe Benefits ",null,null,null,null,null,null,null,null,null,null,null,null,null,null,null,null,null,null,null,null,null,null,null,null,null,null,null,null,null,null,null,null,null,0]
["Total Staff Expenses",null,null,null,null,null,null,null,null,null,null,null,null,null,null,null,null,null,null,null,null,null,{"$f":"SUM(W225:Y235)","v":0},null,null,null,null,null,null,null,null,null,null,null,0]
["Tenant Transportation",null,null,null,null,null,null,null,null,null,null,null,null,null,null,null,null,null,null,null,null,null,null,null,null,null,null,null,null,null,null,null,null,null,0]
["Equipment",null,null,null,null,null,null,null,null,null,null,null,null,null,null,null,null,null,null,null,null,null,null,null,null,null,null,null,null,null,null,null,null,null,0]
["Supplies",null,null,null,null,null,null,null,null,null,null,null,null,null,null,null,null,null,null,null,null,null,null,null,null,null,null,null,null,null,null,null,null,null,0]
["Travel",null,null,null,null,null,null,null,null,null,null,null,null,null,null,null,null,null,null,null,null,null,null,null,null,null,null,null,null,null,null,null,null,null,0]
["Office Rent/Occupancy Costs (don't include rent/leasing costs for SH units)",null,null,null,null,null,null,null,null,null,null,null,null,null,null,null,null,null,null,null,null,null,null,null,null,null,null,null,null,null,null,null,null,null,0]
["Training",null,null,null,null,null,null,null,null,null,null,null,null,null,null,null,null,null,null,null,null,null,null,null,null,null,null,null,null,null,null,null,null,null,0]
["Consultants: List by Function",null,null,null,null,null,null,null,null,null,null,null,null,null,null,null,null,null,null,null,null,null,null,null,null,null,null,null,null,null,null,null,null,null,0]
["Subcontractors/Partners (list by Entity & Service Type)",null,null,null,null,null,null,null,null,null,null,null,null,null,null,null,null,null,null,null,null,null,null,null,null,null,null,null,null,null,null,null,null,null,0]
["Other Expenses (type in expense description)",null,null,null,null,null,null,null,null,null,null,null,null,null,null,null,null,null,null,null,null,null,null,null,null,null,null,null,null,null,null,null,null,null,0]
["Other Expenses (type in expense description)",null,null,null,null,null,null,null,null,null,null,null,null,null,null,null,null,null,null,null,null,null,null,null,null,null,null,null,null,null,null,null,null,null,0]
["Other Expenses (type in expense description)",null,null,null,null,null,null,null,null,null,null,null,null,null,null,null,null,null,null,null,null,null,null,null,null,null,null,null,null,null,null,null,null,null,0]
["Total Expenses",null,null,null,null,null,null,null,null,null,null,null,null,null,null,null,null,null,null,null,null,null,{"$f":"SUM(W236:Y247)","v":0},null,null,null,null,null,null,null,null,null,null,null,{"$f":"SUM(AI236:AL247)","v":0}]
["Supportive Services Cost Per Unit: Permanent supportive housing best practice suggests a range between $5,000 - $10,000 annually in services per household, depending upon the intensity of the needs of the target population. Complete the following calculation about supportive services cost per unit for your Project. If your supportive services cost per unit, as calculated below, differ from industry practice, provide a narrative explanation. The Project must meet/address the industry standard."]
["Supportive Services Expense Per Unit Calculation Table"]
["a.","Total MHP SN & SH Assisted units",null,null,null,null,null,null,null,null,null,null,null,null,null,null,null,null,null,null,null,null,null,null,{"$f":"'D - Max Loan & Unit Mix'!I36+'D - Max Loan & Unit Mix'!K36","v":0}]
["b.","Total Supportive Services Expenses"]
["c.","Total Supportive Services Expenses per Unit: (b ÷ a)",null,null,null,null,null,null,null,null,null,null,null,null,null,null,null,null,null,null,null,null,null,null,{"$f":"IF(Y251=0,0,Y252/Y251)","v":0}]
["Section 2: Budget Narrative and Funding Commitments"]
["1. Describe how budgeted amts. are adequate to provide services described in Supportive Services Plan and in Services Staffing Table:"]
[]
["2. Document committed funds with letter from committing agency that includes the following. Documented services/funding must appear in Supportive Services Budget Table. "]
["a) Project name; b) Description of services to be funded or provided; c) Dollar value of funds or in-kind services. If cash is provided, state funding source; d) Funding term or service provision; e) A description and history of agency/organization providing funding or services."]
["File Name:",null,null,null,null,{"$f":"Checklist!D90","v":"22k. SS Fund Ltr1, SS Fund Ltr2, SS Fund Ltr3, etc…"},null,null,null,null,null,"Attach letter(s). Include: Project name; description of services; dollar value of funds or in-kind services; if cash is provided, state funding source; funding term; description & history of agency/org. providing funding or services. ",null,null,null,null,null,null,null,null,null,null,null,null,null,null,null,null,null,null,"Hard Copy and on USB?"]
["3. For funding that is not yet committed, specifically describe your experience filling major services funding gaps in similar housing."]
[]
["4. Describe in specific terms the plan to fill any service gaps that occur during Project life due to expiration of grants, partner withdrawals, cancellation of a commitment or any other reason. Describe experience filling service gaps caused by loss of major funding sources."]
[]
["Section 3: Service Funding History Table: The purpose of this section is to document the funding history of the LSP. The LSP shall document a history of securing supportive service funding sufficient for HCD to make a determination that the provider will be able to access funds from the programs that fund the services identified in the Supportive Services Chart. List only funding obtained in the last five years. Complete the table containing the information required below:"]
["Funding History for: ",null,null,null,null,null,{"$f":"IF(F62=\"\",\"\",F62)","v":""}]
[null,null,null,null,null,null,"(Name of Lead Service Provider)"]
["Source of Funds/Funding Program",null,null,null,null,null,null,null,null,null,null,null,null,"Purpose of Award (Use of Funds)",null,null,null,null,null,null,null,null,null,"Amount",null,null,"Award Date & Funding Term",null,null,null,"Population(s) Served"]
[]
[]
[]
[]
[]
[]
[]
[]
["Part VII. Collaboration, Measurable Outcomes and Plan for Evaluation"]
["Section 1: Collaboration"]
["Industry practice indicates that services are often best delivered by entities with specialized expertise. Consequently, effective projects are based on collaboration among organizations with different types of service expertise, or by specialized divisions within an organization. Project sponsors must document collaboration between two or more service providers. Applications will be deemed to meet the collaboration criteria if the application documents a commitment from a service organization other than the Applicant or affiliates of the Applicant to provide a portion of the services to project residents. Cooperation among specialized intra-organizational service programs, groups, or departments may also qualify as collaboration."]
["Based on the contracts you attached between you and nonaffiliated service providers, explain the collaboration between you and the service providers. Include a short narrative describing the collaborative relationship with the outside service provider or an intra-organizational service program, group, or department that is listed in the Supportive Service Chart. Describe the specific services with which the collaborative entity will be involved."]
[]
["Section 2: Measurable Outcomes"]
["Outcomes are what you expect to happen for the people served by your project. Outcomes are sometimes called results. Outcome objectives are time-specific measurable goals that identify how you know if you are achieving your desired results. Outcome objectives are sometimes called outcome benchmarks or indicators. "]
["Please categorize the outcomes for your project into the following three categories: "]
["Category",null,null,null,null,null,null,null,null,null,null,null,"Outcomes",null,null,null,null,null,null,null,null,null,null,null,null,"Outcome Objectives"]
["Residential Stability: tenants maintain permanent housing (see examples in cell comments to the right)"]
["Increased Skills and/or Income: tenants gain job-related skills, participate in job-related training and/or education, gain stipend part-time or full-time supported employment, gain access to mainstream service/income support programs for which they are eligible (see examples in cell comments to the right)"]
["Greater Self- Determination: tenants gain daily living skills and ability to plan and advocate for themselves to maximize independence and self-sufficiency (see examples in cell comments to the right)"]
["Section 3: Plan for Evaluation"]
["(a) Describe your evaluation plan, including how you intend to collect, track and analyze data on the effectiveness of your project, including the outcomes projected above. Indicate who will analyze the data and perform your program evaluation. (e.g., staff, consultant, etc.)."]
[]
["(b) If you intend to collect and evaluate service utilization data from public systems (e.g., hospitals, jails, mental health and substance use treatment, emergency housing, etc.), indicate how the data will be tracked prior to and during occupancy to show measurable change over time. Also, identify who will be gathering the information, where the data comes from, the system for gathering the data and how often the data will be gathered."]

{"sheet":"B4 - SS Verification","index":7,"n_rows":22,"n_cols":36,"rows_kept":22,"cut":false,"hidden":true,"merged":[[19,0,19,9],[17,0,17,9],[16,10,16,37],[16,0,16,9],[13,36,13,37],[14,36,14,37],[15,0,15,3],[15,4,15,9],[15,10,15,37],[19,10,19,37],[17,10,17,37],[18,0,18,9],[0,0,0,34],[0,35,0,37],[5,0,5,9],[6,0,6,9],[7,0,7,9],[5,10,5,37],[6,10,6,37],[7,10,7,37],[1,0,1,37],[2,0,2,37],[3,0,3,9],[3,10,3,37],[4,10,4,37],[4,0,4,9],[21,0,21,9],[8,0,8,9],[9,0,9,9],[10,0,10,9],[11,0,11,37],[12,36,12,37],[12,0,12,35],[9,10,9,37],[10,10,10,37],[13,0,13,35],[14,0,14,35],[21,10,21,37],[8,10,8,37],[18,10,18,37],[20,0,20,9],[20,10,20,37]]}
["Supportive Services Verification\nThis worksheet must be completed if Project has one or more Supportive Housing or Special Needs units",null,null,null,null,null,null,null,null,null,null,null,null,null,null,null,null,null,null,null,null,null,null,null,null,null,null,null,null,null,null,null,null,null,null,{"$f":"'B - Project Requirements'!AJ1:AL1","v":"2020-01-07"}]
["To the Sponsor: Complete the project sponsor, service provider, project name and contact information, target population, and name of Verifying Funding Agency information sections below.  Then submit this form along with a copy of the Supportive Housing Project Plan contained in the application to the appropriate funding agency (public or nonprofit) knowledgeable about the supportive services needs of the targeted population(s).   For example, for a project serving chronically mentally ill people, the funding entity could be the County Department of Mental Health."]
["Submission of this form shall constitute certification by the sponsor that a true copy of the Supportive Housing Project Plan submitted in the application has been submitted to the funding agency named below.  The form may be submitted to more than one agency or department if necessary."]
["Project Sponsor:"]
["Primary Service Provider:"]
["Project Name:"]
["Project Address/Site:"]
["Project City:"]
["Project County:"]
["Name of Verifying Funding Agency:"]
["Target Population(s):"]
["To the public or non-profit funding agency:  The project sponsor named above is submitting an application to the State Department of Housing and Community Development (HCD) requesting funding for the project named above under the Multifamily Housing Program (MHP).  The application for MHP funding is subject to HCD’s determination that the project qualifies as a Supportive Housing Project. The findings of your agency will be considered in arriving at this determination.  Review the attached copy of the Supportive Housing Project Plan, note your findings in the chart below, and complete the signature block below the chart.  Attach comments for any “No” and as otherwise necessary.  Your cooperation is appreciated. "]
["We, as signed below, have reviewed the Supportive Housing Project Plan submitted for the project named above."]
["The services proposed in the Supportive Housing Project Plan are appropriate to meet the needs of the target population(s) named above."]
["The project primary service provider is a known provider of support services to the target population(s) listed above."]
["Dated:"]
["Statement Completed by (please print):"]
["Signature:\n(wet signature is required)"]
["Title:"]
["Agency or Department:"]
["Agency or Department Address:"]
["Agency or Department Phone:"]

{"sheet":"B5 -  At High Risk","index":8,"n_rows":21,"n_cols":40,"rows_kept":21,"cut":false,"hidden":true,"merged":[[18,0,18,33],[18,34,18,37],[19,0,19,33],[19,34,19,37],[0,0,0,34],[0,35,0,37],[15,0,15,33],[15,34,15,37],[16,0,16,33],[16,34,16,37],[17,0,17,33],[17,34,17,37],[11,0,11,33],[11,34,11,37],[12,0,12,33],[12,34,12,37],[13,0,13,37],[14,0,14,33],[14,34,14,37],[8,0,8,33],[8,34,8,37],[9,0,9,33],[9,34,9,37],[10,0,10,33],[10,34,10,37],[7,0,7,33],[7,34,7,37],[1,0,1,37],[2,0,2,33],[2,34,2,37],[3,0,3,33],[3,34,3,37],[4,0,4,37],[5,0,5,33],[5,34,5,37],[6,0,6,33],[6,34,6,37]]}
["At High Risk Project Requirments",null,null,null,null,null,null,null,null,null,null,null,null,null,null,null,null,null,null,null,null,null,null,null,null,null,null,null,null,null,null,null,null,null,null,{"$f":"'B - Project Requirements'!AJ1:AL1","v":"2020-01-07"}]
["At High Risk, meaning Projects that meet the requirements for at-risk projects set for in TCAC Regulation §10325(g)(4) and the conditions in §7302(e)(5)"]
["§10325(g)(4) At-risk projects. To be considered At-risk housing, the application shall meet the requirements of Revenue & Taxation (R & T) Code subsection 17058(c)(4), except as further defined in TCAC §10325(g)(4)(B)(i) below, as well as the following additional threshold requirements, and other requirements as outlined in this subsection:",null,null,null,null,null,null,null,null,null,null,null,null,null,null,null,null,null,null,null,null,null,null,null,null,null,null,null,null,null,null,null,null,null,"Project Meets/ Does Not Meet"]
["(A) Projects are subject to a minimum low-income use period of 55 years (50 years for projects located on tribal trust land);",null,null,null,null,null,null,null,null,null,null,null,null,null,null,null,null,null,null,null,null,null,null,null,null,null,null,null,null,null,null,null,null,null,null,null,null,null,{"$f":"IF(AI4=\"Meets\",1,0)","v":0},1]
["(B) Project application eligibility criteria include:"]
["   (i) before applying for Tax Credits, the project must meet the At-risk eligibility requirements under the terms of applicable federal and state law as verified by a third party legal opinion, except that a project that has been acquired by a qualified nonprofit organization within the past five years of the date of application with interim financing in order to preserve its affordability and that meets all other requirements of this section, shall be eligible to be considered an “at-risk” project under these regulations. A project application will not qualify in this category unless it is determined by the Committee that the project is at-risk of losing affordability on at least 50% of the restricted units due to market or other conditions;",null,null,null,null,null,null,null,null,null,null,null,null,null,null,null,null,null,null,null,null,null,null,null,null,null,null,null,null,null,null,null,null,null,null,null,null,null,{"$f":"IF(AI6=\"Meets\",1,0)","v":0},2]
["   (ii) the project, as verified by a third party legal opinion, must currently possess or have had within the past five years from the date of application, either federal mortgage insurance, a federal loan guarantee, federal project-based rental assistance, or, have its mortgage held by a federal agency, or be owned by a federal agency or be currently subject to, or have been subject to, within five years preceding the application deadline, the later of Federal or State Housing Tax Credit restrictions whose compliance period is expiring or has expired within the last five years and at least 50% of whose units are not subject to any other rental restrictions beyond the term of the Tax Credit restrictions;",null,null,null,null,null,null,null,null,null,null,null,null,null,null,null,null,null,null,null,null,null,null,null,null,null,null,null,null,null,null,null,null,null,null,null,null,null,0,3]
["   (iii) as of the date of application filing, the applicant shall have sought available federal incentives to continue the project as low-income housing, including, direct loans, loan forgiveness, grants, rental subsidies, renewal of existing rental subsidy contracts, etc.; ",null,null,null,null,null,null,null,null,null,null,null,null,null,null,null,null,null,null,null,null,null,null,null,null,null,null,null,null,null,null,null,null,null,null,null,null,null,0,4]
["   (iv) subsidy contract expiration, mortgage prepayment eligibility, or the expiration of Housing Tax Credit restrictions, as verified by a third party legal opinion, shall occur no later than five calendar years after the year in which the application is filed, except in cases where a qualified nonprofit organization acquired the property within the terms of (i) above and would otherwise meet this condition but for: 1) long-term use restrictions imposed by public agencies as a condition of their acquisition financing; or 2) HAP contract renewals secured by the qualified nonprofit organization for the maximum term available subsequent to acquisition;",null,null,null,null,null,null,null,null,null,null,null,null,null,null,null,null,null,null,null,null,null,null,null,null,null,null,null,null,null,null,null,null,null,null,null,null,null,0,5]
["   (v) the applicant agrees to renew all project based rental subsidies (such as Section 8 HAP or Section 521 rental assistance contracts) for the maximum term available and shall seek additional renewals throughout the project's useful life, if applicable;",null,null,null,null,null,null,null,null,null,null,null,null,null,null,null,null,null,null,null,null,null,null,null,null,null,null,null,null,null,null,null,null,null,null,null,null,null,0,6]
["   (vi) at least seventy percent (70%) of project tenants shall, at the time of application, have incomes at or below sixty percent (60%) of area median income;",null,null,null,null,null,null,null,null,null,null,null,null,null,null,null,null,null,null,null,null,null,null,null,null,null,null,null,null,null,null,null,null,null,null,null,null,null,0,7]
["   (vii) the gap between total development costs (excluding developer fee), and all loans and grants to the project (excluding Tax Credit proceeds) must be greater than fifteen percent (15%) of total development costs; and,",null,null,null,null,null,null,null,null,null,null,null,null,null,null,null,null,null,null,null,null,null,null,null,null,null,null,null,null,null,null,null,null,null,null,null,null,null,0,8]
["   (viii) a public agency shall provide direct or indirect long-term financial support of at least fifteen percent (15%) of the total project development costs, or the owner’s equity (includes syndication proceeds) shall constitute at least thirty percent (30%) of the total project development cost.",null,null,null,null,null,null,null,null,null,null,null,null,null,null,null,null,null,null,null,null,null,null,null,null,null,null,null,null,null,null,null,null,null,null,null,null,null,0,9]
["At High Risk Projects must also meet all of the following additional characteristics: §7302(e)(5) "]
["(A) They are currently owned by for-profit entities, or nonprofits that own no more than three publicaly-assisted rental housing developments, or were owned by one of these entities prior to purchase with interim financing no more than five years before the application date by an entity described in the following subsection (B); ",null,null,null,null,null,null,null,null,null,null,null,null,null,null,null,null,null,null,null,null,null,null,null,null,null,null,null,null,null,null,null,null,null,null,null,null,null,0,10]
["(B) They are under contract to be purchased by a nonprofit meeting the requirements of GC Section 65863.11(e), or a limited partnership where the sole general partner is a nonprofit that meets these requirements, or are owned by one of these entities; and ",null,null,null,null,null,null,null,null,null,null,null,null,null,null,null,null,null,null,null,null,null,null,null,null,null,null,null,null,null,null,null,null,null,null,null,null,null,0,11]
["(C) They are not subject to rent restrictions associated with financial assistance that will survive the event that qualifies them for at-risk status under TCAC Regulation, Section 10325.",null,null,null,null,null,null,null,null,null,null,null,null,null,null,null,null,null,null,null,null,null,null,null,null,null,null,null,null,null,null,null,null,null,null,null,null,null,0,12]
["(D) For Projects receiving financial assistance from HUD or Department of Agriculture, the Project is not assisted under either the HUD 811 or HUD 202 program or subject to the Low-Income Housing Preservation and Resident Homeownership Act of 1990 (LIHPRHA); and either: \n   a. The weighted average contract rent for units in the Project is less than or equal to 0.90 times the weighted average Small Area Fair Market Rent published by HUD for these units; or\n   b. The Project owner previously opted out of an agreement with a public agency that restricted tenant incomes and tenant-paid rents.",null,null,null,null,null,null,null,null,null,null,null,null,null,null,null,null,null,null,null,null,null,null,null,null,null,null,null,null,null,null,null,null,null,null,null,null,null,0,13]
["(E) For Projects not receiving federal assistance, the Department projects the owner could pay off all current secured debt with the proceeds of a new commercial mortgage, assuming that rents were set at Small Area Fair Market Rent levels.",null,null,null,null,null,null,null,null,null,null,null,null,null,null,null,null,null,null,null,null,null,null,null,null,null,null,null,null,null,null,null,null,null,null,null,null,null,0,14]
["(F) For Projects receiving financial assistance from HUD or Department of Agriculture, and subject to restrictions associated with financial assistance from other sources, the Project must meet the requirements of both subdivision (D) and (E).",null,null,null,null,null,null,null,null,null,null,null,null,null,null,null,null,null,null,null,null,null,null,null,null,null,null,null,null,null,null,null,null,null,null,null,null,null,0,15]
[null,null,null,null,null,null,null,null,null,null,null,null,null,null,null,null,null,null,null,null,null,null,null,null,null,null,null,null,null,null,null,null,null,null,null,null,null,null,{"$f":"SUM(AM15:AM20,AM6:AM13,AM4)","v":0}]

{"sheet":"C - Local & Env Verification","index":9,"n_rows":33,"n_cols":36,"rows_kept":33,"cut":false,"hidden":false,"merged":[[23,0,23,37],[24,0,24,37],[26,3,26,5],[27,12,27,37],[28,12,28,37],[27,0,27,11],[28,0,28,11],[26,0,26,2],[16,23,16,27],[18,0,18,37],[20,27,20,31],[21,27,21,31],[22,27,22,31],[20,22,20,26],[21,22,21,26],[22,22,22,26],[21,0,21,21],[22,0,22,21],[20,0,20,21],[0,0,0,34],[0,35,0,37],[6,0,6,11],[7,0,7,11],[8,0,8,11],[6,12,6,36],[7,12,7,36],[8,12,8,36],[2,0,2,37],[4,0,4,11],[5,0,5,11],[4,12,4,36],[5,12,5,36],[9,0,9,11],[10,0,10,11],[11,0,11,11],[9,12,9,36],[10,12,10,36],[11,12,11,36],[13,0,13,37],[14,33,14,37],[15,33,15,37],[29,12,29,37],[29,0,29,11],[15,20,15,22],[16,20,16,22],[15,0,16,19],[14,0,14,22],[17,0,17,37],[16,33,16,37],[14,28,14,32],[15,28,15,32],[16,28,16,32],[14,23,14,27],[15,23,15,27],[30,0,30,11],[31,0,31,11],[32,0,32,11],[30,12,30,37],[31,12,31,37],[32,12,32,37]]}
["Local Jurisdiction and NEPA Responsible Entity Verification",null,null,null,null,null,null,null,null,null,null,null,null,null,null,null,null,null,null,null,null,null,null,null,null,null,null,null,null,null,null,null,null,null,null,{"$f":"'B - Project Requirements'!AJ1","v":"2020-01-07"}]
[]
["To the Sponsor:  Submit this form to the agency or department of local government responsible for administration of the items listed.  This form may be submitted to more than one agency or department if necessary.  If the NEPA Responsible Entity is not a local government (e.g. State of Calif. HOME Program, USDA RD), also submit a copy of this form to the appropriate NEPA Responsible Entity.  If an item is not required, include the reason why in box provided."]
[]
["Project Sponsor: ",null,null,null,null,null,null,null,null,null,null,null,{"$f":"IF('B - Project Requirements'!O34=\"\",\"\",'B - Project Requirements'!O34)","v":""}]
["Sponsor Address:",null,null,null,null,null,null,null,null,null,null,null,{"$f":"IF('B - Project Requirements'!C36=\"\",\"\",'B - Project Requirements'!C36)","v":""}]
["Sponsor City:",null,null,null,null,null,null,null,null,null,null,null,{"$f":"IF('B - Project Requirements'!W36=\"\",\"\",'B - Project Requirements'!W36)","v":""}]
["Project Name: ",null,null,null,null,null,null,null,null,null,null,null,{"$f":"IF('B - Project Requirements'!E4=\"\",\"\",'B - Project Requirements'!E4)","v":""}]
["Project Address/site: ",null,null,null,null,null,null,null,null,null,null,null,{"$f":"IF('B - Project Requirements'!F5=\"\",\"\",'B - Project Requirements'!F5)","v":""}]
["Project City: ",null,null,null,null,null,null,null,null,null,null,null,{"$f":"IF('B - Project Requirements'!W5=\"\",\"\",'B - Project Requirements'!W5)","v":""}]
["Project County: ",null,null,null,null,null,null,null,null,null,null,null,{"$f":"IF('B - Project Requirements'!AI4=\"\",\"\",'B - Project Requirements'!AI4)","v":""}]
["Assessor Parcel Numbers (APNs):",null,null,null,null,null,null,null,null,null,null,null,{"$f":"IF('B - Project Requirements'!J6=\"\",\"\",'B - Project Requirements'!J6)","v":""}]
[]
["To the local jurisdiction or NEPA Responsible Entity:  The Sponsor named above has submitted an application to the State Dept. of Housing and Community Development (HCD) requesting funding for the project named above, under the Multifamily Housing Program (MHP).  Projects submitted for program funding are subject to a competitive rating process.  Project readiness is a component of that process.  Verification of items listed below will be used in evaluating MHP applications."]
[null,null,null,null,null,null,null,null,null,null,null,null,null,null,null,null,null,null,null,null,null,null,null,"Not Required for this Project",null,null,null,null,"Final date of Public Comment Period",null,null,null,null,"Approved  Date"]
["All Environmental Clearances (CEQA and NEPA) necessary to begin construction are either finally approved or unnecessary:",null,null,null,null,null,null,null,null,null,null,null,null,null,null,null,null,null,null,null,"CEQA"]
[null,null,null,null,null,null,null,null,null,null,null,null,null,null,null,null,null,null,null,null,"NEPA"]
["Specify in the box below, items not required and explain why (include documentation, if applicable):"]
[]
[]
[null,null,null,null,null,null,null,null,null,null,null,null,null,null,null,null,null,null,null,null,null,null,"Not Required for this Project",null,null,null,null,"Verified as Complete and date completed"]
["All necessary, discretionary, and nondiscressionary  public land use approvals except building permits and other ministerial approvals are:"]
["Design review approval is:"]
["Specify in the box below, items not required and explain why (include documentation, if applicable):"]
[]
[]
["Dated:"]
["Statement Completed by (please print):"]
["Signature:\n(wet signature is required)"]
["Title:"]
["Agency or Department:"]
["Agency or Department Address:"]
["Agency or Department Phone:"]

{"sheet":"D - Max Loan & Unit Mix","index":10,"n_rows":67,"n_cols":59,"rows_kept":67,"cut":false,"hidden":false,"merged":[[62,0,62,34],[56,0,56,34],[56,35,56,37],[63,30,63,35],[64,30,64,35],[65,30,65,35],[66,30,66,35],[6,18,6,19],[6,24,6,25],[6,22,6,23],[33,35,33,37],[34,35,34,37],[35,35,36,37],[41,0,41,37],[8,10,12,11],[8,8,12,9],[8,6,12,7],[35,29,36,31],[20,35,20,37],[21,35,21,37],[22,35,22,37],[23,35,23,37],[24,35,24,37],[26,35,26,37],[19,26,19,28],[27,29,27,31],[28,29,28,31],[29,29,29,31],[30,29,30,31],[31,29,31,31],[19,16,19,17],[20,24,20,25],[21,24,21,25],[19,29,19,31],[30,22,30,23],[25,24,25,25],[20,26,20,28],[21,26,21,28],[22,26,22,28],[23,26,23,28],[24,26,24,28],[25,26,25,28],[7,0,12,1],[7,2,12,3],[7,4,12,5],[8,22,12,23],[7,10,7,11],[6,20,6,21],[6,14,6,15],[6,16,6,17],[6,12,6,13],[6,6,6,7],[6,10,6,11],[6,8,6,9],[7,16,7,17],[7,6,7,7],[6,0,6,1],[6,4,6,5],[7,8,7,9],[30,35,30,37],[31,35,31,37],[32,35,32,37],[34,2,34,3],[33,2,33,3],[32,2,32,3],[30,2,30,3],[31,2,31,3],[20,2,20,3],[21,2,21,3],[25,35,25,37],[27,35,27,37],[28,35,28,37],[21,20,21,21],[31,10,31,11],[31,14,31,15],[21,10,21,11],[20,29,20,31],[21,29,21,31],[22,29,22,31],[23,29,23,31],[24,29,24,31],[25,29,25,31],[26,29,26,31],[29,35,29,37],[19,35,19,37],[13,16,13,17],[17,24,17,25],[14,6,14,7],[14,20,14,21],[13,8,13,9],[14,24,14,25],[13,24,13,25],[13,18,13,19],[16,18,16,19],[15,20,15,21],[17,18,17,19],[24,6,24,7],[23,10,23,11],[24,14,24,15],[23,16,23,17],[25,18,25,19],[23,14,23,15],[28,22,28,23],[29,22,29,23],[19,12,19,13],[16,14,16,15],[16,16,16,17],[0,35,0,37],[7,35,12,37],[13,35,13,37],[14,35,14,37],[15,35,15,37],[16,35,16,37],[17,35,17,37],[18,35,18,37],[5,26,5,37],[18,26,18,28],[18,29,18,31],[6,29,6,31],[6,35,6,37],[17,29,17,31],[0,0,0,34],[3,0,3,37],[17,20,17,21],[16,20,16,21],[14,16,14,17],[13,14,13,15],[18,18,18,19],[15,16,15,17],[18,12,18,13],[14,14,14,15],[7,24,12,25],[7,18,12,19],[7,20,12,21],[8,16,12,17],[8,14,12,15],[7,22,7,23],[34,20,34,21],[33,20,33,21],[32,20,32,21],[31,20,31,21],[25,20,25,21],[24,20,24,21],[23,20,23,21],[22,20,22,21],[26,18,26,19],[27,18,27,19],[28,18,28,19],[29,18,29,19],[30,18,30,19],[22,16,22,17],[22,14,22,15],[20,22,20,23],[22,24,22,25],[16,22,16,23],[35,32,36,34],[35,18,36,19],[35,12,36,13],[6,32,6,34],[35,24,36,25],[26,8,26,9],[27,8,27,9],[28,8,28,9],[29,8,29,9],[30,8,30,9],[13,12,13,13],[14,12,14,13],[7,14,7,15],[28,32,28,34],[29,32,29,34],[30,32,30,34],[7,26,12,28],[7,29,12,31],[7,32,12,34],[13,29,13,31],[14,29,14,31],[15,29,15,31],[34,10,34,11],[33,8,33,9],[49,0,49,34],[48,0,48,34],[47,0,47,34],[50,0,50,37],[45,0,45,34],[44,0,44,34],[43,0,43,34],[43,35,43,37],[1,32,1,37],[2,32,2,37],[5,18,5,21],[17,32,17,34],[18,32,18,34],[19,32,19,34],[20,32,20,34],[21,32,21,34],[13,26,13,28],[6,26,6,28],[14,26,14,28],[15,26,15,28],[24,32,24,34],[25,32,25,34],[26,32,26,34],[27,32,27,34],[49,35,49,37],[48,35,48,37],[47,35,47,37],[54,0,54,34],[53,0,53,34],[52,0,52,34],[51,0,51,34],[61,35,61,37],[32,29,32,31],[33,29,33,31],[34,29,34,31],[32,32,32,34],[34,26,34,28],[35,26,36,28],[34,18,34,19],[35,16,36,17],[34,16,34,17],[34,22,34,23],[35,22,36,23],[32,22,32,23],[33,32,33,34],[34,32,34,34],[34,24,34,25],[33,24,33,25],[66,36,66,37],[65,36,65,37],[64,36,64,37],[63,36,63,37],[66,5,66,12],[65,5,65,12],[63,5,63,12],[64,5,64,12],[51,35,51,37],[53,35,53,37],[52,35,52,37],[61,0,61,34],[60,0,60,34],[59,0,59,34],[58,0,58,34],[57,0,57,34],[55,0,55,34],[60,35,60,37],[59,35,59,37],[58,35,58,37],[57,35,57,37],[55,35,55,37],[54,35,54,37],[62,35,62,37],[37,34,37,35],[37,36,37,37],[38,34,38,35],[38,36,38,37],[35,4,36,5],[31,18,31,19],[46,35,46,37],[31,32,31,34],[45,35,45,37],[44,35,44,37],[33,12,33,13],[34,12,34,13],[37,0,38,33],[40,0,40,37],[42,0,42,37],[46,0,46,34],[32,10,32,11],[33,18,33,19],[35,6,36,7],[33,22,33,23],[32,24,32,25],[35,0,36,1],[39,0,39,34],[39,35,39,37],[65,0,65,4],[64,0,64,4],[63,0,63,4],[66,13,66,29],[65,13,65,29],[64,13,64,29],[63,13,63,29],[66,0,66,4],[28,20,28,21],[29,20,29,21],[30,20,30,21],[34,4,34,5],[35,8,36,9],[35,10,36,11],[29,6,29,7],[31,24,31,25],[32,16,32,17],[33,6,33,7],[33,10,33,11],[32,6,32,7],[33,14,33,15],[35,14,36,15],[35,20,36,21],[32,18,32,19],[28,12,28,13],[25,14,25,15],[25,16,25,17],[30,16,30,17],[32,8,32,9],[25,8,25,9],[24,8,24,9],[24,16,24,17],[31,8,31,9],[28,14,28,15],[30,12,30,13],[31,12,31,13],[32,12,32,13],[29,10,29,11],[30,10,30,11],[26,12,26,13],[27,12,27,13],[29,12,29,13],[27,10,27,11],[26,10,26,11],[34,6,34,7],[34,8,34,9],[28,10,28,11],[26,14,26,15],[27,14,27,15],[16,29,16,31],[22,12,22,13],[23,12,23,13],[24,12,24,13],[25,12,25,13],[31,22,31,23],[17,22,17,23],[23,22,23,23],[26,22,26,23],[21,22,21,23],[22,22,22,23],[24,18,24,19],[23,18,23,19],[24,22,24,23],[19,18,19,19],[27,22,27,23],[20,18,20,19],[21,18,21,19],[19,20,19,21],[15,12,15,13],[16,12,16,13],[17,12,17,13],[15,14,15,15],[18,16,18,17],[13,22,13,23],[14,22,14,23],[15,22,15,23],[15,18,15,19],[17,14,17,15],[17,16,17,17],[9,53,9,54],[9,51,9,52],[9,49,9,50],[9,47,9,48],[9,45,9,46],[9,43,9,44],[22,32,22,34],[23,32,23,34],[20,12,20,13],[21,12,21,13],[16,26,16,28],[13,32,13,34],[14,32,14,34],[15,32,15,34],[16,32,16,34],[14,18,14,19],[13,20,13,21],[23,24,23,25],[16,24,16,25],[21,14,21,15],[17,26,17,28],[8,12,12,13],[11,42,11,47],[11,48,11,52],[21,6,21,7],[17,6,17,7],[17,8,17,9],[25,22,25,23],[20,10,20,11],[18,24,18,25],[18,22,18,23],[19,8,19,9],[21,8,21,9],[22,6,22,7],[20,20,20,21],[19,10,19,11],[19,14,19,15],[22,18,22,19],[25,10,25,11],[25,6,25,7],[24,24,24,25],[22,10,22,11],[24,10,24,11],[18,14,18,15],[21,16,21,17],[20,14,20,15],[20,16,20,17],[13,6,13,7],[14,10,14,11],[15,8,15,9],[14,8,14,9],[15,10,15,11],[13,10,13,11],[15,6,15,7],[18,10,18,11],[20,6,20,7],[20,8,20,9],[16,6,16,7],[17,10,17,11],[16,8,16,9],[16,10,16,11],[18,6,18,7],[18,8,18,9],[33,4,33,5],[32,4,32,5],[31,4,31,5],[21,0,21,1],[20,0,20,1],[19,0,19,1],[18,0,18,1],[29,24,29,25],[30,14,30,15],[29,16,29,17],[30,6,30,7],[19,2,19,3],[19,24,19,25],[19,6,19,7],[19,22,19,23],[26,2,26,3],[27,2,27,3],[28,2,28,3],[18,20,18,21],[22,4,22,5],[21,4,21,5],[20,4,20,5],[19,4,19,5],[18,4,18,5],[26,0,26,1],[17,0,17,1],[16,0,16,1],[15,0,15,1],[14,0,14,1],[13,0,13,1],[29,2,29,3],[25,4,25,5],[16,4,16,5],[24,4,24,5],[23,4,23,5],[13,2,13,3],[14,2,14,3],[17,4,17,5],[23,2,23,3],[16,2,16,3],[25,2,25,3],[22,2,22,3],[24,2,24,3],[15,4,15,5],[14,4,14,5],[18,2,18,3],[15,2,15,3],[17,2,17,3],[35,2,36,3],[34,0,34,1],[33,0,33,1],[32,0,32,1],[31,0,31,1],[30,0,30,1],[29,0,29,1],[28,0,28,1],[27,0,27,1],[30,4,30,5],[29,4,29,5],[28,4,28,5],[27,4,27,5],[26,4,26,5],[26,6,26,7],[31,6,31,7],[27,6,27,7],[28,6,28,7],[34,14,34,15],[32,14,32,15],[26,26,26,28],[27,26,27,28],[28,26,28,28],[29,26,29,28],[30,26,30,28],[31,26,31,28],[32,26,32,28],[33,26,33,28],[26,20,26,21],[27,20,27,21],[26,16,26,17],[29,14,29,15],[28,16,28,17],[26,24,26,25],[27,24,27,25],[28,24,28,25],[27,16,27,17],[30,24,30,25],[33,16,33,17],[31,16,31,17],[25,0,25,1],[24,0,24,1],[23,0,23,1],[4,0,4,37],[22,0,22,1],[1,0,1,7],[1,8,1,15],[1,16,1,22],[1,23,1,31],[2,0,2,7],[2,8,2,15],[2,16,2,22],[2,23,2,31],[5,0,5,5],[5,6,5,11],[5,12,5,17],[5,22,5,25],[13,4,13,5],[6,2,6,3],[15,24,15,25],[7,12,7,13],[23,6,23,7],[23,8,23,9],[22,8,22,9]]}
["Maximum Loan Amount and Unit Mix",null,null,null,null,null,null,null,null,null,null,null,null,null,null,null,null,null,null,null,null,null,null,null,null,null,null,null,null,null,null,null,null,null,null,{"$f":"'B - Project Requirements'!AJ1","v":"2020-01-07"}]
["Development Type ",null,null,null,null,null,null,null,"Project Type ",null,null,null,null,null,null,null,"High or Highest Resource Area",null,null,null,null,null,null,"Rural Status",null,null,null,null,null,null,null,null,"County "]
[{"$f":"'B - Project Requirements'!W4","v":0},null,null,null,null,null,null,null,{"$f":"CONCATENATE('B - Project Requirements'!AP10,'B - Project Requirements'!AP11,'B - Project Requirements'!AP12,'B - Project Requirements'!AP13,'B - Project Requirements'!AP14)","v":""},null,null,null,null,null,null,null,{"$f":"'B - Project Requirements'!AK14","v":0},null,null,null,null,null,null,{"$f":"IF('B - Project Requirements'!AK11=\"Yes\",\"Rural\", \"Not Rural\")","v":"Not Rural"},null,null,null,null,null,null,null,null,{"$f":"IF('B - Project Requirements'!AI4=\"\",\"\",'B - Project Requirements'!AI4)","v":""}]
["Enter all units with unique characteristics separately. For example, do not enter special needs and supportive housing units on the same line.  "]
["A Manager's Unit will be considered to be a Restricted Unit for allocating development costs and may qualify for a loan amount up to the 60% AMI level. If requesting a loan amount for Manager's Units, select Mangager in table section B below and enter units in table section G "]
["Units\n(Enter all units with unique characteristics separately. Do not enter special needs and supportive housing units on the same line)",null,null,null,null,null,"MHP Assisted Units\n(Select Project type(s) on row 10 of \"B - Project Requirements\" worksheet)",null,null,null,null,null,"Other Restricted",null,null,null,null,null,"Other HCD Funded Units\n§7302(h) - subsidy stacking",null,null,null,"Total Restricted Units",null,null,null,"MHP Loan Amounts\nClick here to view Loan Limits"]
["A",null,"B",null,"C",null,"D",null,"E",null,"F",null,"G",null,"H",null,"I",null,"J",null,"K",null,"L",null,"M",null,"N",null,null,"O",null,null,"P",null,null,"Q"]
["Number of Bedrooms",null,"Restrict. % of AMI",null,"Total Units",null,{"$f":"IF(OR($E$36=0,G36=0),0,G36/$E$36)","v":0},null,{"$f":"IF(OR($E$36=0,I36=0),0,I36/$E$36)","v":0},null,{"$f":"IF(OR($E$36=0,K36=0),0,K36/$E$36)","v":0},null,{"$f":"IF(OR($E$36=0,M36=0),0,M36/$E$36)","v":0},null,{"$f":"IF(OR($E$36=0,O36=0),0,O36/$E$36)","v":0},null,{"$f":"IF(OR($E$36=0,Q36=0),0,Q36/$E$36)","v":0},null,"Other HCD Source §7302(h)",null,"# of Other HCD Assisted Units",null,{"$f":"IF(OR($E$36=0,W36=0),0,W36/$E$36)","v":0},null,"% Total of Units ",null,"Regular Restricted Loan Amount (Unit)",null,null,"SH or Large Family New Constr. In Resource Area Loan Amount (Unit)",null,null,"Total Regular Loan Amount",null,null,"Total SH or Large Family New Constr. In Resource Area Loan Amount"]
[null,null,null,null,null,null,"Total MHP Assisted Units ",null,"Special Needs",null,"Supp. Housing ",null,"Total Other Restricted",null,"Special Needs",null,"Supp. Housing ",null,null,null,null,null,"Total Restricted Units"]
[]
[]
[null,null,null,null,null,null,null,null,null,null,null,null,null,null,null,null,null,null,null,null,null,null,null,null,null,null,null,null,null,null,null,null,null,null,null,null,null,null,null,null,null,null,"Regular ",null,null,null,null,null,"Supportive/ Large Family New Construction "]
[null,null,null,null,null,null,null,null,null,null,null,null,null,null,null,null,null,null,null,null,null,null,null,null,null,null,null,null,null,null,null,null,null,null,null,null,null,null,"Row","Bedrooms","Restricted Bedrooms",null,null,0,1,2,3,"4+",0,1,2,3,"4+",1,"AMI","Restricted Units ","%","Large Family ","Tie Breaker"]
[null,null,null,null,null,null,null,null,null,null,null,null,null,null,null,null,null,null,null,null,null,null,{"$f":"IF(OR(C14=\"80% AMI\",C14=\"70% AMI\"),0,IF(C14>\"\",E14,0))","v":0},null,{"$f":"IFERROR(E14/$E$36,\"\")","v":""},null,{"$f":"IFERROR(HLOOKUP(AN14,$AR$13:$AV$35,AM14,FALSE),0)","v":0},null,null,{"$f":"IFERROR(HLOOKUP(AN14,'D - Max Loan & Unit Mix'!$AW$13:$BA$35,AM14,FALSE),0)","v":0},null,null,{"$f":"IF(C14=\"Market\",0,IF(C14=\"Manager\",E14*AA14,IF(AND('B - Project Requirements'!$AO$10=TRUE,$A$3=\"New Construction\",$Q$3=\"Yes\",$AK$38>=0.25,$AK$39>=0.5),0,((((MAX(0,(E14-K14-Q14-(MAX(0,U14-K14-Q14)))*AA14))))))))","v":0},null,null,{"$f":"IF(OR(C14=\"Manager\",C14=\"Market\"),0,IF(AND('B - Project Requirements'!$AO$10=TRUE,$A$3=\"New Construction\",$Q$3=\"Yes\",$AK$38>=0.25,$AK$39>=0.5),MAX(0,E14-U14)*AD14,IF(OR(K14>=1,Q14>=1),MAX(0,(K14+Q14-U14)*AD14),0)))","v":0},null,null,2,{"$f":"IF(A14>=4,\"4+\",A14)","v":0},{"$f":"IF(OR(C14=\"80% AMI\",C14=\"70% AMI\",C14=\"Manager\",C14=\"Market\"),0,IF(C14>\"\",AN14,0))","v":0},{"$f":"IF(C14=\"Manager\",\"60%\",LEFT(C14,3))","v":""},{"$f":"CONCATENATE($AG$3,AP14)","v":""},{"$f":"VLOOKUP($AQ14,'Loan Limits'!$A$4:$K$583,2,FALSE)","v":{"$error":"#N/A"}},{"$f":"VLOOKUP($AQ14,'Loan Limits'!$A$4:$K$583,3,FALSE)","v":{"$error":"#N/A"}},{"$f":"VLOOKUP($AQ14,'Loan Limits'!$A$4:$K$583,4,FALSE)","v":{"$error":"#N/A"}},{"$f":"VLOOKUP($AQ14,'Loan Limits'!$A$4:$K$583,5,FALSE)","v":{"$error":"#N/A"}},{"$f":"VLOOKUP($AQ14,'Loan Limits'!$A$4:$K$583,6,FALSE)","v":{"$error":"#N/A"}},{"$f":"VLOOKUP($AQ14,'Loan Limits'!$A$4:$K$583,7,FALSE)","v":{"$error":"#N/A"}},{"$f":"VLOOKUP($AQ14,'Loan Limits'!$A$4:$K$583,8,FALSE)","v":{"$error":"#N/A"}},{"$f":"VLOOKUP($AQ14,'Loan Limits'!$A$4:$K$583,9,FALSE)","v":{"$error":"#N/A"}},{"$f":"VLOOKUP($AQ14,'Loan Limits'!$A$4:$K$583,10,FALSE)","v":{"$error":"#N/A"}},{"$f":"VLOOKUP($AQ14,'Loan Limits'!$A$4:$K$583,11,FALSE)","v":{"$error":"#N/A"}},2,0.6,{"$f":"SUMIF($C$14:$C$35,\"60% AMI\",$E$14:$E$35)","v":0},{"$f":"IFERROR((BD14/$BD$25),0)","v":0},{"$f":"G36","v":0},{"$f":"BD14*BC14","v":0}]
[null,null,null,null,null,null,null,null,null,null,null,null,null,null,null,null,null,null,null,null,null,null,0,null,"",null,{"$f":"IFERROR(HLOOKUP(AN15,$AR$13:$AV$35,AM15,FALSE),0)","v":0},null,null,{"$f":"IFERROR(HLOOKUP(AN15,'D - Max Loan & Unit Mix'!$AW$13:$BA$35,AM15,FALSE),0)","v":0},null,null,{"$f":"IF(C15=\"Market\",0,IF(C15=\"Manager\",E15*AA15,IF(AND('B - Project Requirements'!$AO$10=TRUE,$A$3=\"New Construction\",$Q$3=\"Yes\",$AK$38>=0.25,$AK$39>=0.5),0,((((MAX(0,(E15-K15-Q15-(MAX(0,U15-K15-Q15)))*AA15))))))))","v":0},null,null,{"$f":"IF(OR(C15=\"Manager\",C15=\"Market\"),0,IF(AND('B - Project Requirements'!$AO$10=TRUE,$A$3=\"New Construction\",$Q$3=\"Yes\",$AK$38>=0.25,$AK$39>=0.5),MAX(0,E15-U15)*AD15,IF(OR(K15>=1,Q15>=1),MAX(0,(K15+Q15-U15)*AD15),0)))","v":0},null,null,3,0,{"$f":"IF(OR(C15=\"80% AMI\",C15=\"70% AMI\",C15=\"Manager\",C15=\"Market\"),0,IF(C15>\"\",AN15,0))","v":0},"",{"$f":"CONCATENATE($AG$3,AP15)","v":""},{"$f":"VLOOKUP($AQ15,'Loan Limits'!$A$4:$K$583,2,FALSE)","v":{"$error":"#N/A"}},{"$f":"VLOOKUP($AQ15,'Loan Limits'!$A$4:$K$583,3,FALSE)","v":{"$error":"#N/A"}},{"$f":"VLOOKUP($AQ15,'Loan Limits'!$A$4:$K$583,4,FALSE)","v":{"$error":"#N/A"}},{"$f":"VLOOKUP($AQ15,'Loan Limits'!$A$4:$K$583,5,FALSE)","v":{"$error":"#N/A"}},{"$f":"VLOOKUP($AQ15,'Loan Limits'!$A$4:$K$583,6,FALSE)","v":{"$error":"#N/A"}},{"$f":"VLOOKUP($AQ15,'Loan Limits'!$A$4:$K$583,7,FALSE)","v":{"$error":"#N/A"}},{"$f":"VLOOKUP($AQ15,'Loan Limits'!$A$4:$K$583,8,FALSE)","v":{"$error":"#N/A"}},{"$f":"VLOOKUP($AQ15,'Loan Limits'!$A$4:$K$583,9,FALSE)","v":{"$error":"#N/A"}},{"$f":"VLOOKUP($AQ15,'Loan Limits'!$A$4:$K$583,10,FALSE)","v":{"$error":"#N/A"}},{"$f":"VLOOKUP($AQ15,'Loan Limits'!$A$4:$K$583,11,FALSE)","v":{"$error":"#N/A"}},3,0.55000000000000004,{"$f":"SUMIF($C$14:$C$35,\"55% AMI\",$E$14:$E$35)","v":0},0,{"$f":"G8","v":0},0]
[null,null,null,null,null,null,null,null,null,null,null,null,null,null,null,null,null,null,null,null,null,null,0,null,"",null,0,null,null,{"$f":"IFERROR(HLOOKUP(AN16,'D - Max Loan & Unit Mix'!$AW$13:$BA$35,AM16,FALSE),0)","v":0},null,null,{"$f":"IF(C16=\"Market\",0,IF(C16=\"Manager\",E16*AA16,IF(AND('B - Project Requirements'!$AO$10=TRUE,$A$3=\"New Construction\",$Q$3=\"Yes\",$AK$38>=0.25,$AK$39>=0.5),0,((((MAX(0,(E16-K16-Q16-(MAX(0,U16-K16-Q16)))*AA16))))))))","v":0},null,null,{"$f":"IF(OR(C16=\"Manager\",C16=\"Market\"),0,IF(AND('B - Project Requirements'!$AO$10=TRUE,$A$3=\"New Construction\",$Q$3=\"Yes\",$AK$38>=0.25,$AK$39>=0.5),MAX(0,E16-U16)*AD16,IF(OR(K16>=1,Q16>=1),MAX(0,(K16+Q16-U16)*AD16),0)))","v":0},null,null,4,0,0,"","",{"$f":"VLOOKUP($AQ16,'Loan Limits'!$A$4:$K$583,2,FALSE)","v":{"$error":"#N/A"}},{"$f":"VLOOKUP($AQ16,'Loan Limits'!$A$4:$K$583,3,FALSE)","v":{"$error":"#N/A"}},{"$f":"VLOOKUP($AQ16,'Loan Limits'!$A$4:$K$583,4,FALSE)","v":{"$error":"#N/A"}},{"$f":"VLOOKUP($AQ16,'Loan Limits'!$A$4:$K$583,5,FALSE)","v":{"$error":"#N/A"}},{"$f":"VLOOKUP($AQ16,'Loan Limits'!$A$4:$K$583,6,FALSE)","v":{"$error":"#N/A"}},{"$f":"VLOOKUP($AQ16,'Loan Limits'!$A$4:$K$583,7,FALSE)","v":{"$error":"#N/A"}},{"$f":"VLOOKUP($AQ16,'Loan Limits'!$A$4:$K$583,8,FALSE)","v":{"$error":"#N/A"}},{"$f":"VLOOKUP($AQ16,'Loan Limits'!$A$4:$K$583,9,FALSE)","v":{"$error":"#N/A"}},{"$f":"VLOOKUP($AQ16,'Loan Limits'!$A$4:$K$583,10,FALSE)","v":{"$error":"#N/A"}},{"$f":"VLOOKUP($AQ16,'Loan Limits'!$A$4:$K$583,11,FALSE)","v":{"$error":"#N/A"}},4,0.5,{"$f":"SUMIF($C$14:$C$35,\"50% AMI\",$E$14:$E$35)","v":0},0,null,0]
[null,null,null,null,null,null,null,null,null,null,null,null,null,null,null,null,null,null,null,null,null,null,0,null,"",null,0,null,null,{"$f":"IFERROR(HLOOKUP(AN17,'D - Max Loan & Unit Mix'!$AW$13:$BA$35,AM17,FALSE),0)","v":0},null,null,{"$f":"IF(C17=\"Market\",0,IF(C17=\"Manager\",E17*AA17,IF(AND('B - Project Requirements'!$AO$10=TRUE,$A$3=\"New Construction\",$Q$3=\"Yes\",$AK$38>=0.25,$AK$39>=0.5),0,((((MAX(0,(E17-K17-Q17-(MAX(0,U17-K17-Q17)))*AA17))))))))","v":0},null,null,{"$f":"IF(OR(C17=\"Manager\",C17=\"Market\"),0,IF(AND('B - Project Requirements'!$AO$10=TRUE,$A$3=\"New Construction\",$Q$3=\"Yes\",$AK$38>=0.25,$AK$39>=0.5),MAX(0,E17-U17)*AD17,IF(OR(K17>=1,Q17>=1),MAX(0,(K17+Q17-U17)*AD17),0)))","v":0},null,null,5,0,0,"","",{"$f":"VLOOKUP($AQ17,'Loan Limits'!$A$4:$K$583,2,FALSE)","v":{"$error":"#N/A"}},{"$f":"VLOOKUP($AQ17,'Loan Limits'!$A$4:$K$583,3,FALSE)","v":{"$error":"#N/A"}},{"$f":"VLOOKUP($AQ17,'Loan Limits'!$A$4:$K$583,4,FALSE)","v":{"$error":"#N/A"}},{"$f":"VLOOKUP($AQ17,'Loan Limits'!$A$4:$K$583,5,FALSE)","v":{"$error":"#N/A"}},{"$f":"VLOOKUP($AQ17,'Loan Limits'!$A$4:$K$583,6,FALSE)","v":{"$error":"#N/A"}},{"$f":"VLOOKUP($AQ17,'Loan Limits'!$A$4:$K$583,7,FALSE)","v":{"$error":"#N/A"}},{"$f":"VLOOKUP($AQ17,'Loan Limits'!$A$4:$K$583,8,FALSE)","v":{"$error":"#N/A"}},{"$f":"VLOOKUP($AQ17,'Loan Limits'!$A$4:$K$583,9,FALSE)","v":{"$error":"#N/A"}},{"$f":"VLOOKUP($AQ17,'Loan Limits'!$A$4:$K$583,10,FALSE)","v":{"$error":"#N/A"}},{"$f":"VLOOKUP($AQ17,'Loan Limits'!$A$4:$K$583,11,FALSE)","v":{"$error":"#N/A"}},5,0.45,{"$f":"SUMIF($C$14:$C$35,\"45% AMI\",$E$14:$E$35)","v":0},0,null,0]
[null,null,null,null,null,null,null,null,null,null,null,null,null,null,null,null,null,null,null,null,null,null,0,null,"",null,0,null,null,{"$f":"IFERROR(HLOOKUP(AN18,'D - Max Loan & Unit Mix'!$AW$13:$BA$35,AM18,FALSE),0)","v":0},null,null,{"$f":"IF(C18=\"Market\",0,IF(C18=\"Manager\",E18*AA18,IF(AND('B - Project Requirements'!$AO$10=TRUE,$A$3=\"New Construction\",$Q$3=\"Yes\",$AK$38>=0.25,$AK$39>=0.5),0,((((MAX(0,(E18-K18-Q18-(MAX(0,U18-K18-Q18)))*AA18))))))))","v":0},null,null,{"$f":"IF(OR(C18=\"Manager\",C18=\"Market\"),0,IF(AND('B - Project Requirements'!$AO$10=TRUE,$A$3=\"New Construction\",$Q$3=\"Yes\",$AK$38>=0.25,$AK$39>=0.5),MAX(0,E18-U18)*AD18,IF(OR(K18>=1,Q18>=1),MAX(0,(K18+Q18-U18)*AD18),0)))","v":0},null,null,6,0,0,"","",{"$f":"VLOOKUP($AQ18,'Loan Limits'!$A$4:$K$583,2,FALSE)","v":{"$error":"#N/A"}},{"$f":"VLOOKUP($AQ18,'Loan Limits'!$A$4:$K$583,3,FALSE)","v":{"$error":"#N/A"}},{"$f":"VLOOKUP($AQ18,'Loan Limits'!$A$4:$K$583,4,FALSE)","v":{"$error":"#N/A"}},{"$f":"VLOOKUP($AQ18,'Loan Limits'!$A$4:$K$583,5,FALSE)","v":{"$error":"#N/A"}},{"$f":"VLOOKUP($AQ18,'Loan Limits'!$A$4:$K$583,6,FALSE)","v":{"$error":"#N/A"}},{"$f":"VLOOKUP($AQ18,'Loan Limits'!$A$4:$K$583,7,FALSE)","v":{"$error":"#N/A"}},{"$f":"VLOOKUP($AQ18,'Loan Limits'!$A$4:$K$583,8,FALSE)","v":{"$error":"#N/A"}},{"$f":"VLOOKUP($AQ18,'Loan Limits'!$A$4:$K$583,9,FALSE)","v":{"$error":"#N/A"}},{"$f":"VLOOKUP($AQ18,'Loan Limits'!$A$4:$K$583,10,FALSE)","v":{"$error":"#N/A"}},{"$f":"VLOOKUP($AQ18,'Loan Limits'!$A$4:$K$583,11,FALSE)","v":{"$error":"#N/A"}},6,0.4,{"$f":"SUMIF($C$14:$C$35,\"40% AMI\",$E$14:$E$35)","v":0},0,null,0]
[null,null,null,null,null,null,null,null,null,null,null,null,null,null,null,null,null,null,null,null,null,null,0,null,"",null,0,null,null,{"$f":"IFERROR(HLOOKUP(AN19,'D - Max Loan & Unit Mix'!$AW$13:$BA$35,AM19,FALSE),0)","v":0},null,null,{"$f":"IF(C19=\"Market\",0,IF(C19=\"Manager\",E19*AA19,IF(AND('B - Project Requirements'!$AO$10=TRUE,$A$3=\"New Construction\",$Q$3=\"Yes\",$AK$38>=0.25,$AK$39>=0.5),0,((((MAX(0,(E19-K19-Q19-(MAX(0,U19-K19-Q19)))*AA19))))))))","v":0},null,null,{"$f":"IF(OR(C19=\"Manager\",C19=\"Market\"),0,IF(AND('B - Project Requirements'!$AO$10=TRUE,$A$3=\"New Construction\",$Q$3=\"Yes\",$AK$38>=0.25,$AK$39>=0.5),MAX(0,E19-U19)*AD19,IF(OR(K19>=1,Q19>=1),MAX(0,(K19+Q19-U19)*AD19),0)))","v":0},null,null,7,0,0,"","",{"$f":"VLOOKUP($AQ19,'Loan Limits'!$A$4:$K$583,2,FALSE)","v":{"$error":"#N/A"}},{"$f":"VLOOKUP($AQ19,'Loan Limits'!$A$4:$K$583,3,FALSE)","v":{"$error":"#N/A"}},{"$f":"VLOOKUP($AQ19,'Loan Limits'!$A$4:$K$583,4,FALSE)","v":{"$error":"#N/A"}},{"$f":"VLOOKUP($AQ19,'Loan Limits'!$A$4:$K$583,5,FALSE)","v":{"$error":"#N/A"}},{"$f":"VLOOKUP($AQ19,'Loan Limits'!$A$4:$K$583,6,FALSE)","v":{"$error":"#N/A"}},{"$f":"VLOOKUP($AQ19,'Loan Limits'!$A$4:$K$583,7,FALSE)","v":{"$error":"#N/A"}},{"$f":"VLOOKUP($AQ19,'Loan Limits'!$A$4:$K$583,8,FALSE)","v":{"$error":"#N/A"}},{"$f":"VLOOKUP($AQ19,'Loan Limits'!$A$4:$K$583,9,FALSE)","v":{"$error":"#N/A"}},{"$f":"VLOOKUP($AQ19,'Loan Limits'!$A$4:$K$583,10,FALSE)","v":{"$error":"#N/A"}},{"$f":"VLOOKUP($AQ19,'Loan Limits'!$A$4:$K$583,11,FALSE)","v":{"$error":"#N/A"}},7,0.35,{"$f":"SUMIF($C$14:$C$35,\"35% AMI\",$E$14:$E$35)","v":0},0,null,0]
[null,null,null,null,null,null,null,null,null,null,null,null,null,null,null,null,null,null,null,null,null,null,0,null,"",null,0,null,null,{"$f":"IFERROR(HLOOKUP(AN20,'D - Max Loan & Unit Mix'!$AW$13:$BA$35,AM20,FALSE),0)","v":0},null,null,{"$f":"IF(C20=\"Market\",0,IF(C20=\"Manager\",E20*AA20,IF(AND('B - Project Requirements'!$AO$10=TRUE,$A$3=\"New Construction\",$Q$3=\"Yes\",$AK$38>=0.25,$AK$39>=0.5),0,((((MAX(0,(E20-K20-Q20-(MAX(0,U20-K20-Q20)))*AA20))))))))","v":0},null,null,{"$f":"IF(OR(C20=\"Manager\",C20=\"Market\"),0,IF(AND('B - Project Requirements'!$AO$10=TRUE,$A$3=\"New Construction\",$Q$3=\"Yes\",$AK$38>=0.25,$AK$39>=0.5),MAX(0,E20-U20)*AD20,IF(OR(K20>=1,Q20>=1),MAX(0,(K20+Q20-U20)*AD20),0)))","v":0},null,null,8,0,0,"","",{"$f":"VLOOKUP($AQ20,'Loan Limits'!$A$4:$K$583,2,FALSE)","v":{"$error":"#N/A"}},{"$f":"VLOOKUP($AQ20,'Loan Limits'!$A$4:$K$583,3,FALSE)","v":{"$error":"#N/A"}},{"$f":"VLOOKUP($AQ20,'Loan Limits'!$A$4:$K$583,4,FALSE)","v":{"$error":"#N/A"}},{"$f":"VLOOKUP($AQ20,'Loan Limits'!$A$4:$K$583,5,FALSE)","v":{"$error":"#N/A"}},{"$f":"VLOOKUP($AQ20,'Loan Limits'!$A$4:$K$583,6,FALSE)","v":{"$error":"#N/A"}},{"$f":"VLOOKUP($AQ20,'Loan Limits'!$A$4:$K$583,7,FALSE)","v":{"$error":"#N/A"}},{"$f":"VLOOKUP($AQ20,'Loan Limits'!$A$4:$K$583,8,FALSE)","v":{"$error":"#N/A"}},{"$f":"VLOOKUP($AQ20,'Loan Limits'!$A$4:$K$583,9,FALSE)","v":{"$error":"#N/A"}},{"$f":"VLOOKUP($AQ20,'Loan Limits'!$A$4:$K$583,10,FALSE)","v":{"$error":"#N/A"}},{"$f":"VLOOKUP($AQ20,'Loan Limits'!$A$4:$K$583,11,FALSE)","v":{"$error":"#N/A"}},8,0.3,{"$f":"SUMIF($C$14:$C$35,\"30% AMI\",$E$14:$E$35)","v":0},0,null,0]
[null,null,null,null,null,null,null,null,null,null,null,null,null,null,null,null,null,null,null,null,null,null,0,null,"",null,0,null,null,{"$f":"IFERROR(HLOOKUP(AN21,'D - Max Loan & Unit Mix'!$AW$13:$BA$35,AM21,FALSE),0)","v":0},null,null,{"$f":"IF(C21=\"Market\",0,IF(C21=\"Manager\",E21*AA21,IF(AND('B - Project Requirements'!$AO$10=TRUE,$A$3=\"New Construction\",$Q$3=\"Yes\",$AK$38>=0.25,$AK$39>=0.5),0,((((MAX(0,(E21-K21-Q21-(MAX(0,U21-K21-Q21)))*AA21))))))))","v":0},null,null,{"$f":"IF(OR(C21=\"Manager\",C21=\"Market\"),0,IF(AND('B - Project Requirements'!$AO$10=TRUE,$A$3=\"New Construction\",$Q$3=\"Yes\",$AK$38>=0.25,$AK$39>=0.5),MAX(0,E21-U21)*AD21,IF(OR(K21>=1,Q21>=1),MAX(0,(K21+Q21-U21)*AD21),0)))","v":0},null,null,9,0,0,"","",{"$f":"VLOOKUP($AQ21,'Loan Limits'!$A$4:$K$583,2,FALSE)","v":{"$error":"#N/A"}},{"$f":"VLOOKUP($AQ21,'Loan Limits'!$A$4:$K$583,3,FALSE)","v":{"$error":"#N/A"}},{"$f":"VLOOKUP($AQ21,'Loan Limits'!$A$4:$K$583,4,FALSE)","v":{"$error":"#N/A"}},{"$f":"VLOOKUP($AQ21,'Loan Limits'!$A$4:$K$583,5,FALSE)","v":{"$error":"#N/A"}},{"$f":"VLOOKUP($AQ21,'Loan Limits'!$A$4:$K$583,6,FALSE)","v":{"$error":"#N/A"}},{"$f":"VLOOKUP($AQ21,'Loan Limits'!$A$4:$K$583,7,FALSE)","v":{"$error":"#N/A"}},{"$f":"VLOOKUP($AQ21,'Loan Limits'!$A$4:$K$583,8,FALSE)","v":{"$error":"#N/A"}},{"$f":"VLOOKUP($AQ21,'Loan Limits'!$A$4:$K$583,9,FALSE)","v":{"$error":"#N/A"}},{"$f":"VLOOKUP($AQ21,'Loan Limits'!$A$4:$K$583,10,FALSE)","v":{"$error":"#N/A"}},{"$f":"VLOOKUP($AQ21,'Loan Limits'!$A$4:$K$583,11,FALSE)","v":{"$error":"#N/A"}},9,0.25,{"$f":"SUMIF($C$14:$C$35,\"25% AMI\",$E$14:$E$35)","v":0},0,null,0]
[null,null,null,null,null,null,null,null,null,null,null,null,null,null,null,null,null,null,null,null,null,null,0,null,"",null,0,null,null,{"$f":"IFERROR(HLOOKUP(AN22,'D - Max Loan & Unit Mix'!$AW$13:$BA$35,AM22,FALSE),0)","v":0},null,null,{"$f":"IF(C22=\"Market\",0,IF(C22=\"Manager\",E22*AA22,IF(AND('B - Project Requirements'!$AO$10=TRUE,$A$3=\"New Construction\",$Q$3=\"Yes\",$AK$38>=0.25,$AK$39>=0.5),0,((((MAX(0,(E22-K22-Q22-(MAX(0,U22-K22-Q22)))*AA22))))))))","v":0},null,null,{"$f":"IF(OR(C22=\"Manager\",C22=\"Market\"),0,IF(AND('B - Project Requirements'!$AO$10=TRUE,$A$3=\"New Construction\",$Q$3=\"Yes\",$AK$38>=0.25,$AK$39>=0.5),MAX(0,E22-U22)*AD22,IF(OR(K22>=1,Q22>=1),MAX(0,(K22+Q22-U22)*AD22),0)))","v":0},null,null,10,0,0,"","",{"$f":"VLOOKUP($AQ22,'Loan Limits'!$A$4:$K$583,2,FALSE)","v":{"$error":"#N/A"}},{"$f":"VLOOKUP($AQ22,'Loan Limits'!$A$4:$K$583,3,FALSE)","v":{"$error":"#N/A"}},{"$f":"VLOOKUP($AQ22,'Loan Limits'!$A$4:$K$583,4,FALSE)","v":{"$error":"#N/A"}},{"$f":"VLOOKUP($AQ22,'Loan Limits'!$A$4:$K$583,5,FALSE)","v":{"$error":"#N/A"}},{"$f":"VLOOKUP($AQ22,'Loan Limits'!$A$4:$K$583,6,FALSE)","v":{"$error":"#N/A"}},{"$f":"VLOOKUP($AQ22,'Loan Limits'!$A$4:$K$583,7,FALSE)","v":{"$error":"#N/A"}},{"$f":"VLOOKUP($AQ22,'Loan Limits'!$A$4:$K$583,8,FALSE)","v":{"$error":"#N/A"}},{"$f":"VLOOKUP($AQ22,'Loan Limits'!$A$4:$K$583,9,FALSE)","v":{"$error":"#N/A"}},{"$f":"VLOOKUP($AQ22,'Loan Limits'!$A$4:$K$583,10,FALSE)","v":{"$error":"#N/A"}},{"$f":"VLOOKUP($AQ22,'Loan Limits'!$A$4:$K$583,11,FALSE)","v":{"$error":"#N/A"}},10,0.2,{"$f":"SUMIF($C$14:$C$35,\"20% AMI\",$E$14:$E$35)","v":0},0,null,0]
[null,null,null,null,null,null,null,null,null,null,null,null,null,null,null,null,null,null,null,null,null,null,0,null,"",null,0,null,null,{"$f":"IFERROR(HLOOKUP(AN23,'D - Max Loan & Unit Mix'!$AW$13:$BA$35,AM23,FALSE),0)","v":0},null,null,{"$f":"IF(C23=\"Market\",0,IF(C23=\"Manager\",E23*AA23,IF(AND('B - Project Requirements'!$AO$10=TRUE,$A$3=\"New Construction\",$Q$3=\"Yes\",$AK$38>=0.25,$AK$39>=0.5),0,((((MAX(0,(E23-K23-Q23-(MAX(0,U23-K23-Q23)))*AA23))))))))","v":0},null,null,{"$f":"IF(OR(C23=\"Manager\",C23=\"Market\"),0,IF(AND('B - Project Requirements'!$AO$10=TRUE,$A$3=\"New Construction\",$Q$3=\"Yes\",$AK$38>=0.25,$AK$39>=0.5),MAX(0,E23-U23)*AD23,IF(OR(K23>=1,Q23>=1),MAX(0,(K23+Q23-U23)*AD23),0)))","v":0},null,null,11,0,0,"","",{"$f":"VLOOKUP($AQ23,'Loan Limits'!$A$4:$K$583,2,FALSE)","v":{"$error":"#N/A"}},{"$f":"VLOOKUP($AQ23,'Loan Limits'!$A$4:$K$583,3,FALSE)","v":{"$error":"#N/A"}},{"$f":"VLOOKUP($AQ23,'Loan Limits'!$A$4:$K$583,4,FALSE)","v":{"$error":"#N/A"}},{"$f":"VLOOKUP($AQ23,'Loan Limits'!$A$4:$K$583,5,FALSE)","v":{"$error":"#N/A"}},{"$f":"VLOOKUP($AQ23,'Loan Limits'!$A$4:$K$583,6,FALSE)","v":{"$error":"#N/A"}},{"$f":"VLOOKUP($AQ23,'Loan Limits'!$A$4:$K$583,7,FALSE)","v":{"$error":"#N/A"}},{"$f":"VLOOKUP($AQ23,'Loan Limits'!$A$4:$K$583,8,FALSE)","v":{"$error":"#N/A"}},{"$f":"VLOOKUP($AQ23,'Loan Limits'!$A$4:$K$583,9,FALSE)","v":{"$error":"#N/A"}},{"$f":"VLOOKUP($AQ23,'Loan Limits'!$A$4:$K$583,10,FALSE)","v":{"$error":"#N/A"}},{"$f":"VLOOKUP($AQ23,'Loan Limits'!$A$4:$K$583,11,FALSE)","v":{"$error":"#N/A"}},11,0.15,{"$f":"SUMIF($C$14:$C$35,\"15% AMI\",$E$14:$E$35)","v":0},0,null,0]
[null,null,null,null,null,null,null,null,null,null,null,null,null,null,null,null,null,null,null,null,null,null,0,null,"",null,0,null,null,{"$f":"IFERROR(HLOOKUP(AN24,'D - Max Loan & Unit Mix'!$AW$13:$BA$35,AM24,FALSE),0)","v":0},null,null,{"$f":"IF(C24=\"Market\",0,IF(C24=\"Manager\",E24*AA24,IF(AND('B - Project Requirements'!$AO$10=TRUE,$A$3=\"New Construction\",$Q$3=\"Yes\",$AK$38>=0.25,$AK$39>=0.5),0,((((MAX(0,(E24-K24-Q24-(MAX(0,U24-K24-Q24)))*AA24))))))))","v":0},null,null,{"$f":"IF(OR(C24=\"Manager\",C24=\"Market\"),0,IF(AND('B - Project Requirements'!$AO$10=TRUE,$A$3=\"New Construction\",$Q$3=\"Yes\",$AK$38>=0.25,$AK$39>=0.5),MAX(0,E24-U24)*AD24,IF(OR(K24>=1,Q24>=1),MAX(0,(K24+Q24-U24)*AD24),0)))","v":0},null,null,12,0,0,"","",{"$f":"VLOOKUP($AQ24,'Loan Limits'!$A$4:$K$583,2,FALSE)","v":{"$error":"#N/A"}},{"$f":"VLOOKUP($AQ24,'Loan Limits'!$A$4:$K$583,3,FALSE)","v":{"$error":"#N/A"}},{"$f":"VLOOKUP($AQ24,'Loan Limits'!$A$4:$K$583,4,FALSE)","v":{"$error":"#N/A"}},{"$f":"VLOOKUP($AQ24,'Loan Limits'!$A$4:$K$583,5,FALSE)","v":{"$error":"#N/A"}},{"$f":"VLOOKUP($AQ24,'Loan Limits'!$A$4:$K$583,6,FALSE)","v":{"$error":"#N/A"}},{"$f":"VLOOKUP($AQ24,'Loan Limits'!$A$4:$K$583,7,FALSE)","v":{"$error":"#N/A"}},{"$f":"VLOOKUP($AQ24,'Loan Limits'!$A$4:$K$583,8,FALSE)","v":{"$error":"#N/A"}},{"$f":"VLOOKUP($AQ24,'Loan Limits'!$A$4:$K$583,9,FALSE)","v":{"$error":"#N/A"}},{"$f":"VLOOKUP($AQ24,'Loan Limits'!$A$4:$K$583,10,FALSE)","v":{"$error":"#N/A"}},{"$f":"VLOOKUP($AQ24,'Loan Limits'!$A$4:$K$583,11,FALSE)","v":{"$error":"#N/A"}},12,"Manager",{"$f":"SUMIF($C$14:$C$35,\"Manager\",$E$14:$E$35)","v":0},0]
[null,null,null,null,null,null,null,null,null,null,null,null,null,null,null,null,null,null,null,null,null,null,0,null,"",null,0,null,null,{"$f":"IFERROR(HLOOKUP(AN25,'D - Max Loan & Unit Mix'!$AW$13:$BA$35,AM25,FALSE),0)","v":0},null,null,{"$f":"IF(C25=\"Market\",0,IF(C25=\"Manager\",E25*AA25,IF(AND('B - Project Requirements'!$AO$10=TRUE,$A$3=\"New Construction\",$Q$3=\"Yes\",$AK$38>=0.25,$AK$39>=0.5),0,((((MAX(0,(E25-K25-Q25-(MAX(0,U25-K25-Q25)))*AA25))))))))","v":0},null,null,{"$f":"IF(OR(C25=\"Manager\",C25=\"Market\"),0,IF(AND('B - Project Requirements'!$AO$10=TRUE,$A$3=\"New Construction\",$Q$3=\"Yes\",$AK$38>=0.25,$AK$39>=0.5),MAX(0,E25-U25)*AD25,IF(OR(K25>=1,Q25>=1),MAX(0,(K25+Q25-U25)*AD25),0)))","v":0},null,null,13,0,0,"","",{"$f":"VLOOKUP($AQ25,'Loan Limits'!$A$4:$K$583,2,FALSE)","v":{"$error":"#N/A"}},{"$f":"VLOOKUP($AQ25,'Loan Limits'!$A$4:$K$583,3,FALSE)","v":{"$error":"#N/A"}},{"$f":"VLOOKUP($AQ25,'Loan Limits'!$A$4:$K$583,4,FALSE)","v":{"$error":"#N/A"}},{"$f":"VLOOKUP($AQ25,'Loan Limits'!$A$4:$K$583,5,FALSE)","v":{"$error":"#N/A"}},{"$f":"VLOOKUP($AQ25,'Loan Limits'!$A$4:$K$583,6,FALSE)","v":{"$error":"#N/A"}},{"$f":"VLOOKUP($AQ25,'Loan Limits'!$A$4:$K$583,7,FALSE)","v":{"$error":"#N/A"}},{"$f":"VLOOKUP($AQ25,'Loan Limits'!$A$4:$K$583,8,FALSE)","v":{"$error":"#N/A"}},{"$f":"VLOOKUP($AQ25,'Loan Limits'!$A$4:$K$583,9,FALSE)","v":{"$error":"#N/A"}},{"$f":"VLOOKUP($AQ25,'Loan Limits'!$A$4:$K$583,10,FALSE)","v":{"$error":"#N/A"}},{"$f":"VLOOKUP($AQ25,'Loan Limits'!$A$4:$K$583,11,FALSE)","v":{"$error":"#N/A"}},13,"TOTAL",{"$f":"SUM(BD14:BD23)","v":0},null,null,{"$f":"SUM(BG14:BG23)","v":0}]
[null,null,null,null,null,null,null,null,null,null,null,null,null,null,null,null,null,null,null,null,null,null,0,null,"",null,0,null,null,{"$f":"IFERROR(HLOOKUP(AN26,'D - Max Loan & Unit Mix'!$AW$13:$BA$35,AM26,FALSE),0)","v":0},null,null,{"$f":"IF(C26=\"Market\",0,IF(C26=\"Manager\",E26*AA26,IF(AND('B - Project Requirements'!$AO$10=TRUE,$A$3=\"New Construction\",$Q$3=\"Yes\",$AK$38>=0.25,$AK$39>=0.5),0,((((MAX(0,(E26-K26-Q26-(MAX(0,U26-K26-Q26)))*AA26))))))))","v":0},null,null,{"$f":"IF(OR(C26=\"Manager\",C26=\"Market\"),0,IF(AND('B - Project Requirements'!$AO$10=TRUE,$A$3=\"New Construction\",$Q$3=\"Yes\",$AK$38>=0.25,$AK$39>=0.5),MAX(0,E26-U26)*AD26,IF(OR(K26>=1,Q26>=1),MAX(0,(K26+Q26-U26)*AD26),0)))","v":0},null,null,14,0,0,"","",{"$f":"VLOOKUP($AQ26,'Loan Limits'!$A$4:$K$583,2,FALSE)","v":{"$error":"#N/A"}},{"$f":"VLOOKUP($AQ26,'Loan Limits'!$A$4:$K$583,3,FALSE)","v":{"$error":"#N/A"}},{"$f":"VLOOKUP($AQ26,'Loan Limits'!$A$4:$K$583,4,FALSE)","v":{"$error":"#N/A"}},{"$f":"VLOOKUP($AQ26,'Loan Limits'!$A$4:$K$583,5,FALSE)","v":{"$error":"#N/A"}},{"$f":"VLOOKUP($AQ26,'Loan Limits'!$A$4:$K$583,6,FALSE)","v":{"$error":"#N/A"}},{"$f":"VLOOKUP($AQ26,'Loan Limits'!$A$4:$K$583,7,FALSE)","v":{"$error":"#N/A"}},{"$f":"VLOOKUP($AQ26,'Loan Limits'!$A$4:$K$583,8,FALSE)","v":{"$error":"#N/A"}},{"$f":"VLOOKUP($AQ26,'Loan Limits'!$A$4:$K$583,9,FALSE)","v":{"$error":"#N/A"}},{"$f":"VLOOKUP($AQ26,'Loan Limits'!$A$4:$K$583,10,FALSE)","v":{"$error":"#N/A"}},{"$f":"VLOOKUP($AQ26,'Loan Limits'!$A$4:$K$583,11,FALSE)","v":{"$error":"#N/A"}},14,"Below 20%",null,{"$f":"SUM(BE22:BE23)","v":0},"SCORING "]
[null,null,null,null,null,null,null,null,null,null,null,null,null,null,null,null,null,null,null,null,null,null,0,null,"",null,0,null,null,{"$f":"IFERROR(HLOOKUP(AN27,'D - Max Loan & Unit Mix'!$AW$13:$BA$35,AM27,FALSE),0)","v":0},null,null,{"$f":"IF(C27=\"Market\",0,IF(C27=\"Manager\",E27*AA27,IF(AND('B - Project Requirements'!$AO$10=TRUE,$A$3=\"New Construction\",$Q$3=\"Yes\",$AK$38>=0.25,$AK$39>=0.5),0,((((MAX(0,(E27-K27-Q27-(MAX(0,U27-K27-Q27)))*AA27))))))))","v":0},null,null,{"$f":"IF(OR(C27=\"Manager\",C27=\"Market\"),0,IF(AND('B - Project Requirements'!$AO$10=TRUE,$A$3=\"New Construction\",$Q$3=\"Yes\",$AK$38>=0.25,$AK$39>=0.5),MAX(0,E27-U27)*AD27,IF(OR(K27>=1,Q27>=1),MAX(0,(K27+Q27-U27)*AD27),0)))","v":0},null,null,15,0,0,"","",{"$f":"VLOOKUP($AQ27,'Loan Limits'!$A$4:$K$583,2,FALSE)","v":{"$error":"#N/A"}},{"$f":"VLOOKUP($AQ27,'Loan Limits'!$A$4:$K$583,3,FALSE)","v":{"$error":"#N/A"}},{"$f":"VLOOKUP($AQ27,'Loan Limits'!$A$4:$K$583,4,FALSE)","v":{"$error":"#N/A"}},{"$f":"VLOOKUP($AQ27,'Loan Limits'!$A$4:$K$583,5,FALSE)","v":{"$error":"#N/A"}},{"$f":"VLOOKUP($AQ27,'Loan Limits'!$A$4:$K$583,6,FALSE)","v":{"$error":"#N/A"}},{"$f":"VLOOKUP($AQ27,'Loan Limits'!$A$4:$K$583,7,FALSE)","v":{"$error":"#N/A"}},{"$f":"VLOOKUP($AQ27,'Loan Limits'!$A$4:$K$583,8,FALSE)","v":{"$error":"#N/A"}},{"$f":"VLOOKUP($AQ27,'Loan Limits'!$A$4:$K$583,9,FALSE)","v":{"$error":"#N/A"}},{"$f":"VLOOKUP($AQ27,'Loan Limits'!$A$4:$K$583,10,FALSE)","v":{"$error":"#N/A"}},{"$f":"VLOOKUP($AQ27,'Loan Limits'!$A$4:$K$583,11,FALSE)","v":{"$error":"#N/A"}},15]
[null,null,null,null,null,null,null,null,null,null,null,null,null,null,null,null,null,null,null,null,null,null,0,null,"",null,0,null,null,{"$f":"IFERROR(HLOOKUP(AN28,'D - Max Loan & Unit Mix'!$AW$13:$BA$35,AM28,FALSE),0)","v":0},null,null,{"$f":"IF(C28=\"Market\",0,IF(C28=\"Manager\",E28*AA28,IF(AND('B - Project Requirements'!$AO$10=TRUE,$A$3=\"New Construction\",$Q$3=\"Yes\",$AK$38>=0.25,$AK$39>=0.5),0,((((MAX(0,(E28-K28-Q28-(MAX(0,U28-K28-Q28)))*AA28))))))))","v":0},null,null,{"$f":"IF(OR(C28=\"Manager\",C28=\"Market\"),0,IF(AND('B - Project Requirements'!$AO$10=TRUE,$A$3=\"New Construction\",$Q$3=\"Yes\",$AK$38>=0.25,$AK$39>=0.5),MAX(0,E28-U28)*AD28,IF(OR(K28>=1,Q28>=1),MAX(0,(K28+Q28-U28)*AD28),0)))","v":0},null,null,16,0,0,"","",{"$f":"VLOOKUP($AQ28,'Loan Limits'!$A$4:$K$583,2,FALSE)","v":{"$error":"#N/A"}},{"$f":"VLOOKUP($AQ28,'Loan Limits'!$A$4:$K$583,3,FALSE)","v":{"$error":"#N/A"}},{"$f":"VLOOKUP($AQ28,'Loan Limits'!$A$4:$K$583,4,FALSE)","v":{"$error":"#N/A"}},{"$f":"VLOOKUP($AQ28,'Loan Limits'!$A$4:$K$583,5,FALSE)","v":{"$error":"#N/A"}},{"$f":"VLOOKUP($AQ28,'Loan Limits'!$A$4:$K$583,6,FALSE)","v":{"$error":"#N/A"}},{"$f":"VLOOKUP($AQ28,'Loan Limits'!$A$4:$K$583,7,FALSE)","v":{"$error":"#N/A"}},{"$f":"VLOOKUP($AQ28,'Loan Limits'!$A$4:$K$583,8,FALSE)","v":{"$error":"#N/A"}},{"$f":"VLOOKUP($AQ28,'Loan Limits'!$A$4:$K$583,9,FALSE)","v":{"$error":"#N/A"}},{"$f":"VLOOKUP($AQ28,'Loan Limits'!$A$4:$K$583,10,FALSE)","v":{"$error":"#N/A"}},{"$f":"VLOOKUP($AQ28,'Loan Limits'!$A$4:$K$583,11,FALSE)","v":{"$error":"#N/A"}},16]
[null,null,null,null,null,null,null,null,null,null,null,null,null,null,null,null,null,null,null,null,null,null,0,null,"",null,0,null,null,{"$f":"IFERROR(HLOOKUP(AN29,'D - Max Loan & Unit Mix'!$AW$13:$BA$35,AM29,FALSE),0)","v":0},null,null,{"$f":"IF(C29=\"Market\",0,IF(C29=\"Manager\",E29*AA29,IF(AND('B - Project Requirements'!$AO$10=TRUE,$A$3=\"New Construction\",$Q$3=\"Yes\",$AK$38>=0.25,$AK$39>=0.5),0,((((MAX(0,(E29-K29-Q29-(MAX(0,U29-K29-Q29)))*AA29))))))))","v":0},null,null,{"$f":"IF(OR(C29=\"Manager\",C29=\"Market\"),0,IF(AND('B - Project Requirements'!$AO$10=TRUE,$A$3=\"New Construction\",$Q$3=\"Yes\",$AK$38>=0.25,$AK$39>=0.5),MAX(0,E29-U29)*AD29,IF(OR(K29>=1,Q29>=1),MAX(0,(K29+Q29-U29)*AD29),0)))","v":0},null,null,17,0,0,"","",{"$f":"VLOOKUP($AQ29,'Loan Limits'!$A$4:$K$583,2,FALSE)","v":{"$error":"#N/A"}},{"$f":"VLOOKUP($AQ29,'Loan Limits'!$A$4:$K$583,3,FALSE)","v":{"$error":"#N/A"}},{"$f":"VLOOKUP($AQ29,'Loan Limits'!$A$4:$K$583,4,FALSE)","v":{"$error":"#N/A"}},{"$f":"VLOOKUP($AQ29,'Loan Limits'!$A$4:$K$583,5,FALSE)","v":{"$error":"#N/A"}},{"$f":"VLOOKUP($AQ29,'Loan Limits'!$A$4:$K$583,6,FALSE)","v":{"$error":"#N/A"}},{"$f":"VLOOKUP($AQ29,'Loan Limits'!$A$4:$K$583,7,FALSE)","v":{"$error":"#N/A"}},{"$f":"VLOOKUP($AQ29,'Loan Limits'!$A$4:$K$583,8,FALSE)","v":{"$error":"#N/A"}},{"$f":"VLOOKUP($AQ29,'Loan Limits'!$A$4:$K$583,9,FALSE)","v":{"$error":"#N/A"}},{"$f":"VLOOKUP($AQ29,'Loan Limits'!$A$4:$K$583,10,FALSE)","v":{"$error":"#N/A"}},{"$f":"VLOOKUP($AQ29,'Loan Limits'!$A$4:$K$583,11,FALSE)","v":{"$error":"#N/A"}},17]
[null,null,null,null,null,null,null,null,null,null,null,null,null,null,null,null,null,null,null,null,null,null,0,null,"",null,0,null,null,{"$f":"IFERROR(HLOOKUP(AN30,'D - Max Loan & Unit Mix'!$AW$13:$BA$35,AM30,FALSE),0)","v":0},null,null,{"$f":"IF(C30=\"Market\",0,IF(C30=\"Manager\",E30*AA30,IF(AND('B - Project Requirements'!$AO$10=TRUE,$A$3=\"New Construction\",$Q$3=\"Yes\",$AK$38>=0.25,$AK$39>=0.5),0,((((MAX(0,(E30-K30-Q30-(MAX(0,U30-K30-Q30)))*AA30))))))))","v":0},null,null,{"$f":"IF(OR(C30=\"Manager\",C30=\"Market\"),0,IF(AND('B - Project Requirements'!$AO$10=TRUE,$A$3=\"New Construction\",$Q$3=\"Yes\",$AK$38>=0.25,$AK$39>=0.5),MAX(0,E30-U30)*AD30,IF(OR(K30>=1,Q30>=1),MAX(0,(K30+Q30-U30)*AD30),0)))","v":0},null,null,18,0,0,"","",{"$f":"VLOOKUP($AQ30,'Loan Limits'!$A$4:$K$583,2,FALSE)","v":{"$error":"#N/A"}},{"$f":"VLOOKUP($AQ30,'Loan Limits'!$A$4:$K$583,3,FALSE)","v":{"$error":"#N/A"}},{"$f":"VLOOKUP($AQ30,'Loan Limits'!$A$4:$K$583,4,FALSE)","v":{"$error":"#N/A"}},{"$f":"VLOOKUP($AQ30,'Loan Limits'!$A$4:$K$583,5,FALSE)","v":{"$error":"#N/A"}},{"$f":"VLOOKUP($AQ30,'Loan Limits'!$A$4:$K$583,6,FALSE)","v":{"$error":"#N/A"}},{"$f":"VLOOKUP($AQ30,'Loan Limits'!$A$4:$K$583,7,FALSE)","v":{"$error":"#N/A"}},{"$f":"VLOOKUP($AQ30,'Loan Limits'!$A$4:$K$583,8,FALSE)","v":{"$error":"#N/A"}},{"$f":"VLOOKUP($AQ30,'Loan Limits'!$A$4:$K$583,9,FALSE)","v":{"$error":"#N/A"}},{"$f":"VLOOKUP($AQ30,'Loan Limits'!$A$4:$K$583,10,FALSE)","v":{"$error":"#N/A"}},{"$f":"VLOOKUP($AQ30,'Loan Limits'!$A$4:$K$583,11,FALSE)","v":{"$error":"#N/A"}},18]
[null,null,null,null,null,null,null,null,null,null,null,null,null,null,null,null,null,null,null,null,null,null,0,null,"",null,0,null,null,{"$f":"IFERROR(HLOOKUP(AN31,'D - Max Loan & Unit Mix'!$AW$13:$BA$35,AM31,FALSE),0)","v":0},null,null,{"$f":"IF(C31=\"Market\",0,IF(C31=\"Manager\",E31*AA31,IF(AND('B - Project Requirements'!$AO$10=TRUE,$A$3=\"New Construction\",$Q$3=\"Yes\",$AK$38>=0.25,$AK$39>=0.5),0,((((MAX(0,(E31-K31-Q31-(MAX(0,U31-K31-Q31)))*AA31))))))))","v":0},null,null,{"$f":"IF(OR(C31=\"Manager\",C31=\"Market\"),0,IF(AND('B - Project Requirements'!$AO$10=TRUE,$A$3=\"New Construction\",$Q$3=\"Yes\",$AK$38>=0.25,$AK$39>=0.5),MAX(0,E31-U31)*AD31,IF(OR(K31>=1,Q31>=1),MAX(0,(K31+Q31-U31)*AD31),0)))","v":0},null,null,19,0,0,"","",{"$f":"VLOOKUP($AQ31,'Loan Limits'!$A$4:$K$583,2,FALSE)","v":{"$error":"#N/A"}},{"$f":"VLOOKUP($AQ31,'Loan Limits'!$A$4:$K$583,3,FALSE)","v":{"$error":"#N/A"}},{"$f":"VLOOKUP($AQ31,'Loan Limits'!$A$4:$K$583,4,FALSE)","v":{"$error":"#N/A"}},{"$f":"VLOOKUP($AQ31,'Loan Limits'!$A$4:$K$583,5,FALSE)","v":{"$error":"#N/A"}},{"$f":"VLOOKUP($AQ31,'Loan Limits'!$A$4:$K$583,6,FALSE)","v":{"$error":"#N/A"}},{"$f":"VLOOKUP($AQ31,'Loan Limits'!$A$4:$K$583,7,FALSE)","v":{"$error":"#N/A"}},{"$f":"VLOOKUP($AQ31,'Loan Limits'!$A$4:$K$583,8,FALSE)","v":{"$error":"#N/A"}},{"$f":"VLOOKUP($AQ31,'Loan Limits'!$A$4:$K$583,9,FALSE)","v":{"$error":"#N/A"}},{"$f":"VLOOKUP($AQ31,'Loan Limits'!$A$4:$K$583,10,FALSE)","v":{"$error":"#N/A"}},{"$f":"VLOOKUP($AQ31,'Loan Limits'!$A$4:$K$583,11,FALSE)","v":{"$error":"#N/A"}},19]
[null,null,null,null,null,null,null,null,null,null,null,null,null,null,null,null,null,null,null,null,null,null,0,null,"",null,0,null,null,{"$f":"IFERROR(HLOOKUP(AN32,'D - Max Loan & Unit Mix'!$AW$13:$BA$35,AM32,FALSE),0)","v":0},null,null,{"$f":"IF(C32=\"Market\",0,IF(C32=\"Manager\",E32*AA32,IF(AND('B - Project Requirements'!$AO$10=TRUE,$A$3=\"New Construction\",$Q$3=\"Yes\",$AK$38>=0.25,$AK$39>=0.5),0,((((MAX(0,(E32-K32-Q32-(MAX(0,U32-K32-Q32)))*AA32))))))))","v":0},null,null,{"$f":"IF(OR(C32=\"Manager\",C32=\"Market\"),0,IF(AND('B - Project Requirements'!$AO$10=TRUE,$A$3=\"New Construction\",$Q$3=\"Yes\",$AK$38>=0.25,$AK$39>=0.5),MAX(0,E32-U32)*AD32,IF(OR(K32>=1,Q32>=1),MAX(0,(K32+Q32-U32)*AD32),0)))","v":0},null,null,20,0,0,"","",{"$f":"VLOOKUP($AQ32,'Loan Limits'!$A$4:$K$583,2,FALSE)","v":{"$error":"#N/A"}},{"$f":"VLOOKUP($AQ32,'Loan Limits'!$A$4:$K$583,3,FALSE)","v":{"$error":"#N/A"}},{"$f":"VLOOKUP($AQ32,'Loan Limits'!$A$4:$K$583,4,FALSE)","v":{"$error":"#N/A"}},{"$f":"VLOOKUP($AQ32,'Loan Limits'!$A$4:$K$583,5,FALSE)","v":{"$error":"#N/A"}},{"$f":"VLOOKUP($AQ32,'Loan Limits'!$A$4:$K$583,6,FALSE)","v":{"$error":"#N/A"}},{"$f":"VLOOKUP($AQ32,'Loan Limits'!$A$4:$K$583,7,FALSE)","v":{"$error":"#N/A"}},{"$f":"VLOOKUP($AQ32,'Loan Limits'!$A$4:$K$583,8,FALSE)","v":{"$error":"#N/A"}},{"$f":"VLOOKUP($AQ32,'Loan Limits'!$A$4:$K$583,9,FALSE)","v":{"$error":"#N/A"}},{"$f":"VLOOKUP($AQ32,'Loan Limits'!$A$4:$K$583,10,FALSE)","v":{"$error":"#N/A"}},{"$f":"VLOOKUP($AQ32,'Loan Limits'!$A$4:$K$583,11,FALSE)","v":{"$error":"#N/A"}},20]
[null,null,null,null,null,null,null,null,null,null,null,null,null,null,null,null,null,null,null,null,null,null,0,null,"",null,0,null,null,{"$f":"IFERROR(HLOOKUP(AN33,'D - Max Loan & Unit Mix'!$AW$13:$BA$35,AM33,FALSE),0)","v":0},null,null,{"$f":"IF(C33=\"Market\",0,IF(C33=\"Manager\",E33*AA33,IF(AND('B - Project Requirements'!$AO$10=TRUE,$A$3=\"New Construction\",$Q$3=\"Yes\",$AK$38>=0.25,$AK$39>=0.5),0,((((MAX(0,(E33-K33-Q33-(MAX(0,U33-K33-Q33)))*AA33))))))))","v":0},null,null,{"$f":"IF(OR(C33=\"Manager\",C33=\"Market\"),0,IF(AND('B - Project Requirements'!$AO$10=TRUE,$A$3=\"New Construction\",$Q$3=\"Yes\",$AK$38>=0.25,$AK$39>=0.5),MAX(0,E33-U33)*AD33,IF(OR(K33>=1,Q33>=1),MAX(0,(K33+Q33-U33)*AD33),0)))","v":0},null,null,21,0,0,"","",{"$f":"VLOOKUP($AQ33,'Loan Limits'!$A$4:$K$583,2,FALSE)","v":{"$error":"#N/A"}},{"$f":"VLOOKUP($AQ33,'Loan Limits'!$A$4:$K$583,3,FALSE)","v":{"$error":"#N/A"}},{"$f":"VLOOKUP($AQ33,'Loan Limits'!$A$4:$K$583,4,FALSE)","v":{"$error":"#N/A"}},{"$f":"VLOOKUP($AQ33,'Loan Limits'!$A$4:$K$583,5,FALSE)","v":{"$error":"#N/A"}},{"$f":"VLOOKUP($AQ33,'Loan Limits'!$A$4:$K$583,6,FALSE)","v":{"$error":"#N/A"}},{"$f":"VLOOKUP($AQ33,'Loan Limits'!$A$4:$K$583,7,FALSE)","v":{"$error":"#N/A"}},{"$f":"VLOOKUP($AQ33,'Loan Limits'!$A$4:$K$583,8,FALSE)","v":{"$error":"#N/A"}},{"$f":"VLOOKUP($AQ33,'Loan Limits'!$A$4:$K$583,9,FALSE)","v":{"$error":"#N/A"}},{"$f":"VLOOKUP($AQ33,'Loan Limits'!$A$4:$K$583,10,FALSE)","v":{"$error":"#N/A"}},{"$f":"VLOOKUP($AQ33,'Loan Limits'!$A$4:$K$583,11,FALSE)","v":{"$error":"#N/A"}},21]
[null,null,null,null,null,null,null,null,null,null,null,null,null,null,null,null,null,null,null,null,null,null,0,null,"",null,0,null,null,{"$f":"IFERROR(HLOOKUP(AN34,'D - Max Loan & Unit Mix'!$AW$13:$BA$35,AM34,FALSE),0)","v":0},null,null,{"$f":"IF(C34=\"Market\",0,IF(C34=\"Manager\",E34*AA34,IF(AND('B - Project Requirements'!$AO$10=TRUE,$A$3=\"New Construction\",$Q$3=\"Yes\",$AK$38>=0.25,$AK$39>=0.5),0,((((MAX(0,(E34-K34-Q34-(MAX(0,U34-K34-Q34)))*AA34))))))))","v":0},null,null,{"$f":"IF(OR(C34=\"Manager\",C34=\"Market\"),0,IF(AND('B - Project Requirements'!$AO$10=TRUE,$A$3=\"New Construction\",$Q$3=\"Yes\",$AK$38>=0.25,$AK$39>=0.5),MAX(0,E34-U34)*AD34,IF(OR(K34>=1,Q34>=1),MAX(0,(K34+Q34-U34)*AD34),0)))","v":0},null,null,22,0,0,"","",{"$f":"VLOOKUP($AQ34,'Loan Limits'!$A$4:$K$583,2,FALSE)","v":{"$error":"#N/A"}},{"$f":"VLOOKUP($AQ34,'Loan Limits'!$A$4:$K$583,3,FALSE)","v":{"$error":"#N/A"}},{"$f":"VLOOKUP($AQ34,'Loan Limits'!$A$4:$K$583,4,FALSE)","v":{"$error":"#N/A"}},{"$f":"VLOOKUP($AQ34,'Loan Limits'!$A$4:$K$583,5,FALSE)","v":{"$error":"#N/A"}},{"$f":"VLOOKUP($AQ34,'Loan Limits'!$A$4:$K$583,6,FALSE)","v":{"$error":"#N/A"}},{"$f":"VLOOKUP($AQ34,'Loan Limits'!$A$4:$K$583,7,FALSE)","v":{"$error":"#N/A"}},{"$f":"VLOOKUP($AQ34,'Loan Limits'!$A$4:$K$583,8,FALSE)","v":{"$error":"#N/A"}},{"$f":"VLOOKUP($AQ34,'Loan Limits'!$A$4:$K$583,9,FALSE)","v":{"$error":"#N/A"}},{"$f":"VLOOKUP($AQ34,'Loan Limits'!$A$4:$K$583,10,FALSE)","v":{"$error":"#N/A"}},{"$f":"VLOOKUP($AQ34,'Loan Limits'!$A$4:$K$583,11,FALSE)","v":{"$error":"#N/A"}},22]
[null,null,null,null,null,null,null,null,null,null,null,null,null,null,null,null,null,null,null,null,null,null,0,null,"",null,0,null,null,{"$f":"IFERROR(HLOOKUP(AN35,'D - Max Loan & Unit Mix'!$AW$13:$BA$35,AM35,FALSE),0)","v":0},null,null,{"$f":"IF(C35=\"Market\",0,IF(C35=\"Manager\",E35*AA35,IF(AND('B - Project Requirements'!$AO$10=TRUE,$A$3=\"New Construction\",$Q$3=\"Yes\",$AK$38>=0.25,$AK$39>=0.5),0,((((MAX(0,(E35-K35-Q35-(MAX(0,U35-K35-Q35)))*AA35))))))))","v":0},null,null,{"$f":"IF(OR(C35=\"Manager\",C35=\"Market\"),0,IF(AND('B - Project Requirements'!$AO$10=TRUE,$A$3=\"New Construction\",$Q$3=\"Yes\",$AK$38>=0.25,$AK$39>=0.5),MAX(0,E35-U35)*AD35,IF(OR(K35>=1,Q35>=1),MAX(0,(K35+Q35-U35)*AD35),0)))","v":0},null,null,23,0,0,"","",{"$f":"VLOOKUP($AQ35,'Loan Limits'!$A$4:$K$583,2,FALSE)","v":{"$error":"#N/A"}},{"$f":"VLOOKUP($AQ35,'Loan Limits'!$A$4:$K$583,3,FALSE)","v":{"$error":"#N/A"}},{"$f":"VLOOKUP($AQ35,'Loan Limits'!$A$4:$K$583,4,FALSE)","v":{"$error":"#N/A"}},{"$f":"VLOOKUP($AQ35,'Loan Limits'!$A$4:$K$583,5,FALSE)","v":{"$error":"#N/A"}},{"$f":"VLOOKUP($AQ35,'Loan Limits'!$A$4:$K$583,6,FALSE)","v":{"$error":"#N/A"}},{"$f":"VLOOKUP($AQ35,'Loan Limits'!$A$4:$K$583,7,FALSE)","v":{"$error":"#N/A"}},{"$f":"VLOOKUP($AQ35,'Loan Limits'!$A$4:$K$583,8,FALSE)","v":{"$error":"#N/A"}},{"$f":"VLOOKUP($AQ35,'Loan Limits'!$A$4:$K$583,9,FALSE)","v":{"$error":"#N/A"}},{"$f":"VLOOKUP($AQ35,'Loan Limits'!$A$4:$K$583,10,FALSE)","v":{"$error":"#N/A"}},{"$f":"VLOOKUP($AQ35,'Loan Limits'!$A$4:$K$583,11,FALSE)","v":{"$error":"#N/A"}},23]
[{"$f":"A14*E14+A15*E15+A16*E16+A17*E17+A18*E18+A19*E19+A20*E20+A21*E21+A22*E22+A23*E23+A24*E24+A25*E25+A26*E26+A27*E27+A28*E28+A29*E29+A30*E30+A31*E31+A32*E32+A33*E33+A34*E34+A35*E35","v":0},null,null,null,{"$f":"SUM(E14:E35)","v":0},null,{"$f":"SUM(G14:H35)","v":0},null,{"$f":"SUM(I14:J35)","v":0},null,{"$f":"SUM(K14:L35)","v":0},null,{"$f":"SUM(M14:N35)","v":0},null,{"$f":"SUM(O14:P35)","v":0},null,{"$f":"SUM(Q14:R35)","v":0},null,null,null,{"$f":"SUM(U14:V35)","v":0},null,{"$f":"SUM(W14:X35)","v":0},null,null,null,null,null,null,null,null,null,{"$f":"SUM(AG14:AI35)","v":0},null,null,{"$f":"SUM(AJ14:AL35)","v":0}]
[]
["Large Family Project Requirements, 7302(e)(1). Restricted Units at least 25% have 3 or more bedrooms and at least an additional 25% have 2 or more bedrooms. ",null,null,null,null,null,null,null,null,null,null,null,null,null,null,null,null,null,null,null,null,null,null,null,null,null,null,null,null,null,null,null,null,null,"3+ Bdrm",null,{"$f":"IFERROR((SUMIF(AO14:AO35,3,E14:E35)+SUMIF(AO14:AO35,\"4+\",E14:E35))/BD25,0)","v":0}]
[null,null,null,null,null,null,null,null,null,null,null,null,null,null,null,null,null,null,null,null,null,null,null,null,null,null,null,null,null,null,null,null,null,null,"2+Bdrm",null,{"$f":"IFERROR(((SUMIF(AO14:AO35,2,E14:E35)+(SUMIF(AO14:AO35,3,E14:E35)+SUMIF(AO14:AO35,\"4+\",E14:E35)))/BD25),0)","v":0}]
["Are any of the units in this Project required to be constructed as a condition of approval of one or more market rate developments pursuant to an inclusionary housing ordinance or similar local requirement? Units required under the ordinance or other requirement shall not be counted in determining applicable loan limits, except for units restricted under the Program at a lower rent level than required by the ordinance, in which case the loan amount shall be limited to the amount required to reduce rents from the level required under the ordinance or other requirement to the program-restricted amount, calculated using the loan limit tables published by the Department. §7307(c). NOTE: If units in this Project are required to be constructed as a condition of approval of one or more market rate developments pursuant to an inclusionary housing ordinance or similar local requirement, the Department may make adjustments to the requested Loan Amount. "]
["For rental assistance, operating, project based and other subsidies, attach evidence of commitment status (e.g. commitment letters, grant awards or subsidy contracts). If commitments are not available, attach other documentation such as a reservation or third-party letter stating the following: annual subsidy amount, date or expected date of award, term and number of subsidized units. Also, attach documentation of the Voucher Payment Standard and Fair Market Rents from the Local Housing Authority.\nProjects dependent upon HUD Section 8 subsidies or other similar rent subsidies must establish a Transition Reserve Account in the event such subsidies become unavailable. The amount of the capitalized reserve shall not exceed the amount needed to ensure fiscal integrity of the Project §7312(f)(2)."]
["Max Loan Calculation"]
["I. Permanent Funding Gap §7302(b)"]
["Total Project Cost (UA 'Dev Budget' worksheet cell B115)"]
[" Less: Net Syndication Proceeds/Investor Equity (UA 'Dev Sources' worksheet)"]
[" Less: Additional Owner/General Partner Equity (UA 'Dev Sources' worksheet)"]
["TOTAL ESTIMATED FINANCING NEED",null,null,null,null,null,null,null,null,null,null,null,null,null,null,null,null,null,null,null,null,null,null,null,null,null,null,null,null,null,null,null,null,null,null,{"$f":"AJ44-AJ45-AJ46","v":0}]
[" Less: Supportable Conventional or Bond Debt Financing (UA 'Dev Sources' worksheet)"]
[" Less: \"Soft\" Financing and Grants (UA 'Dev Sources' worksheet)"]
["Funding Gap",null,null,null,null,null,null,null,null,null,null,null,null,null,null,null,null,null,null,null,null,null,null,null,null,null,null,null,null,null,null,null,null,null,null,{"$f":"AJ47-AJ48-AJ49","v":0}]
["II. Shared Cost Calculation §7304(c)"]
["1. Total Residential Development Cost (UA 'Dev Budget' worksheet cell C115)"]
["2a. Gross square footage of Restricted units (UA 'Site & Units' worksheet rows 41 - 52)"]
["2b. Gross square footage of all Residential units (UA 'Misc.' worksheet cell I15)"]
["3. Restricted square footage as % of total",null,null,null,null,null,null,null,null,null,null,null,null,null,null,null,null,null,null,null,null,null,null,null,null,null,null,null,null,null,null,null,null,null,null,{"$f":"IF(OR(AJ53=0,AJ54=0),0,AJ53/AJ54)","v":0}]
["4. MHP Residential Dev. costs based on % of Restricted sq. footage",null,null,null,null,null,null,null,null,null,null,null,null,null,null,null,null,null,null,null,null,null,null,null,null,null,null,null,null,null,null,null,null,null,null,{"$f":"AJ55*AJ52","v":0}]
["III. MHP Unit Loan Amount §7307(b) (AG35+AJ35)",null,null,null,null,null,null,null,null,null,null,null,null,null,null,null,null,null,null,null,null,null,null,null,null,null,null,null,null,null,null,null,null,null,null,{"$f":"AG36+AJ36","v":0}]
["a. Permanent Funding Gap §7302(b)",null,null,null,null,null,null,null,null,null,null,null,null,null,null,null,null,null,null,null,null,null,null,null,null,null,null,null,null,null,null,null,null,null,null,{"$f":"MAX(AJ50,0)","v":0}]
["b. Shared Cost Calculation §7304(c)",null,null,null,null,null,null,null,null,null,null,null,null,null,null,null,null,null,null,null,null,null,null,null,null,null,null,null,null,null,null,null,null,null,null,{"$f":"MAX(AJ56,0)","v":0}]
["c. MHP Unit Loan Limit §7307(b)",null,null,null,null,null,null,null,null,null,null,null,null,null,null,null,null,null,null,null,null,null,null,null,null,null,null,null,null,null,null,null,null,null,null,{"$f":"AJ57","v":0}]
["d. NOFA Loan Maximum §7307(e)",null,null,null,null,null,null,null,null,null,null,null,null,null,null,null,null,null,null,null,null,null,null,null,null,null,null,null,null,null,null,null,null,null,null,20000000]
["e. Sponsor Loan Amount Request"]
["Maximum Allowable MHP Loan (lesser of a - e above)",null,null,null,null,null,null,null,null,null,null,null,null,null,null,null,null,null,null,null,null,null,null,null,null,null,null,null,null,null,null,null,null,null,null,{"$f":"MIN(AJ58:AL62)","v":0}]
["File Name:",null,null,null,null,{"$f":"Checklist!D93","v":"24. Utility Allowance"},null,null,null,null,null,null,null,"Documentation from the local housing authority substantiating amount of UA used.",null,null,null,null,null,null,null,null,null,null,null,null,null,null,null,null,"Uploaded to FAAST?"]
["File Name:",null,null,null,null,{"$f":"Checklist!D94","v":"25. Subsidy Commitment"},null,null,null,null,null,null,null,"Documentation evidencing commitment status and subsidy amount - e.g. commitment letters, grant awards or subsidy contracts.",null,null,null,null,null,null,null,null,null,null,null,null,null,null,null,null,"Uploaded to FAAST?"]
["File Name:",null,null,null,null,{"$f":"Checklist!D95","v":"26. Fair Market Rents"},null,null,null,null,null,null,null,"Documentation of the Voucher Payment Standard and Fair Market Rents from the Local Housing Authority.",null,null,null,null,null,null,null,null,null,null,null,null,null,null,null,null,"Uploaded to FAAST?"]
["File Name:",null,null,null,null,{"$f":"Checklist!D96","v":"27. Trans Res Calc"},null,null,null,null,null,null,null,"Documentation showing calculation of Transition Reserve amount.",null,null,null,null,null,null,null,null,null,null,null,null,null,null,null,null,"Uploaded to FAAST?"]

{"sheet":"E - Project Selection","index":11,"n_rows":113,"n_cols":49,"rows_kept":113,"cut":false,"hidden":false,"merged":[[0,0,0,21],[0,22,0,25],[0,26,0,28],[41,26,41,31],[41,32,41,34],[44,35,44,37],[36,26,36,31],[39,26,39,31],[24,0,24,33],[24,34,24,35],[23,36,24,37],[29,0,29,4],[29,5,29,12],[29,13,29,29],[29,30,29,35],[29,36,29,37],[26,34,26,35],[27,0,27,33],[36,35,36,37],[40,1,40,8],[38,21,38,25],[39,21,39,25],[40,21,40,25],[37,1,37,8],[38,1,38,8],[30,36,30,37],[33,0,33,20],[107,30,107,35],[107,36,107,37],[35,9,35,17],[35,18,35,20],[36,18,36,20],[36,9,36,17],[37,9,37,17],[37,18,37,20],[38,9,38,17],[38,18,38,20],[39,9,39,17],[39,18,39,20],[40,9,40,17],[40,18,40,20],[41,9,41,17],[41,18,41,20],[42,9,42,17],[42,18,42,20],[43,9,43,17],[43,18,43,20],[44,9,44,17],[42,21,42,25],[41,35,41,37],[45,26,45,31],[109,0,109,37],[110,34,110,35],[110,0,110,33],[100,0,100,37],[102,0,102,37],[43,21,43,25],[51,19,51,23],[46,0,46,37],[47,0,47,37],[53,24,53,25],[43,26,43,31],[43,32,43,34],[43,35,43,37],[44,1,44,8],[44,21,44,25],[44,26,44,31],[44,32,44,34],[50,14,50,18],[50,19,50,23],[91,0,91,4],[57,0,57,35],[107,0,107,4],[107,5,107,12],[107,13,107,29],[45,18,45,20],[50,11,50,13],[51,11,51,13],[52,11,52,13],[53,11,53,13],[54,11,54,13],[55,11,55,13],[52,1,52,6],[53,1,53,6],[51,1,51,6],[80,0,80,35],[59,0,59,31],[55,14,55,18],[55,19,55,23],[56,0,56,35],[55,26,55,37],[76,27,76,37],[67,30,67,35],[67,13,67,29],[66,13,66,29],[53,14,53,18],[44,18,44,20],[45,9,45,17],[51,14,51,18],[50,7,50,10],[51,7,51,10],[54,7,54,10],[1,8,1,15],[1,16,1,22],[1,23,1,31],[53,19,53,23],[50,26,50,37],[51,26,51,37],[52,14,52,18],[49,0,49,12],[49,13,49,35],[45,32,45,34],[45,35,45,37],[52,7,52,10],[53,7,53,10],[45,1,45,8],[54,14,54,18],[54,19,54,23],[54,24,54,25],[54,26,54,37],[1,32,1,37],[2,0,2,7],[2,8,2,15],[2,16,2,22],[2,23,2,31],[2,32,2,37],[5,0,5,35],[14,36,14,37],[5,36,5,37],[3,0,3,35],[7,2,7,3],[7,34,7,35],[8,32,8,33],[13,36,13,37],[10,36,10,37],[9,36,9,37],[10,10,10,11],[11,30,11,31],[12,28,12,29],[12,30,12,31],[10,18,10,19],[14,2,14,3],[12,34,12,35],[14,20,14,21],[0,29,0,32],[0,35,0,37],[52,26,52,37],[50,24,50,25],[51,24,51,25],[52,24,52,25],[7,28,7,29],[11,22,11,23],[11,24,11,25],[11,26,11,27],[28,36,28,37],[25,0,25,35],[25,36,25,37],[22,36,22,37],[26,36,26,37],[27,34,27,35],[15,6,15,7],[52,19,52,23],[43,1,43,8],[13,32,13,33],[1,0,1,7],[14,4,14,5],[14,6,14,7],[10,8,10,9],[14,32,14,33],[7,32,7,33],[13,34,13,35],[13,20,13,21],[13,22,13,23],[10,32,10,33],[13,26,13,27],[13,28,13,29],[13,30,13,31],[10,28,10,29],[8,36,8,37],[6,36,7,37],[6,32,6,35],[8,18,8,19],[11,34,11,35],[12,32,12,33],[6,28,6,31],[7,24,7,25],[9,34,9,35],[9,30,9,31],[6,16,6,19],[9,24,9,25],[9,26,9,27],[12,20,12,21],[12,22,12,23],[9,20,9,21],[9,22,9,23],[8,34,8,35],[7,20,7,21],[7,22,7,23],[7,26,7,27],[12,26,12,27],[12,24,12,25],[15,36,15,37],[0,33,0,34],[18,34,18,35],[18,11,18,15],[11,28,11,29],[10,20,10,21],[16,34,16,35],[14,34,14,35],[9,18,9,19],[10,22,10,23],[11,20,11,21],[14,24,14,25],[14,26,14,27],[12,18,12,19],[10,24,10,25],[10,26,10,27],[14,28,14,29],[14,30,14,31],[13,24,13,25],[14,22,14,23],[10,34,10,35],[12,36,12,37],[11,36,11,37],[11,32,11,33],[14,16,14,17],[15,16,15,17],[13,2,13,3],[13,4,13,5],[13,6,13,7],[13,8,13,9],[9,14,9,15],[15,10,15,11],[15,12,15,13],[15,14,15,15],[11,6,11,7],[11,8,11,9],[12,12,12,13],[12,14,12,15],[13,14,13,15],[90,30,90,35],[62,0,62,31],[61,32,61,35],[55,24,55,25],[64,0,64,4],[63,32,63,35],[55,7,55,10],[57,36,57,37],[61,0,61,31],[67,0,67,4],[67,36,67,37],[66,36,66,37],[65,36,65,37],[63,0,63,31],[66,0,66,4],[65,30,65,35],[66,30,66,35],[65,5,65,12],[65,0,65,4],[65,13,65,29],[64,5,64,12],[64,13,64,29],[63,36,63,37],[64,30,64,35],[18,32,18,33],[27,36,27,37],[40,35,40,37],[68,36,68,37],[16,18,16,19],[95,13,95,29],[93,13,93,29],[70,24,71,37],[74,24,75,37],[73,20,73,23],[76,24,76,26],[94,36,94,37],[93,36,93,37],[95,30,95,35],[94,30,94,35],[93,30,93,35],[95,36,95,37],[72,0,72,19],[72,20,72,23],[73,0,73,19],[74,20,74,23],[71,20,71,23],[90,5,90,12],[79,5,79,12],[33,21,33,35],[35,32,35,34],[35,26,35,31],[34,9,34,37],[38,35,38,37],[37,35,37,37],[36,1,36,8],[36,21,36,25],[15,20,15,21],[35,35,35,37],[28,34,28,35],[33,36,33,37],[19,36,19,37],[17,0,17,37],[16,28,16,29],[15,4,15,5],[16,36,16,37],[15,30,15,31],[15,28,15,29],[18,25,18,26],[16,24,16,25],[16,26,16,27],[20,0,20,37],[23,34,23,35],[35,0,35,8],[15,22,15,23],[15,8,15,9],[15,26,15,27],[6,0,16,1],[15,2,15,3],[9,28,9,29],[16,20,16,21],[13,16,13,17],[13,18,13,19],[13,10,13,11],[13,12,13,13],[12,10,12,11],[11,14,11,15],[11,16,11,17],[8,8,8,9],[8,10,8,11],[9,6,9,7],[8,12,8,13],[10,14,10,15],[10,16,10,17],[8,14,8,15],[10,12,10,13],[8,2,8,3],[3,36,3,37],[4,0,4,37],[7,30,7,31],[8,24,8,25],[8,26,8,27],[8,28,8,29],[8,30,8,31],[10,30,10,31],[11,10,11,11],[9,32,9,33],[6,20,6,23],[6,24,6,27],[7,16,7,17],[7,18,7,19],[9,16,9,17],[8,20,8,21],[8,22,8,23],[9,12,9,13],[6,4,6,7],[8,6,8,7],[9,10,9,11],[9,8,9,9],[10,6,10,7],[11,12,11,13],[7,12,7,13],[6,2,6,3],[11,18,11,19],[11,2,11,3],[11,4,11,5],[12,2,12,3],[10,2,10,3],[7,4,7,5],[8,4,8,5],[10,4,10,5],[7,14,7,15],[6,12,6,15],[6,8,6,11],[7,6,7,7],[7,8,7,9],[7,10,7,11],[8,16,8,17],[12,16,12,17],[9,2,9,3],[9,4,9,5],[12,4,12,5],[12,6,12,7],[12,8,12,9],[97,0,97,33],[97,34,97,35],[89,0,89,35],[14,10,14,11],[14,12,14,13],[14,14,14,15],[14,18,14,19],[45,21,45,25],[15,24,15,25],[37,21,37,25],[30,0,30,35],[19,0,19,35],[39,32,39,34],[16,4,16,5],[16,14,16,15],[39,35,39,37],[40,26,40,31],[15,32,15,33],[15,34,15,35],[18,36,18,37],[18,18,18,24],[15,18,15,19],[14,8,14,9],[16,12,16,13],[70,0,70,19],[70,20,70,23],[77,0,77,19],[42,26,42,31],[94,13,94,29],[16,2,16,3],[42,1,42,8],[16,22,16,23],[40,32,40,34],[94,0,94,4],[69,0,69,37],[77,20,77,23],[89,36,89,37],[83,36,83,37],[84,36,84,37],[88,36,88,37],[91,30,91,35],[84,0,84,35],[85,0,85,35],[68,0,68,35],[64,36,64,37],[16,16,16,17],[72,24,73,37],[16,10,16,11],[38,26,38,31],[37,26,37,31],[18,27,18,31],[16,30,16,31],[39,1,39,8],[41,1,41,8],[41,21,41,25],[26,0,26,33],[21,0,21,35],[28,0,28,33],[22,34,22,35],[22,0,22,33],[34,0,34,8],[18,5,18,10],[18,0,18,4],[16,6,16,7],[16,8,16,9],[16,32,16,33],[31,0,31,37],[18,16,18,17],[35,21,35,25],[21,36,21,37],[32,0,32,37],[23,0,23,33],[99,34,99,35],[106,0,106,4],[105,0,105,4],[104,0,104,4],[106,13,106,29],[103,0,103,35],[105,30,105,35],[104,30,104,35],[104,13,104,29],[105,5,105,12],[101,0,101,33],[104,5,104,12],[76,0,76,19],[76,20,76,23],[94,5,94,12],[71,0,71,19],[78,0,78,23],[75,20,75,23],[87,0,87,35],[92,13,92,29],[91,13,91,29],[92,5,92,12],[91,5,91,12],[86,0,86,35],[77,29,78,37],[79,13,79,29],[79,30,79,35],[74,0,74,19],[90,13,90,29],[77,24,78,26],[75,0,75,19],[77,27,78,28],[93,5,93,12],[79,0,79,4],[92,30,92,35],[90,36,90,37],[112,0,112,37],[111,0,111,35],[111,36,111,37],[105,13,105,29],[106,30,106,35],[92,0,92,4],[105,36,105,37],[104,36,104,37],[101,36,101,37],[96,36,96,37],[96,0,96,35],[93,0,93,4],[92,36,92,37],[95,0,95,4],[106,36,106,37],[106,5,106,12],[108,0,108,4],[108,5,108,12],[108,13,108,29],[108,30,108,35],[108,36,108,37],[95,5,95,12],[99,0,99,33],[101,34,101,35],[50,1,50,6],[58,32,58,35],[59,32,59,35],[60,32,60,35],[62,32,62,35],[48,0,48,37],[49,36,49,37],[62,36,62,37],[53,26,53,37],[58,36,58,37],[56,36,56,37],[59,36,59,37],[60,0,60,31],[54,1,54,6],[55,1,55,6],[61,36,61,37],[60,36,60,37],[58,0,58,31],[110,36,110,37],[38,32,38,34],[37,32,37,34],[36,32,36,34],[97,36,97,37],[103,36,103,37],[99,36,99,37],[79,36,79,37],[80,36,80,37],[81,0,81,37],[82,0,82,35],[83,0,83,35],[90,0,90,4],[88,0,88,35],[82,36,82,37],[85,36,85,37],[86,36,86,37],[87,36,87,37],[91,36,91,37],[98,0,98,37],[42,32,42,34],[42,35,42,37],[67,5,67,12],[66,5,66,12]]}
["Project Selection",null,null,null,null,null,null,null,null,null,null,null,null,null,null,null,null,null,null,null,null,null,"Total Score:",null,null,null,{"$f":"SUM(AK4,AK20,AK31,AK69,AK81,AK97,AK111)","v":0},null,null,"MHP Apps due:",null,null,null,{"$f":"Instructions!A3","v":"2020-03-02"},null,{"$f":"'B - Project Requirements'!AJ1:AL1","v":"2020-01-07"}]
["Development Type ",null,null,null,null,null,null,null,"Project Type ",null,null,null,null,null,null,null,"High or Highest Resource Area",null,null,null,null,null,null,"Rural Status",null,null,null,null,null,null,null,null,"County "]
[{"$f":"'B - Project Requirements'!W4","v":0},null,null,null,null,null,null,null,{"$f":"CONCATENATE('B - Project Requirements'!AP10,'B - Project Requirements'!AP11,'B - Project Requirements'!AP12,'B - Project Requirements'!AP13,'B - Project Requirements'!AP14)","v":""},null,null,null,null,null,null,null,{"$f":"'B - Project Requirements'!AK14","v":0},null,null,null,null,null,null,{"$f":"'D - Max Loan & Unit Mix'!X3:AF3","v":"Not Rural"},null,null,null,null,null,null,null,null,{"$f":"IF('B - Project Requirements'!AI4=\"\",\"\",'B - Project Requirements'!AI4)","v":""}]
["Serving Lowest Income Levels, §7320(b)(1) - 35 points max",null,null,null,null,null,null,null,null,null,null,null,null,null,null,null,null,null,null,null,null,null,null,null,null,null,null,null,null,null,null,null,null,null,null,null,{"$f":"AK6+AK19","v":0}]
["Applications will be scored based on the percentage of Restricted Units limited to various percentages of AMI adjusted by household size and as follows:"]
["(A) Points will be awarded based on the “Lowest Income Point Table” below. 25 points max. ",null,null,null,null,null,null,null,null,null,null,null,null,null,null,null,null,null,null,null,null,null,null,null,null,null,null,null,null,null,null,null,null,null,null,null,{"$f":"MIN(SUM(AK9:AK17),25)","v":0}]
["Red cells:  Points Available to Rural set-aside projects only",null,"% AMI",null,0.55000000000000004,null,null,null,0.5,null,null,null,0.45,null,null,null,0.4,null,null,null,0.35,null,null,null,0.3,null,null,null,0.25,null,null,null,"20% and below",null,null,null,"Total Points"]
[null,null,"% of Units",null,"Points Available ",null,"Points Awarded ",null,"Points Available ",null,"Points Awarded ",null,"Points Available ",null,"Points Awarded ",null,"Points Available ",null,"Points Awarded ",null,"Points Available ",null,"Points Awarded ",null,"Points Available ",null,"Points Awarded ",null,"Points Available ",null,"Points Awarded ",null,"Points Available ",null,"Points Awarded "]
[null,null,0.5,null,5,10,{"$f":"IF(AND('B - Project Requirements'!AK11=\"Yes\",'D - Max Loan & Unit Mix'!$BE$15>=0.5),'E - Project Selection'!E9,\"\")","v":""},null,12.5,25,{"$f":"IF(AND('B - Project Requirements'!AK11=\"Yes\",'D - Max Loan & Unit Mix'!BE16>=0.5),'E - Project Selection'!I9,\"\")","v":""},null,18.75,37.5,{"$f":"IF('D - Max Loan & Unit Mix'!BE17>=0.5,'E - Project Selection'!M9,\"\")","v":""},null,17.5,null,{"$f":"IF('D - Max Loan & Unit Mix'!BE18>=0.5,'E - Project Selection'!Q9,\"\")","v":""},null,18.75,null,{"$f":"IF('D - Max Loan & Unit Mix'!BE19>=0.5,'E - Project Selection'!U9,\"\")","v":""},null,25,null,{"$f":"IF('D - Max Loan & Unit Mix'!BE20>=0.5,'E - Project Selection'!Y9,\"\")","v":""},null,25,null,{"$f":"IF('D - Max Loan & Unit Mix'!BE21>=0.5,'E - Project Selection'!AC9,\"\")","v":""},null,25,null,{"$f":"IF('D - Max Loan & Unit Mix'!BE26>=0.5,'E - Project Selection'!AG9,\"\")","v":""},null,{"$f":"SUM(G9,K9,O9,S9,W9,AA9,AE9,AI9)","v":0}]
[null,null,0.45,null,5,10,{"$f":"IF(AND('B - Project Requirements'!AK11=\"Yes\",'D - Max Loan & Unit Mix'!$BE$15>=0.45,'D - Max Loan & Unit Mix'!$BE$15<0.5),'E - Project Selection'!E10,\"\")","v":""},null,11.25,22.5,{"$f":"IF(AND('B - Project Requirements'!AK11=\"Yes\",'D - Max Loan & Unit Mix'!BE16>=0.45,'D - Max Loan & Unit Mix'!BE16<0.5),'E - Project Selection'!I10,\"\")","v":""},null,16.899999999999999,33.799999999999997,{"$f":"IF(AND('D - Max Loan & Unit Mix'!BE17>=0.45,'D - Max Loan & Unit Mix'!BE17<0.5),'E - Project Selection'!M10,\"\")","v":""},null,17.5,null,{"$f":"IF(AND('D - Max Loan & Unit Mix'!BE18>=0.45,'D - Max Loan & Unit Mix'!BE18<0.5),'E - Project Selection'!Q10,\"\")","v":""},null,18.75,null,{"$f":"IF(AND('D - Max Loan & Unit Mix'!BE19>=0.45,'D - Max Loan & Unit Mix'!BE19<0.5),'E - Project Selection'!U10,\"\")","v":""},null,25,null,{"$f":"IF(AND('D - Max Loan & Unit Mix'!BE20>=0.45,'D - Max Loan & Unit Mix'!BE20<0.5),'E - Project Selection'!Y10,\"\")","v":""},null,25,null,{"$f":"IF(AND('D - Max Loan & Unit Mix'!BE21>=0.45,'D - Max Loan & Unit Mix'!BE21<0.5),'E - Project Selection'!AC10,\"\")","v":""},null,25,null,{"$f":"IF(AND('D - Max Loan & Unit Mix'!$BE$26>=0.45,'D - Max Loan & Unit Mix'!$BE$26<0.5),'E - Project Selection'!AG10,\"\")","v":""},null,0]
[null,null,0.4,null,5,10,{"$f":"IF(AND('B - Project Requirements'!AK11=\"Yes\",'D - Max Loan & Unit Mix'!$BE$15>=0.4,'D - Max Loan & Unit Mix'!$BE$15<0.45),'E - Project Selection'!E11,\"\")","v":""},null,10,20,{"$f":"IF(AND('B - Project Requirements'!AK11=\"Yes\",'D - Max Loan & Unit Mix'!BE16>=0.4,'D - Max Loan & Unit Mix'!BE16<0.45),'E - Project Selection'!I11,IF(AND(OR('B - Project Requirements'!AK11=\"No\",'B - Project Requirements'!AK11=\"\"),'D - Max Loan & Unit Mix'!BE16>=0.4),'E - Project Selection'!I11,\"\"))","v":""},null,15,30,{"$f":"IF(AND('D - Max Loan & Unit Mix'!BE17>=0.4,'D - Max Loan & Unit Mix'!BE17<0.45),'E - Project Selection'!M11,\"\")","v":""},null,17.5,null,{"$f":"IF(AND('D - Max Loan & Unit Mix'!BE18>=0.4,'D - Max Loan & Unit Mix'!BE18<0.45),'E - Project Selection'!Q11,\"\")","v":""},null,18.75,null,{"$f":"IF(AND('D - Max Loan & Unit Mix'!BE19>=0.4,'D - Max Loan & Unit Mix'!BE19<0.55),'E - Project Selection'!U11,\"\")","v":""},null,25,null,{"$f":"IF(AND('D - Max Loan & Unit Mix'!BE20>=0.4,'D - Max Loan & Unit Mix'!BE20<0.45),'E - Project Selection'!Y11,\"\")","v":""},null,25,null,{"$f":"IF(AND('D - Max Loan & Unit Mix'!BE21>=0.4,'D - Max Loan & Unit Mix'!BE21<0.45),'E - Project Selection'!AC11,\"\")","v":""},null,25,null,{"$f":"IF(AND('D - Max Loan & Unit Mix'!$BE$26>=0.4,'D - Max Loan & Unit Mix'!$BE$26<0.45),'E - Project Selection'!AG11,\"\")","v":""},null,0]
[null,null,0.35,null,4.4000000000000004,8.8000000000000007,{"$f":"IF(AND('B - Project Requirements'!AK11=\"Yes\",'D - Max Loan & Unit Mix'!BE15>=0.35,'D - Max Loan & Unit Mix'!BE15<0.4),'E - Project Selection'!E12,\"\")","v":""},null,8.75,17.5,{"$f":"IF(AND('D - Max Loan & Unit Mix'!BE16>=0.35,'D - Max Loan & Unit Mix'!BE16<0.4),'E - Project Selection'!I12,\"\")","v":""},null,13.15,26.3,{"$f":"IF(AND('D - Max Loan & Unit Mix'!BE17>=0.35,'D - Max Loan & Unit Mix'!BE17<0.4),'E - Project Selection'!M12,\"\")","v":""},null,17.5,null,{"$f":"IF(AND('D - Max Loan & Unit Mix'!BE18>=0.35,'D - Max Loan & Unit Mix'!BE18<0.4),'E - Project Selection'!Q12,\"\")","v":""},null,18.75,null,{"$f":"IF(AND('D - Max Loan & Unit Mix'!BE19>=0.35,'D - Max Loan & Unit Mix'!BE19<0.4),'E - Project Selection'!U12,\"\")","v":""},null,25,null,{"$f":"IF(AND('D - Max Loan & Unit Mix'!BE20>=0.35,'D - Max Loan & Unit Mix'!BE20<0.4),'E - Project Selection'!Y12,\"\")","v":""},null,25,null,{"$f":"IF(AND('D - Max Loan & Unit Mix'!BE21>=0.35,'D - Max Loan & Unit Mix'!BE21<0.4),'E - Project Selection'!AC12,\"\")","v":""},null,25,null,{"$f":"IF(AND('D - Max Loan & Unit Mix'!$BE$26>=0.35,'D - Max Loan & Unit Mix'!$BE$26<0.4),'E - Project Selection'!AG12,\"\")","v":""},null,0]
[null,null,0.3,null,3.75,7.5,{"$f":"IF(AND('B - Project Requirements'!AK11=\"Yes\",'D - Max Loan & Unit Mix'!BE15>=0.3,'D - Max Loan & Unit Mix'!BE15<0.35),'E - Project Selection'!E13,\"\")","v":""},null,7.5,15,{"$f":"IF(AND('D - Max Loan & Unit Mix'!BE16>=0.3,'D - Max Loan & Unit Mix'!BE16<0.35),'E - Project Selection'!I13,\"\")","v":""},null,11.25,22.5,{"$f":"IF(AND('D - Max Loan & Unit Mix'!BE17>=0.3,'D - Max Loan & Unit Mix'!BE17<0.35),'E - Project Selection'!M13,\"\")","v":""},null,15,null,{"$f":"IF(AND('D - Max Loan & Unit Mix'!BE18>=0.3,'D - Max Loan & Unit Mix'!BE18<0.35),'E - Project Selection'!Q13,\"\")","v":""},null,18.75,null,{"$f":"IF(AND('D - Max Loan & Unit Mix'!BE19>=0.3,'D - Max Loan & Unit Mix'!BE19<0.35),'E - Project Selection'!U13,\"\")","v":""},null,22.5,null,{"$f":"IF(AND('D - Max Loan & Unit Mix'!BE20>=0.3,'D - Max Loan & Unit Mix'!BE20<0.35),'E - Project Selection'!Y13,\"\")","v":""},null,25,null,{"$f":"IF(AND('D - Max Loan & Unit Mix'!BE21>=0.3,'D - Max Loan & Unit Mix'!BE21<0.35),'E - Project Selection'!AC13,\"\")","v":""},null,25,null,{"$f":"IF(AND('D - Max Loan & Unit Mix'!$BE$26>=0.3,'D - Max Loan & Unit Mix'!$BE$26<0.35),'E - Project Selection'!AG13,\"\")","v":""},null,0]
[null,null,0.25,null,3.15,6.3,{"$f":"IF(AND('B - Project Requirements'!AK11=\"Yes\",'D - Max Loan & Unit Mix'!BE15>=0.25,'D - Max Loan & Unit Mix'!BE15<0.3),'E - Project Selection'!E14,\"\")","v":""},null,6.25,12.5,{"$f":"IF(AND('D - Max Loan & Unit Mix'!BE16>=0.25,'D - Max Loan & Unit Mix'!BE16<0.3),'E - Project Selection'!I14,\"\")","v":""},null,9.4,18.8,{"$f":"IF(AND('D - Max Loan & Unit Mix'!BE17>=0.25,'D - Max Loan & Unit Mix'!BE17<0.3),'E - Project Selection'!M14,\"\")","v":""},null,12.5,null,{"$f":"IF(AND('D - Max Loan & Unit Mix'!BE18>=0.25,'D - Max Loan & Unit Mix'!BE18<0.3),'E - Project Selection'!Q14,\"\")","v":""},null,15.65,null,{"$f":"IF(AND('D - Max Loan & Unit Mix'!BE19>=0.25,'D - Max Loan & Unit Mix'!BE19<0.3),'E - Project Selection'!U14,\"\")","v":""},null,18.75,null,{"$f":"IF(AND('D - Max Loan & Unit Mix'!BE20>=0.25,'D - Max Loan & Unit Mix'!BE20<0.3),'E - Project Selection'!Y14,\"\")","v":""},null,21.9,null,{"$f":"IF(AND('D - Max Loan & Unit Mix'!BE21>=0.25,'D - Max Loan & Unit Mix'!BE21<0.3),'E - Project Selection'!AC14,\"\")","v":""},null,25,null,{"$f":"IF(AND('D - Max Loan & Unit Mix'!$BE$26>=0.25,'D - Max Loan & Unit Mix'!$BE$26<0.3),'E - Project Selection'!AG14,\"\")","v":""},null,0]
[null,null,0.2,null,2.5,5,{"$f":"IF(AND('B - Project Requirements'!AK11=\"Yes\",'D - Max Loan & Unit Mix'!BE15>=0.2,'D - Max Loan & Unit Mix'!BE15<0.25),'E - Project Selection'!E15,\"\")","v":""},null,5,10,{"$f":"IF(AND('D - Max Loan & Unit Mix'!BE16>=0.2,'D - Max Loan & Unit Mix'!BE16<0.25),'E - Project Selection'!I15,\"\")","v":""},null,7.5,15,{"$f":"IF(AND('D - Max Loan & Unit Mix'!BE17>=0.2,'D - Max Loan & Unit Mix'!BE17<0.25),'E - Project Selection'!M15,\"\")","v":""},null,10,null,{"$f":"IF(AND('D - Max Loan & Unit Mix'!BE18>=0.2,'D - Max Loan & Unit Mix'!BE18<0.25),'E - Project Selection'!Q15,\"\")","v":""},null,12.5,null,{"$f":"IF(AND('D - Max Loan & Unit Mix'!BE19>=0.2,'D - Max Loan & Unit Mix'!BE19<0.25),'E - Project Selection'!U15,\"\")","v":""},null,15,null,{"$f":"IF(AND('D - Max Loan & Unit Mix'!BE20>=0.2,'D - Max Loan & Unit Mix'!BE20<0.25),'E - Project Selection'!Y15,\"\")","v":""},null,17.5,null,{"$f":"IF(AND('D - Max Loan & Unit Mix'!BE21>=0.2,'D - Max Loan & Unit Mix'!BE21<0.25),'E - Project Selection'!AC15,\"\")","v":""},null,20,null,{"$f":"IF(AND('D - Max Loan & Unit Mix'!$BE$26>=0.2,'D - Max Loan & Unit Mix'!$BE$26<0.25),'E - Project Selection'!AG15,\"\")","v":""},null,0]
[null,null,0.15,null,1.9,3.8,{"$f":"IF(AND('B - Project Requirements'!AK11=\"Yes\",'D - Max Loan & Unit Mix'!BE15>=0.15,'D - Max Loan & Unit Mix'!BE15<0.2),'E - Project Selection'!E16,\"\")","v":""},null,3.75,7.5,{"$f":"IF(AND('D - Max Loan & Unit Mix'!BE16>=0.15,'D - Max Loan & Unit Mix'!BE16<0.2),'E - Project Selection'!I16,\"\")","v":""},null,5.65,11.3,{"$f":"IF(AND('D - Max Loan & Unit Mix'!BE17>=0.15,'D - Max Loan & Unit Mix'!BE17<0.2),'E - Project Selection'!M16,\"\")","v":""},null,7.5,null,{"$f":"IF(AND('D - Max Loan & Unit Mix'!BE18>=0.15,'D - Max Loan & Unit Mix'!BE18<0.2),'E - Project Selection'!Q16,\"\")","v":""},null,9.4,null,{"$f":"IF(AND('D - Max Loan & Unit Mix'!BE19>=0.15,'D - Max Loan & Unit Mix'!BE19<0.2),'E - Project Selection'!U16,\"\")","v":""},null,11.25,null,{"$f":"IF(AND('D - Max Loan & Unit Mix'!BE20>=0.15,'D - Max Loan & Unit Mix'!BE20<0.2),'E - Project Selection'!Y16,\"\")","v":""},null,13.1,null,{"$f":"IF(AND('D - Max Loan & Unit Mix'!BE21>=0.15,'D - Max Loan & Unit Mix'!BE21<0.2),'E - Project Selection'!AC16,\"\")","v":""},null,15,null,{"$f":"IF(AND('D - Max Loan & Unit Mix'!$BE$26>=0.15,'D - Max Loan & Unit Mix'!$BE$26<0.2),'E - Project Selection'!AG16,\"\")","v":""},null,0]
[null,null,0.1,null,1.25,2.5,{"$f":"IF(AND('B - Project Requirements'!AK11=\"Yes\",'D - Max Loan & Unit Mix'!BE15>=0.1,'D - Max Loan & Unit Mix'!BE15<0.15),'E - Project Selection'!E17,\"\")","v":""},null,2.5,5,{"$f":"IF(AND('D - Max Loan & Unit Mix'!BE16>=0.1,'D - Max Loan & Unit Mix'!BE16<0.15),'E - Project Selection'!I17,\"\")","v":""},null,3.75,7.5,{"$f":"IF(AND('D - Max Loan & Unit Mix'!BE17>=0.1,'D - Max Loan & Unit Mix'!BE17<0.15),'E - Project Selection'!M17,\"\")","v":""},null,5,null,{"$f":"IF(AND('D - Max Loan & Unit Mix'!BE18>=0.1,'D - Max Loan & Unit Mix'!BE18<0.15),'E - Project Selection'!Q17,\"\")","v":""},null,6.25,null,{"$f":"IF(AND('D - Max Loan & Unit Mix'!BE19>=0.1,'D - Max Loan & Unit Mix'!BE19<0.15),'E - Project Selection'!U17,\"\")","v":""},null,7.5,null,{"$f":"IF(AND('D - Max Loan & Unit Mix'!BE20>=0.1,'D - Max Loan & Unit Mix'!BE20<0.15),'E - Project Selection'!Y17,\"\")","v":""},null,8.75,null,{"$f":"IF(AND('D - Max Loan & Unit Mix'!BE21>=0.1,'D - Max Loan & Unit Mix'!BE21<0.15),'E - Project Selection'!AC17,\"\")","v":""},null,10,null,{"$f":"IF(AND('D - Max Loan & Unit Mix'!$BE$26>=0.1,'D - Max Loan & Unit Mix'!$BE$26<0.15),'E - Project Selection'!AG17,\"\")","v":""},null,0]
["(B) 10 Points will be awarded to projects where at least 20 percent of the Restricted Units are restricted as follows:\n   (i) to households with incomes not exceeding 25 percent of AMI, in San Francisco, Santa Clara, San Mateo and Marin Counties; or\n   (ii) to households with incomes not exceeding 30 percent of AMI, in other counties."]
["Project County: ",null,null,null,null,{"$f":"'B - Project Requirements'!AI4","v":0},null,null,null,null,null,"Restricted Units:",null,null,null,null,{"$f":"'D - Max Loan & Unit Mix'!BD25","v":0},null,{"$f":"IF(OR(F19=\"San Francisco\",F19=\"Santa Clara\",F19=\"San Mateo\",F19=\"Marin\"),\"Units at or Below 25% AMI:\",\"Units at or Below 30% AMI:\")","v":"Units at or Below 30% AMI:"},null,null,null,null,null,null,{"$f":"IF(S19=\"Units at or Below 25% AMI:\",SUM('D - Max Loan & Unit Mix'!BD21:BD23),SUM('D - Max Loan & Unit Mix'!BD20:BD23))","v":0},null,"% of Restricted Units:",null,null,null,null,{"$f":"IFERROR((Z19/Q19),0)","v":0},null,"Points:",null,{"$f":"IF(AG19>=0.2,10,0)","v":0}]
["Addressing Most Serious Local Housing Need, §7320(b)(2) - 10 points max",null,null,null,null,null,null,null,null,null,null,null,null,null,null,null,null,null,null,null,null,null,null,null,null,null,null,null,null,null,null,null,null,null,null,null,{"$f":"MIN(SUM(AK22:AL26),10)","v":0}]
["5 points will be awarded for each of the following conditions met by the project: "]
["(A) Location in a “High Resource” or “Highest Resource” area (Large Family new construction projects only) as shown on the TCAC/HCD Opportunity Area Map.",null,null,null,null,null,null,null,null,null,null,null,null,null,null,null,null,null,null,null,null,null,null,null,null,null,null,null,null,null,null,null,null,null,null,null,{"$f":"IFERROR(IF(AND('B - Project Requirements'!AK14=\"yes\",AN105=1),5,0),0)","v":0}]
["(B) Qualifying as both a Senior and a Special Needs Project.",null,null,null,null,null,null,null,null,null,null,null,null,null,null,null,null,null,null,null,null,null,null,null,null,null,null,null,null,null,null,null,null,null,null,null,{"$f":"IF(AI23=\"Yes\",5,0)","v":0}]
["(C) Project will have at least 10 percent of the Restricted Units restricted under the program regulatory agreement for occupancy by homeless households?",null,null,null,null,null,null,null,null,null,null,null,null,null,null,null,null,null,null,null,null,null,null,null,null,null,null,null,null,null,null,null,null,null,null,null,{"$f":"IF(AND(AI25=\"Yes\",AI24=\"Yes\"),5,0)","v":0}]
["(C) Will vacancies be filled by referrals from the local coordinated entry system, when and where this system is actively referring households to housing?"]
["(D) Meeting one or more of the following conditions:",null,null,null,null,null,null,null,null,null,null,null,null,null,null,null,null,null,null,null,null,null,null,null,null,null,null,null,null,null,null,null,null,null,null,null,{"$f":"MAX(AK27:AL29)","v":0}]
["(i) Consisting of the new construction or acquisition and rehabilitation of units not subject to income and rent restrictions at the time of application, unless the restrictions are associated with acquisition financing closed less than five years prior to this date. OR",null,null,null,null,null,null,null,null,null,null,null,null,null,null,null,null,null,null,null,null,null,null,null,null,null,null,null,null,null,null,null,null,null,null,null,{"$f":"IF(AI27=\"Yes\",5,0)","v":0}]
["(ii) The Project qualifies as At High Risk, or involves the conversion of single occupancy units without kitchens and bathrooms to units with kitchens and bathrooms. OR",null,null,null,null,null,null,null,null,null,null,null,null,null,null,null,null,null,null,null,null,null,null,null,null,null,null,null,null,null,null,null,null,null,null,null,{"$f":"IF(AI28=\"Yes\",5,0)","v":0}]
["(iii) The Program loan amount is limited to the amount necessary to reduce rents below existing levels, to create new Restricted Units, or to make accessibility improvements necessary for occupancy by disabled persons.",null,null,null,null,null,null,null,null,null,null,null,null,null,null,null,null,null,null,null,null,null,null,null,null,null,null,null,null,null,null,null,null,null,null,null,{"$f":"IF(AI29=\"Yes\",5,0)","v":0}]
["File Name:",null,null,null,null,{"$f":"Checklist!D100","v":"31. CES Narritive "},null,null,null,null,null,null,null,"Provide a narrative describing how vacancies will be filled by referrals from the local coordinated entry system, when and where this system is actively referring households to housing.",null,null,null,null,null,null,null,null,null,null,null,null,null,null,null,null,"Uploaded to FAAST?"]
["Development and Ownership Experience, §7320(b)(3)(A) - (E) - 20 points max, negative 50 points max",null,null,null,null,null,null,null,null,null,null,null,null,null,null,null,null,null,null,null,null,null,null,null,null,null,null,null,null,null,null,null,null,null,null,null,{"$f":"MIN(MAX((AK34+AK58),(AK50+AK58)),20)","v":0}]
["(A) Applications will be scored based on the number of subsidized Rental Housing Developments (including tax credit Projects) that the Sponsor has completed over the last ten years and whether they have identified performance problems."]
["(B) Primary Scoring Method:",null,null,null,null,null,null,null,null,null,null,null,null,null,null,null,null,null,null,null,null,null,null,null,null,null,null,null,null,null,null,null,null,null,null,null,null,null,{"$f":"DATE(YEAR(AH1)-5,MONTH(AH1),DAY(AH1))","v":"2015-03-02"}]
["Enter the Name of the Entity Qualifying for Experience:",null,null,null,null,null,null,null,null,null,null,null,null,null,null,null,null,null,null,null,null,null,null,null,null,null,null,null,null,null,null,null,null,null,null,null,{"$f":"MIN((AM36+AN36),20)","v":0},null,{"$f":"DATE(YEAR(AH1)-10,MONTH(AH1),DAY(AH1))","v":"2010-03-02"},null,null,"Sponsor"]
["Description of Entity Qualifying for Experience:",null,null,null,null,null,null,null,null,null,null,null,null,null,null,null,null,null,null,null,null,null,null,null,null,null,null,null,null,null,null,null,null,null,null,null,null,null,null,null,null,"Sponsor affiliated entity"]
["Name of Subsidized Rental Housing Dev. (including tax credit Projects)",null,null,null,null,null,null,null,null,"Project Address and City",null,null,null,null,null,null,null,null,"Housing Type",null,null,"Subsidy Source\n(including tax credits)",null,null,null,null,"Had comprehensive development responsibilities",null,null,null,null,null,"Project Units",null,null,"Date completed*",null,null,{"$f":"SUM(AM37:AM46)*4","v":0},{"$f":"SUM(AN37:AN46)*2","v":0},null,"Sponsor principal"]
[1,null,null,null,null,null,null,null,null,null,null,null,null,null,null,null,null,null,null,null,null,null,null,null,null,null,null,null,null,null,null,null,null,null,null,null,null,null,{"$f":"IF(AND('D - Max Loan & Unit Mix'!$E$36<15,'D - Max Loan & Unit Mix'!I8+'D - Max Loan & Unit Mix'!O8>=0.7,AG37>=5,AJ37>=$AM$33,AO37=1),1,IF(AND(AG37>=10,AJ37>=$AM$33,AO37=1),1,0))","v":0},{"$f":"IF(AM37=1,0,IF(AND('D - Max Loan & Unit Mix'!$E$36<15,'D - Max Loan & Unit Mix'!I8+'D - Max Loan & Unit Mix'!O8>=0.7,AG37>=5,AJ37>=$AM$34,AO37=1),1,IF(AND(AG37>=10,AJ37>=$AM$34,AO37=1),1,0)))","v":0},{"$f":"IF(AND(AA37=\"yes\",B37<>\"\"),1,0)","v":0},"Sponsor employee responsible for managing development activities"]
[2,null,null,null,null,null,null,null,null,null,null,null,null,null,null,null,null,null,null,null,null,null,null,null,null,null,null,null,null,null,null,null,null,null,null,null,null,null,{"$f":"IF(AND('D - Max Loan & Unit Mix'!$E$36<15,'D - Max Loan & Unit Mix'!$I$8>=0.7,AG38>=5,AJ38>=$AM$33,AO38=1),1,IF(AND(AG38>=10,AJ38>=$AM$33,AO38=1),1,0))","v":0},{"$f":"IF(AM38=1,0,IF(AND('D - Max Loan & Unit Mix'!$E$36<15,'D - Max Loan & Unit Mix'!$I$8>=0.7,AG38>=5,AJ38>=$AM$34,AO38=1),1,IF(AND(AG38>=10,AJ38>=$AM$34,AO38=1),1,0)))","v":0},0,"Sponsor partner who has a controlling interest in the partnership and a substantial and continued role in the Project's ongoing operations per partnership documents."]
[3,null,null,null,null,null,null,null,null,null,null,null,null,null,null,null,null,null,null,null,null,null,null,null,null,null,null,null,null,null,null,null,null,null,null,null,null,null,{"$f":"IF(AND('D - Max Loan & Unit Mix'!$E$36<15,'D - Max Loan & Unit Mix'!$I$8>=0.7,AG39>=5,AJ39>=$AM$33,AO39=1),1,IF(AND(AG39>=10,AJ39>=$AM$33,AO39=1),1,0))","v":0},{"$f":"IF(AM39=1,0,IF(AND('D - Max Loan & Unit Mix'!$E$36<15,'D - Max Loan & Unit Mix'!$I$8>=0.7,AG39>=5,AJ39>=$AM$34,AO39=1),1,IF(AND(AG39>=10,AJ39>=$AM$34,AO39=1),1,0)))","v":0},0]
[4,null,null,null,null,null,null,null,null,null,null,null,null,null,null,null,null,null,null,null,null,null,null,null,null,null,null,null,null,null,null,null,null,null,null,null,null,null,{"$f":"IF(AND('D - Max Loan & Unit Mix'!$E$36<15,'D - Max Loan & Unit Mix'!$I$8>=0.7,AG40>=5,AJ40>=$AM$33,AO40=1),1,IF(AND(AG40>=10,AJ40>=$AM$33,AO40=1),1,0))","v":0},{"$f":"IF(AM40=1,0,IF(AND('D - Max Loan & Unit Mix'!$E$36<15,'D - Max Loan & Unit Mix'!$I$8>=0.7,AG40>=5,AJ40>=$AM$34,AO40=1),1,IF(AND(AG40>=10,AJ40>=$AM$34,AO40=1),1,0)))","v":0},0]
[5,null,null,null,null,null,null,null,null,null,null,null,null,null,null,null,null,null,null,null,null,null,null,null,null,null,null,null,null,null,null,null,null,null,null,null,null,null,{"$f":"IF(AND('D - Max Loan & Unit Mix'!$E$36<15,'D - Max Loan & Unit Mix'!$I$8>=0.7,AG41>=5,AJ41>=$AM$33,AO41=1),1,IF(AND(AG41>=10,AJ41>=$AM$33,AO41=1),1,0))","v":0},{"$f":"IF(AM41=1,0,IF(AND('D - Max Loan & Unit Mix'!$E$36<15,'D - Max Loan & Unit Mix'!$I$8>=0.7,AG41>=5,AJ41>=$AM$34,AO41=1),1,IF(AND(AG41>=10,AJ41>=$AM$34,AO41=1),1,0)))","v":0},0]
[6,null,null,null,null,null,null,null,null,null,null,null,null,null,null,null,null,null,null,null,null,null,null,null,null,null,null,null,null,null,null,null,null,null,null,null,null,null,{"$f":"IF(AND('D - Max Loan & Unit Mix'!$E$36<15,'D - Max Loan & Unit Mix'!I8+'D - Max Loan & Unit Mix'!O8>=0.7,AG42>=5,AJ42>=$AM$33,AO42=1),1,IF(AND(AG42>=10,AJ42>=$AM$33,AO42=1),1,0))","v":0},{"$f":"IF(AM42=1,0,IF(AND('D - Max Loan & Unit Mix'!$E$36<15,'D - Max Loan & Unit Mix'!I8+'D - Max Loan & Unit Mix'!O8>=0.7,AG42>=5,AJ42>=$AM$34,AO42=1),1,IF(AND(AG42>=10,AJ42>=$AM$34,AO42=1),1,0)))","v":0},0]
[7,null,null,null,null,null,null,null,null,null,null,null,null,null,null,null,null,null,null,null,null,null,null,null,null,null,null,null,null,null,null,null,null,null,null,null,null,null,{"$f":"IF(AND('D - Max Loan & Unit Mix'!$E$36<15,'D - Max Loan & Unit Mix'!$I$8>=0.7,AG43>=5,AJ43>=$AM$33,AO43=1),1,IF(AND(AG43>=10,AJ43>=$AM$33,AO43=1),1,0))","v":0},{"$f":"IF(AM43=1,0,IF(AND('D - Max Loan & Unit Mix'!$E$36<15,'D - Max Loan & Unit Mix'!$I$8>=0.7,AG43>=5,AJ43>=$AM$34,AO43=1),1,IF(AND(AG43>=10,AJ43>=$AM$34,AO43=1),1,0)))","v":0},0]
[8,null,null,null,null,null,null,null,null,null,null,null,null,null,null,null,null,null,null,null,null,null,null,null,null,null,null,null,null,null,null,null,null,null,null,null,null,null,{"$f":"IF(AND('D - Max Loan & Unit Mix'!$E$36<15,'D - Max Loan & Unit Mix'!$I$8>=0.7,AG44>=5,AJ44>=$AM$33,AO44=1),1,IF(AND(AG44>=10,AJ44>=$AM$33,AO44=1),1,0))","v":0},{"$f":"IF(AM44=1,0,IF(AND('D - Max Loan & Unit Mix'!$E$36<15,'D - Max Loan & Unit Mix'!$I$8>=0.7,AG44>=5,AJ44>=$AM$34,AO44=1),1,IF(AND(AG44>=10,AJ44>=$AM$34,AO44=1),1,0)))","v":0},0]
[9,null,null,null,null,null,null,null,null,null,null,null,null,null,null,null,null,null,null,null,null,null,null,null,null,null,null,null,null,null,null,null,null,null,null,null,null,null,{"$f":"IF(AND('D - Max Loan & Unit Mix'!$E$36<15,'D - Max Loan & Unit Mix'!$I$8>=0.7,AG45>=5,AJ45>=$AM$33,AO45=1),1,IF(AND(AG45>=10,AJ45>=$AM$33,AO45=1),1,0))","v":0},{"$f":"IF(AM45=1,0,IF(AND('D - Max Loan & Unit Mix'!$E$36<15,'D - Max Loan & Unit Mix'!$I$8>=0.7,AG45>=5,AJ45>=$AM$34,AO45=1),1,IF(AND(AG45>=10,AJ45>=$AM$34,AO45=1),1,0)))","v":0},0]
[10,null,null,null,null,null,null,null,null,null,null,null,null,null,null,null,null,null,null,null,null,null,null,null,null,null,null,null,null,null,null,null,null,null,null,null,null,null,{"$f":"IF(AND('D - Max Loan & Unit Mix'!$E$36<15,'D - Max Loan & Unit Mix'!$I$8>=0.7,AG46>=5,AJ46>=$AM$33,AO46=1),1,IF(AND(AG46>=10,AJ46>=$AM$33,AO46=1),1,0))","v":0},{"$f":"IF(AM46=1,0,IF(AND('D - Max Loan & Unit Mix'!$E$36<15,'D - Max Loan & Unit Mix'!$I$8>=0.7,AG46>=5,AJ46>=$AM$34,AO46=1),1,IF(AND(AG46>=10,AJ46>=$AM$34,AO46=1),1,0)))","v":0},0]
["(C) To be counted towards experience pursuant to subsection (b)(3), above, completed Projects cited for experience points must contain 10 or more Units, except if the proposed Project contains less than 15 Units and at least 70 percent of the total Units in the proposed Project are reserved for Special Needs Populations, completed Projects submitted for experience points must contain at least five Units."]
["(D) 4 points will be awarded for each Project completed in the five years preceding the application due date, and 2 points will be awarded for each Project completed in the five years preceding that period, up to a maximum of 20 points."]
[{"$f":"IF('D - Max Loan & Unit Mix'!I8+'D - Max Loan & Unit Mix'!O8>=0.7,\"(E) Alternative Scoring - where at least 70% of Project units are reserved for SNP, the Sponsor may elect to have its application scored based on lesser of (i) or (ii) in the chart below - 4 Points Each\",\"(E) Project doesn't qualify for Alternative Scoring Method - SNP Units less than 70% (skip rows 50-57)\")","v":"(E) Project doesn't qualify for Alternative Scoring Method - SNP Units less than 70% (skip rows 50-57)"}]
["Development Experience - Enter the Name of Contracted Developer/Development Consultant:",null,null,null,null,null,null,null,null,null,null,null,null,null,null,null,null,null,null,null,null,null,null,null,null,null,null,null,null,null,null,null,null,null,null,null,{"$f":"MAX(AN51,AP51)","v":0},null,null,"TOTAL ",null,"TOTAL"]
[null,"Name of Subsidized Rental Hsng Dev. (including tax credit Projects)",null,null,null,null,null,"Project Address and City",null,null,null,"Housing Type",null,null,"Subsidy Source\n(including tax credits)",null,null,null,null,"Date completed or ownership began as evidenced below",null,null,null,null," Units",null,"Experience or Ownership Type\n(complete sentence using dropdown if applicable)\n\"Rental Housing Development that the:\"",null,null,null,null,null,null,null,null,null,null,null,"i",{"$f":"IFERROR(IF(AK57=\"Yes\",SUM(AM52:AM56,AN52:AN56),0),0)","v":0},"ii",{"$f":"IFERROR(IF(AK57=\"Yes\",SUM(AO52:AO56,AP52:AP56),0),0)","v":0}]
[1,null,null,null,null,null,null,null,null,null,null,null,null,null,null,null,null,null,null,null,null,null,null,null,null,null,null,null,null,null,null,null,null,null,null,null,null,null,{"$f":"IF(AND(AA52=$AQ$52,T52>=$AM$33,Y52>=10),4,0)","v":0},{"$f":"IF(AM52=4,0,IF(AND(AA52=$AQ$52,T52>=$AM$34,Y52>=10),2,0))","v":0},{"$f":"IF(AND(AA52=$AQ$53,T52>=$AM$33,Y52>=10),4,0)","v":0},{"$f":"IF(AO52=4,0,IF(AND(AA52=$AQ$53,T52>=$AM$34,Y52>=10),4,0))","v":0},"(i) Sponsor’s development consultant or contracted developer has completed in the last 10 years."]
[2,null,null,null,null,null,null,null,null,null,null,null,null,null,null,null,null,null,null,null,null,null,null,null,null,null,null,null,null,null,null,null,null,null,null,null,null,null,{"$f":"IF(AND(AA53=$AQ$52,T53>=$AM$33,Y53>=10),4,0)","v":0},{"$f":"IF(AM53=4,0,IF(AND(AA53=$AQ$52,T53>=$AM$34,Y53>=10),2,0))","v":0},{"$f":"IF(AND(AA53=$AQ$53,T53>=$AM$33,Y53>=10),4,0)","v":0},{"$f":"IF(AO53=4,0,IF(AND(AA53=$AQ$53,T53>=$AM$34,Y53>=10),4,0))","v":0},"(ii) Sponsor, or affiliates or principals of the Sponsor either own or operate under a long-term lease or other arrangement that involves all responsibilities commensurate with ownership."]
[3,null,null,null,null,null,null,null,null,null,null,null,null,null,null,null,null,null,null,null,null,null,null,null,null,null,null,null,null,null,null,null,null,null,null,null,null,null,{"$f":"IF(AND(AA54=$AQ$52,T54>=$AM$33,Y54>=10),4,0)","v":0},{"$f":"IF(AM54=4,0,IF(AND(AA54=$AQ$52,T54>=$AM$34,Y54>=10),2,0))","v":0},{"$f":"IF(AND(AA54=$AQ$53,T54>=$AM$33,Y54>=10),4,0)","v":0},{"$f":"IF(AO54=4,0,IF(AND(AA54=$AQ$53,T54>=$AM$34,Y54>=10),4,0))","v":0}]
[4,null,null,null,null,null,null,null,null,null,null,null,null,null,null,null,null,null,null,null,null,null,null,null,null,null,null,null,null,null,null,null,null,null,null,null,null,null,{"$f":"IF(AND(AA55=$AQ$52,T55>=$AM$33,Y55>=10),4,0)","v":0},{"$f":"IF(AM55=4,0,IF(AND(AA55=$AQ$52,T55>=$AM$34,Y55>=10),2,0))","v":0},{"$f":"IF(AND(AA55=$AQ$53,T55>=$AM$33,Y55>=10),4,0)","v":0},{"$f":"IF(AO55=4,0,IF(AND(AA55=$AQ$53,T55>=$AM$34,Y55>=10),4,0))","v":0}]
[5,null,null,null,null,null,null,null,null,null,null,null,null,null,null,null,null,null,null,null,null,null,null,null,null,null,null,null,null,null,null,null,null,null,null,null,null,null,{"$f":"IF(AND(AA56=$AQ$52,T56>=$AM$33,Y56>=10),4,0)","v":0},{"$f":"IF(AM56=4,0,IF(AND(AA56=$AQ$52,T56>=$AM$34,Y56>=10),2,0))","v":0},{"$f":"IF(AND(AA56=$AQ$53,T56>=$AM$33,Y56>=10),4,0)","v":0},{"$f":"IF(AO56=4,0,IF(AND(AA56=$AQ$53,T56>=$AM$34,Y56>=10),4,0))","v":0}]
["To qualify for scoring under this alternative, the Sponsor must contract with the developer or development consultant for comprehensive development services, including financial packaging, selection of other consultants, selection of the construction contractor and property management agent, oversight of architectural design, construction management, and other major aspects of the development process. Does the Sponsor meet these requirements?"]
["(F) 5 points will be deducted for each occurrence or event in the following categories, with a maximum deduction of 10 points per category and a maximum total deduction of 50 points. Select number of occurrences. ",null,null,null,null,null,null,null,null,null,null,null,null,null,null,null,null,null,null,null,null,null,null,null,null,null,null,null,null,null,null,null,null,null,null,null,{"$f":"MAX(SUM(AK59:AL64),-50)","v":0},null,null,"(Select One)"]
["(i) removal or withdrawal under threat of removal as general partner as a consequence of failing to comply with contractual obligations;",null,null,null,null,null,null,null,null,null,null,null,null,null,null,null,null,null,null,null,null,null,null,null,null,null,null,null,null,null,null,null,"(Select One)",null,null,null,{"$f":"IF(AG59=$AN$59,-5,IF(AG59=$AN$60,-10,0))","v":0},null,null,"One Occurrence "]
["(ii) failure to submit, when due, compliance documentation required under the Department program;",null,null,null,null,null,null,null,null,null,null,null,null,null,null,null,null,null,null,null,null,null,null,null,null,null,null,null,null,null,null,null,"(Select One)",null,null,null,0,null,null,"Two or More Occurrences "]
["(iii) use of reserve funds for Department-assisted projects in a manner contrary to program requirements, or failure to deposit reserve funds as required by the Department;",null,null,null,null,null,null,null,null,null,null,null,null,null,null,null,null,null,null,null,null,null,null,null,null,null,null,null,null,null,null,null,"(Select One)",null,null,null,0,null,null,"No Occurrence"]
["(iv) failure to provide promised supportive services to a Special Needs Population or other tenants of a publicly funded project without just cause;",null,null,null,null,null,null,null,null,null,null,null,null,null,null,null,null,null,null,null,null,null,null,null,null,null,null,null,null,null,null,null,"(Select One)",null,null,null,0,null,null,"Not Applicable "]
["(v) failure to restrict occupancy of units to a Special Needs population or other target population as required by a Department program or regulatory agreement for any publicly-assisted project;",null,null,null,null,null,null,null,null,null,null,null,null,null,null,null,null,null,null,null,null,null,null,null,null,null,null,null,null,null,null,null,"(Select One)",null,null,null,0]
["(vi) other significant violations of the requirements of Department programs or of the programs of other public agencies, such as the failure to adequately maintain a project or the books and records thereof.",null,null,null,null,null,null,null,null,null,null,null,null,null,null,null,null,null,null,null,null,null,null,null,null,null,null,null,null,null,null,null,"(Select One)",null,null,null,0]
["File Name:",null,null,null,null,{"$f":"Checklist!D98","v":"29. Spon Comp1, Spon Comp2, Spon Comp3, etc…"},null,null,null,null,null,null,null,"Document with Notice of Completion, Placed in Service, Certificate of Occupancy or equivalent.",null,null,null,null,null,null,null,null,null,null,null,null,null,null,null,null,"Uploaded to FAAST?"]
["File Name:",null,null,null,null,{"$f":"Checklist!D99","v":"30. Dev Comp1, Dev Comp2, Dev Comp3, etc…"},null,null,null,null,null,null,null,"Development Services Agreement setting forth the responsibilities of the developer, including, but not limited to, financial packaging, selection of other consultants, selection of the construction contractor and property management agent, oversight of architectural design, construction management, and other major aspects of the development process.",null,null,null,null,null,null,null,null,null,null,null,null,null,null,null,null,"Uploaded to FAAST?"]
["File Name:",null,null,null,null,{"$f":"Checklist!D102","v":"32a. Dev Cont1, Dev Cont2, Dev Cont3, etc…"},null,null,null,null,null,null,null,"Document with Notice of Completion, Placed in Service, Certificate of Occupancy or equivalent.",null,null,null,null,null,null,null,null,null,null,null,null,null,null,null,null,"Uploaded to FAAST?"]
["File Name:",null,null,null,null,{"$f":"Checklist!D103","v":"32b. SPOwn Comp1, SPOwn Comp2, SPOwn Comp3, etc…"},null,null,null,null,null,null,null,"Narrative description of Sponsor Ownership/Managing Experience to document operation experience for each project listed above.",null,null,null,null,null,null,null,null,null,null,null,null,null,null,null,null,"Uploaded to FAAST?"]
[" Leverage of Other Funds, §7320(b)(4) – 20 points max",null,null,null,null,null,null,null,null,null,null,null,null,null,null,null,null,null,null,null,null,null,null,null,null,null,null,null,null,null,null,null,null,null,null,null,{"$f":"IF(AB78<0,0,MIN(AB78,20))","v":0},null,null,{"$f":"IF(Y78>=0.75,MIN(AB78,20),IF(Y78>=0.35,MIN(AB78*0.5,20),0))","v":{"$error":"#DIV/0!"}}]
["(A) Applications will be scored based on the leverage of other funds, meaning the amount of funds other than MHP funds to be used for permanent funding of the development costs attributable to the Restricted Units as a percentage of the requested amount of MHP funds. DO NOT INCLUDE GP EQUITY. "]
["a. Total residential development cost (Max Loan & Unit Mix worksheet, cell AJ52)",null,null,null,null,null,null,null,null,null,null,null,null,null,null,null,null,null,null,null,{"$f":"'D - Max Loan & Unit Mix'!AJ52","v":0}]
["b. Less: Deferred Developer Fee (UA Perm S&U worksheet) §7320(b)(4)(B)"]
["c. Less: Land donations where value not established by current appraisal §7320(b)(4)(B)",null,null,null,null,null,null,null,null,null,null,null,null,null,null,null,null,null,null,null,null,null,null,null,"<= Attach land appraisal if including a land donation in leverage calc"]
["d. Eligible residential development costs (a - b -c)",null,null,null,null,null,null,null,null,null,null,null,null,null,null,null,null,null,null,null,{"$f":"+U71-U72-U73","v":0}]
["e. % of Total Development Cost attributed to Restricted Units (Max Loan & Unit Mix worksheet, cell AJ55)",null,null,null,null,null,null,null,null,null,null,null,null,null,null,null,null,null,null,null,{"$f":"'D - Max Loan & Unit Mix'!AJ55","v":0},null,null,null,null,null,null,null,null,null,null,null,null,null,null,null,null,null,null,null,"% Above","Less %","Rounded to nearest %","Full 5% above ","Points"]
["f. Funding Attributable to Restricted Units (d * e)",null,null,null,null,null,null,null,null,null,null,null,null,null,null,null,null,null,null,null,{"$f":"U74*U75","v":0},null,null,null,null,null,null,null,null,null,null,null,null,null,null,null,null,null,null,{"$f":"$Y$77","v":0},0.5,{"$f":"AN76-AO76","v":-0.5},{"$f":"FLOOR(AP76,0.05)","v":-0.5},{"$f":"AQ76/0.05","v":-10},{"$f":"AR76*2","v":-20},"C","<=2 point for Full 5% point increments above 50% - §7320(b)(4)(C ) ",null,{"$f":"MIN(IF(AND(OR('B - Project Requirements'!AG15=\"High Resource\",'B - Project Requirements'!AG15=\"Highest Resource\"),'E - Project Selection'!AN105=1),'E - Project Selection'!AS76,0),20)","v":0}]
["g. Less: MHP loan amount (Max Loan & Unit Mix worksheet, cell AF74)",null,null,null,null,null,null,null,null,null,null,null,null,null,null,null,null,null,null,null,{"$f":"'D - Max Loan & Unit Mix'!AJ63","v":0},null,null,null,{"$f":"IF(U77=0,0,U78/U77)","v":0},null,null,"<=Other dev funds as a % of MHP funds (h / g)",null,null,null,null,null,null,null,null,null,null,null,{"$f":"$Y$77","v":0},0.5,{"$f":"AN77-AO77","v":-0.5},{"$f":"FLOOR(AP77,0.05)","v":-0.5},{"$f":"AQ77/0.05","v":-10},{"$f":"AR77*AS83","v":{"$error":"#DIV/0!"}},"D","<=Points awarded in accordance to §7320(b)(4)(D) ",null,{"$f":"MIN(IF(AND('D - Max Loan & Unit Mix'!K36+'D - Max Loan & Unit Mix'!Q36>0.01,'E - Project Selection'!AW76=0),'E - Project Selection'!AS77,0),20)","v":0}]
["h. Other Development Funds (Non-HCD) Attributable to Restricted Units (f - g)",null,null,null,null,null,null,null,null,null,null,null,null,null,null,null,null,null,null,null,{"$f":"U76-U77","v":0},null,null,null,{"$f":"SUM('D - Max Loan & Unit Mix'!K36+'D - Max Loan & Unit Mix'!Q36)/'D - Max Loan & Unit Mix'!E36","v":{"$error":"#DIV/0!"}},null,null,{"$f":"IFERROR(SUM(AW76:AW78),0)","v":0},null,{"$f":"INDEX(AU76:AU78,MATCH(AB78,AW76:AW78,0),0)","v":"<=2 point for Full 5% point increments above 50% - §7320(b)(4)(C ) "},null,null,null,null,null,null,null,null,null,{"$f":"$Y$77","v":0},0.5,{"$f":"AN78-AO78","v":-0.5},{"$f":"FLOOR(AP78,0.05)","v":-0.5},{"$f":"AQ78/0.05","v":-10},{"$f":"AR78","v":-10},"E","<=1 Point for Full 5% point increments above 50% - §7320(b)(4)(E)",null,{"$f":"IF(AND(AW77=0,AW76=0,AS78>0),AS78,0)","v":0}]
["i. Percentage of project units that are Supportive Housing units (Max Loan & Unit Mix worksheet, cell K36 + K36/E36)",null,null,null,null,null,null,null,null,null,null,null,null,null,null,null,null,null,null,null,null,null,null,null,null,null,null,null,null,null,null,null,null,null,null,null,null,null,null,null,null,null,null,null,"D"]
["File Name:",null,null,null,null,{"$f":"Checklist!D106","v":"33. Appraisal"},null,null,null,null,null,null,null,"All applicants claiming a Land Value in the development budget must submit an appraisal report, conducted within the last 2 years, to substantiate the land value. ",null,null,null,null,null,null,null,null,null,null,null,null,null,null,null,null,"Uploaded to FAAST?",null,null,null,null,null,null,null,null,null,null,null,null,null,{"$f":"100*('D - Max Loan & Unit Mix'!K36+'D - Max Loan & Unit Mix'!Q36)/'D - Max Loan & Unit Mix'!W36","v":{"$error":"#DIV/0!"}},"% SH Restricted / Total Restricted"]
["§7320(b)(5) Project Readiness - 15 Points Max",null,null,null,null,null,null,null,null,null,null,null,null,null,null,null,null,null,null,null,null,null,null,null,null,null,null,null,null,null,null,null,null,null,null,null,{"$f":"MIN(SUM(AK83:AL85,AK89:AL90),15)","v":0},null,null,null,null,null,null,null,{"$f":"100-'E - Project Selection'!AS80","v":{"$error":"#DIV/0!"}},"NonSH Restricted % of Total Restricted"]
["Points will be awarded to Projects for each circumstance below as documented. If a particular category is not applicable, full points shall be awarded in that category.",null,null,null,null,null,null,null,null,null,null,null,null,null,null,null,null,null,null,null,null,null,null,null,null,null,null,null,null,null,null,null,null,null,null,null,null,null,null,null,null,null,null,null,{"$f":"AS80*2","v":{"$error":"#DIV/0!"}},"% SH above multiplied by 2"]
["(A) Obtaining enforceable commitments for all construction financing, not including tax-exempt bonds, tax credits, and funding to be provided by another Department program awarded prior to final rating and ranking for the MHP application. 4 points ",null,null,null,null,null,null,null,null,null,null,null,null,null,null,null,null,null,null,null,null,null,null,null,null,null,null,null,null,null,null,null,null,null,null,null,null,null,null,null,null,null,null,null,{"$f":"ROUND((AS81+AS82)/100,1)","v":{"$error":"#DIV/0!"}},"Points per 5 % increment"]
["(B) Adoption or certification of all necessary environmental reviews (California Environmental Quality Act and National Environmental Policy Act). 4 points"]
["(C) Land Use Approvals",null,null,null,null,null,null,null,null,null,null,null,null,null,null,null,null,null,null,null,null,null,null,null,null,null,null,null,null,null,null,null,null,null,null,null,{"$f":"MAX(AK86:AL88)","v":0}]
["(i) Obtaining all necessary land use approvals or entitlements necessary prior to issuance of a building permit, including any required discretionary approvals, such as site plan review or design review. 3 points"]
["(ii) Submission of a complete application to the relevant local authorities for land use approval under a nondiscretionary local approval process, where the application has been either approved or disapproved. 2 points"]
["(iii) Letter signed by a planner certified by the American Institute of Certified Planners indicting that, in their opinion, the project meets all the requirements for approval under a nondiscretionary local approval process, where an application has not been approved or disapproved by the local authorities. 1 point"]
["(D) Obtaining commitments for all deferred-payment financing, grants and subsidies, excluding tax credits, and in accordance with TCAC requirements and with the same exceptions as allowed by TCAC. Deferred-payment financing, grant funds and subsidies from other Department programs proposed for project financing must be awarded prior to final rating and ranking for the MHP application. 4 points"]
["(E) 5 points will be subtracted if Project is utilizing 4 percent low-income housing tax credits that will be part of an application to TCAC seeking hybrid tiebreaker incentives."]
["File Name:",null,null,null,null,{"$f":"Checklist!D116","v":"43. Const EFC #1, #2, etc"},null,null,null,null,null,null,null,"Commitment letter or other evidence documenting construction financing commitments.",null,null,null,null,null,null,null,null,null,null,null,null,null,null,null,null,"Uploaded to FAAST?"]
["File Name:",null,null,null,null,{"$f":"Checklist!D113","v":"40. Local Approvals"},null,null,null,null,null,null,null,"CEQA clearance issued by the local jurisdiction, and NEPA Authority issued by the Responsible Entity and all necessary and discretionary public land use approvals except building permits and other ministerial approvals.(Local Jurisdiction and NEPA Responsible Entity Verification of Project Readiness.)",null,null,null,null,null,null,null,null,null,null,null,null,null,null,null,null,"Uploaded to FAAST?"]
["File Name:",null,null,null,null,{"$f":"Checklist!D108&\" & \" &Checklist!D109","v":"35. Phase I & 36. Phase II"},null,null,null,null,null,null,null,"Phase I Report, and Phase II Report if required by the Phase I.",null,null,null,null,null,null,null,null,null,null,null,null,null,null,null,null,"Uploaded to FAAST?"]
["File Name:",null,null,null,null,{"$f":"Checklist!D72","v":"16. Preliminary Title Report"},null,null,null,null,null,null,null,"Provide Preliminary Title Report.",null,null,null,null,null,null,null,null,null,null,null,null,null,null,null,null,"Uploaded to FAAST?"]
["File Name:",null,null,null,null,{"$f":"Checklist!D71","v":"15. Site Control"},null,null,null,null,null,null,null,"Provide documentation of the form of site control selected above per UMR §8303.",null,null,null,null,null,null,null,null,null,null,null,null,null,null,null,null,"Uploaded to FAAST?"]
["File Name:",null,null,null,null,{"$f":"Checklist!D117","v":"44. Perm EFC #1, #2, etc"},null,null,null,null,null,null,null,"Commitment letter or other evidence documenting deferred payment perm financing commitments.",null,null,null,null,null,null,null,null,null,null,null,null,null,null,null,null,"Uploaded to FAAST?"]
["Adaptive Reuse / Infill / Proximity to Amenities, §7320(b)(6) - 15 Points Max",null,null,null,null,null,null,null,null,null,null,null,null,null,null,null,null,null,null,null,null,null,null,null,null,null,null,null,null,null,null,null,null,null,null,null,{"$f":"MIN(SUM(AK98,AK100,AK102,AK104),15)","v":0}]
["(A) Infill development.  Is Project an infill development including adaptive reuse of vacant or underutilized commercial or industrial building located in a developed area served with public infrastructure? Select option below that is applicable to the site. 5 Points",null,null,null,null,null,null,null,null,null,null,null,null,null,null,null,null,null,null,null,null,null,null,null,null,null,null,null,null,null,null,null,null,null,null,null,{"$f":"IF(AND(A99>\"\",AI98=\"Yes\"),5,0)","v":0},null,null,"(i)(a) At least 75 percent of the site was previously improved (including areas where improvements have been demolished) or used for any use other than open space, agriculture, forestry, or mining waste storage."]
[null,null,null,null,null,null,null,null,null,null,null,null,null,null,null,null,null,null,null,null,null,null,null,null,null,null,null,null,null,null,null,null,null,null,null,null,null,null,null,"(i)(b) At least 75 percent of the perimeter of the site’s adjoining parcels that are developed with Urban Uses (residential, commercial, industrial, public institutional, transit or transportation passenger facility use, or retail use, or any combination of those uses, but not including lands used for agricultural uses or parcels in excess of 15,000 square feet in size and containing only one single family residence, or is separated from parcels that are developed with Urban Uses only by an improved public right-of-way. In calculating this percentage, perimeters bordering navigable bodies of water and improved parks shall not be included."]
["(B) Proximity to amenities.  Will Project receive the maximum point score available for site amenities under TCAC Regulation §10325(c)(4)(A)? (TCAC  maximum point score is 15 Points) 5 Points",null,null,null,null,null,null,null,null,null,null,null,null,null,null,null,null,null,null,null,null,null,null,null,null,null,null,null,null,null,null,null,null,null,null,null,{"$f":"IF(AI100=\"Yes\",5,0)","v":0},null,null,"(i)(c) The combination of at least 50 percent of site area as previously improved (including areas where improvements have been demolished) or used for any use other than open space, agriculture, forestry or mining waste storage, and at least 50 percent of the perimeter of the site adjoining parcels that are developed with Urban Uses, or is separated from parcels that are developed with Urban Uses only by an improved public right-of-way. In calculating this percentage, perimeters bordering navigable bodies of water and improved parks shall not be included. and (ii) Developed at average residential Net Densities on the parcels to be developed that are equal to or greater than the densities described in Subparagraph (B) of Paragraph (3) of Subdivision (c) of Section 65583.2 of the Government Code, except that in a Rural Area the average residential Net Densities on the parcels to be developed shall be at least 10 units per acre. "]
["Describe how you achieved the maximum point score available for site amenities under TCAC Regulation §10325:"]
["(C) Sustainable building methods. Would Project would receive the maximum possible score for using sustainable building methods under the TCAC Regulation, §10325(c)(5) or successor regulation?  (TCAC maximum is 5 points) 5 Points ",null,null,null,null,null,null,null,null,null,null,null,null,null,null,null,null,null,null,null,null,null,null,null,null,null,null,null,null,null,null,null,null,null,null,null,{"$f":"IF(AI102=\"Yes\",5,0)","v":0}]
["Describe how you achieved the maximum point score available for using sustainable building methods under TCAC Regulation §10325:"]
["(D) Large Family new construction projects located in “High Resource” or “Highest Resource” areas, as shown on the TCAC/HCD Opportunity Area Map, will receive 5 Points plus 5 Points for meeting each of the conditions described in HCD Scoring subsections (B) and (C) above, up to a maximum of 15 Points.",null,null,null,null,null,null,null,null,null,null,null,null,null,null,null,null,null,null,null,null,null,null,null,null,null,null,null,null,null,null,null,null,null,null,null,{"$f":"IF(AND(AN105=1,AO105=1),5,0)","v":0},null,null,"Large Family New Construction ","High or Highest Resource "]
["File Name:",null,null,null,null,{"$f":"Checklist!D118","v":"45. Adaptive Reuse Narrative"},null,null,null,null,null,null,null,"Narrative describing Project and area in which Project will be built; must confirm Project will consist of the rehab of a vacant or underused commercial or industrial building(s). Structures such as residential hotels that are currently used for housing will not be considered to be eligible in meeting the adaptive reuse criteria. Narrative must confirm Project site is located within a developed area served with public infrastructure.",null,null,null,null,null,null,null,null,null,null,null,null,null,null,null,null,"Uploaded to FAAST?",null,null,null,null,null,null,null,null,{"$f":"IF(AND('D - Max Loan & Unit Mix'!AK38>=0.25,'D - Max Loan & Unit Mix'!AK39>=0.5,'B - Project Requirements'!W4=\"New Construction\",'B - Project Requirements'!AO10=TRUE),1,0)","v":0},{"$f":"IF('B - Project Requirements'!AK14=\"yes\",1,0)","v":0}]
["File Name:",null,null,null,null,{"$f":"Checklist!D119","v":"46. Scaled Distance Map"},null,null,null,null,null,null,null,"Attach a scaled distance map and a list of amenities that correspond to Project Area Map, including the area within at least one mile of Project. ",null,null,null,null,null,null,null,null,null,null,null,null,null,null,null,null,"Uploaded to FAAST?"]
["File Name:",null,null,null,null,{"$f":"Checklist!D120","v":"47. Amenities List"},null,null,null,null,null,null,null,"List of amenities and TCAC score for each one near project. Include name, address, and distance from the project. ",null,null,null,null,null,null,null,null,null,null,null,null,null,null,null,null,"Uploaded to FAAST?"]
["File Name:",null,null,null,null,{"$f":"Checklist!D121","v":"48. Sustainable Methods"},null,null,null,null,null,null,null,"Provide supporting documentation of sustainable building methods, which can include Energy Scorecard, TCAC Application section signed by Architect, or letter from Architect confirming energy efficient methods to be used.",null,null,null,null,null,null,null,null,null,null,null,null,null,null,null,null,"Uploaded to FAAST?"]
["File Name:",null,null,null,null,{"$f":"Checklist!D122","v":"49. Compliance and Verification"},null,null,null,null,null,null,null,"Documentation consistent with TCAC §10325(c)(5)(G).",null,null,null,null,null,null,null,null,null,null,null,null,null,null,null,null,"Uploaded to FAAST?"]
["Bonus Point "]
["Has Sponsor(s) submitted complete Borrower organizational documents as requested in the Supplemental Application? 1 bonus point",null,null,null,null,null,null,null,null,null,null,null,null,null,null,null,null,null,null,null,null,null,null,null,null,null,null,null,null,null,null,null,null,null,null,null,{"$f":"IF(AI111=\"Yes\",1,0)","v":0}]
["Tiebreaker Score ",null,null,null,null,null,null,null,null,null,null,null,null,null,null,null,null,null,null,null,null,null,null,null,null,null,null,null,null,null,null,null,null,null,null,null,{"$f":"IFERROR(('D - Max Loan & Unit Mix'!BG25/'D - Max Loan & Unit Mix'!BD25),0)","v":0}]
["In the event of tied point scores, the Department shall rank tied applications based on the lowest weighted average affordability of Restricted Units, which shall be computed as follows:\n(A) Multiplying each income limit applicable to the Project by the number of Units restricted at that income level.\n(B) Adding the products calculated pursuant to the previous subsection.\n(C) Dividing the sum calculated pursuant to the previous subsection by the number of Restricted Units in the Project."]

{"sheet":"F - Certification & Legal","index":12,"n_rows":39,"n_cols":37,"rows_kept":39,"cut":false,"hidden":false,"merged":[[3,0,3,37],[0,0,0,34],[0,35,0,37],[4,0,4,37],[1,0,1,37],[2,0,2,37],[11,0,11,8],[11,10,11,18],[11,20,11,33],[5,0,5,37],[6,0,6,37],[7,0,7,37],[8,0,8,37],[10,0,10,8],[10,10,10,18],[10,20,10,33],[10,35,10,37],[9,0,9,37],[12,0,12,37],[13,0,13,37],[14,0,14,37],[15,0,15,37],[16,0,16,37],[25,0,25,35],[17,0,17,37],[18,0,18,37],[19,0,19,37],[20,0,20,37],[38,0,38,8],[38,10,38,18],[38,20,38,33],[34,0,34,37],[37,0,37,8],[37,10,37,18],[37,20,37,33],[37,35,37,37],[35,30,35,35],[35,36,35,37],[36,0,36,37],[35,0,35,4],[35,13,35,29],[35,5,35,12],[29,0,29,35],[21,36,21,37],[21,0,21,35],[22,0,22,35],[23,0,23,35],[24,0,24,35],[29,36,29,37],[28,36,28,37],[27,36,27,37],[28,0,28,35],[27,0,27,35],[26,0,26,37],[25,36,25,37],[24,36,24,37],[23,36,23,37],[22,36,22,37],[33,0,33,35],[33,36,33,37],[32,0,32,35],[31,0,31,35],[30,0,30,35],[32,36,32,37],[31,36,31,37],[30,36,30,37]]}
["Certification & Legal Status",null,null,null,null,null,null,null,null,null,null,null,null,null,null,null,null,null,null,null,null,null,null,null,null,null,null,null,null,null,null,null,null,null,null,{"$f":"'B - Project Requirements'!AJ1:AL1","v":"2020-01-07"}]
["On behalf of the entity identified in the signature block below, I certify that:"]
["1. The information, statements and attachments included in this application are, to the best of my knowledge and belief, true and correct."]
["2. I possess the legal authority to submit this application on behalf of the entity identified in the signature block."]
["3. The following is a complete disclosure of all identities of interest - of all persons or entities, including affiliates, that will provide goods or services to the Project either (a) in one or more capacity or (b) that qualify as a \"Related Party\" to any person or entity that will provide goods or services to the project. \"Related Party\" is defined in Section 10302 of the California Code of Regulations (CTCAC Regulations): "]
[]
["4. As of the date of application, the Project, or the real property on which the Project is proposed (Property) is not part to or the subject of any claim or action at the State or Federal appellate level."]
["5. I have disclosed and described below any claim or action undertaken which affects or potentially affects the feasibility of the Project."]
["In addition, I acknowledge that all information in this application and attachments is public, and may be disclosed by the State."]
[]
["     "]
["Printed Name",null,null,null,null,null,null,null,null,null,"Title of Signatory",null,null,null,null,null,null,null,null,null,"Signature (wet signature is required)",null,null,null,null,null,null,null,null,null,null,null,null,null,null,null,"Date"]
["Legal Disclosure"]
["For purposes of the following questions, and with the exceptions noted below, the term “applicant” shall include the applicant and joint applicant, and any subsidiary of the applicant or joint applicant if the subsidiary is involved in (for example, as a guarantor) or will be benefited by the application or the project. "]
["In addition to each of these entities themselves, the term “applicant” shall also include the direct and indirect holders of more than ten percent (10%) of the ownership interests in the entity, as well as the officers, directors, principals and senior executives of the entity if the entity is a corporation, the general and limited partners of the entity if the entity is a partnership, and the members or managers of the entity if the entity is a limited liability company. For projects using tax-exempt bonds, it shall also include the individual who will be executing the bond purchase agreement."]
["The following questions must be responded to for each entity and person qualifying as an \"applicant,\" or \"joint applicant\" as defined above.  "]
["Explain all positive responses on a separate sheet and include with this questionnaire in the application."]
["Exceptions:"]
["Public entity applicants without an ownership interest in the proposed project, including but not limited to cities, counties, and joint powers authorities with 100 or more members, are not required to respond to this questionnaire. "]
["Members of the boards of directors of non-profit corporations, including officers of the boards, are also not required to respond. However, chief executive officers (Executive Directors, Chief Executive Officers, Presidents or their equivalent) must respond, as must chief financial officers (Treasurers, Chief Financial Officers, or their equivalent)."]
["Civil Matters"]
["1. Has the applicant filed a bankruptcy or receivership case or had a bankruptcy or receivership action commenced against it, defaulted on a loan or been foreclosed against in past ten years? "]
["2. Is the applicant currently a party to, or been notified that it may become a party to, any civil litigation that may materially and adversely affect (a) the financial condition of the applicant’s business, or (b) the project that is the subject of the application?"]
["3. Have there been any administrative or civil settlements, decisions, or judgments against the applicant within the past ten years that materially and adversely affected (a) the financial condition of the applicant’s business, or (b) the project that is the subject of the application?"]
["4. Is the applicant currently subject to, or been notified that it may become subject to, any civil or administrative proceeding, examination, or investigation by a local, state or federal licensing or accreditation agency, a local, state or federal taxing authority, or a local, state or federal regulatory or enforcement agency? "]
["5. In the past ten years, has the applicant been subject to any civil or administrative proceeding, examination, or investigation by a local, state or federal licensing or accreditation agency, a local, state or federal taxing authority, or a local, state or federal regulatory or enforcement agency that resulted in a settlement, decision, or judgment? "]
["Criminal Matters"]
["6. Is the applicant currently a party to, or the subject of, or been notified that it may become a party to or the subject of, any criminal litigation, proceeding, charge, complaint, examination or investigation, of any kind, involving, or that could result in, felony charges against the applicant? "]
["7. Is the applicant currently a party to, or the subject of, or been notified that it may become a party to or the subject of, any criminal litigation, proceeding, charge, complaint, examination or investigation, of any kind, involving, or that could result in, misdemeanor charges against the applicant for matters relating to the conduct of the applicant’s business? "]
["8. Is the applicant currently a party to, or the subject of, or been notified that it may become a party to or the subject of, any criminal litigation, proceeding, charge, complaint, examination or investigation, of any kind, involving, or that could result in, criminal charges (whether felony or misdemeanor) against the applicant for any financial or fraud related crime? "]
["9. Is the applicant currently a party to, or the subject of, or been notified that it may become a party to or the subject of, any criminal litigation, proceeding, charge, complaint, examination or investigation, of any kind, that could materially affect the financial condition of the applicant’s business?"]
["10. Within the past ten years, has the applicant been convicted of any felony? "]
["11. Within the past ten years, has the applicant been convicted of any misdemeanor related to the conduct of the applicant’s business?  "]
["12. Within the past ten years, has the applicant been convicted of any misdemeanor for any financial or fraud related crime? "]
["Please provide a letter of explanation if you responded \"Yes\" to any of the questions above."]
["File Name:",null,null,null,null,"F-1 Cert. Letter of Explanation",null,null,null,null,null,null,null,"'Letter of explanation for any \"red\" shaded cells above. ",null,null,null,null,null,null,null,null,null,null,null,null,null,null,null,null,"Hard Copy and on USB?"]
[]
["     "]
["Printed Name",null,null,null,null,null,null,null,null,null,"Title of Signatory",null,null,null,null,null,null,null,null,null,"Signature (wet signature is required)",null,null,null,null,null,null,null,null,null,null,null,null,null,null,null,"Date"]

{"sheet":"Sponsor Org Docs","index":13,"n_rows":27,"n_cols":36,"rows_kept":27,"cut":false,"hidden":false,"merged":[[3,0,3,37],[8,0,8,37],[7,0,7,37],[6,0,6,37],[5,0,5,37],[4,0,4,37],[0,0,0,34],[0,35,0,37],[22,0,22,37],[17,0,17,37],[21,0,21,37],[20,0,20,37],[19,0,19,37],[18,0,18,37],[16,0,16,37],[2,0,2,37],[1,0,1,37],[15,0,15,37],[12,0,12,37],[11,0,11,37],[10,0,10,37],[9,0,9,37],[14,0,14,37],[13,0,13,37],[26,0,26,37],[25,0,25,37],[24,0,24,37],[23,0,23,37]]}
["Sponsor Organizational Documents",null,null,null,null,null,null,null,null,null,null,null,null,null,null,null,null,null,null,null,null,null,null,null,null,null,null,null,null,null,null,null,null,null,null,{"$f":"'B - Project Requirements'!AJ1:AL1","v":"2020-01-07"}]
["Resolutions***"]
["1. Entity Name (identity of the contracting party or borrower) and Entity Type (corporation, non-profit, for-profit, LLC, etc….)."]
["2. Name & Title of Signatory(ies)****                                                                                                                                                                                                                \nNOTE: Name and title of authorized signatory(ies) is preferred. In instances pertaining to municipalities/jurisdictions/transit agencies (when title is acceptable), supporting documentation evidencing the individual who currently holds the position must be provided."]
["3. NOFA Date."]
["4. Language authorizing Signatory(ies) to sign Standard Agreement."]
["5. Amendment Provision included. "]
["6. Aggregate dollar amount (should be equal to or greater than the requested/award amount), Loan Amount, and each to be listed individually."]
["7. Person attesting validity of resolution (must be someone other than person authorized to sign Standard Agreement)."]
["8. The meeting date authorizing resolution."]
["9. All votes taken at meeting authorizing resolution (ayes, no's, absent, vacant)."]
["10. Project name as it appears on MHP application."]
["* The General Partner and Limited Partner who are members of the Limited Partnership will also need to submit applicable organizational documents based on the type of entity they are. "]
["** Organizational documents for the manager of the LLC if an entity other than an individual."]
["*** These are minimum requirements for a resolution. Updates can be requested once a review is completed. "]
["**** Ensure when identifying the Signatory(ies), if more than one is listed, that \"and\" or \"or\" is defined for individuals required to sign. "]
["Organizational Documents"]
["The following is intended as a brief summary of legal documents commonly required to verify the legal authority of the private entity or entities applying to HCD for an award of funds.  The following does not apply to public applicants.   Additionally, the documents required to apply for funds are legally distinct from those required to enter into a contract for award.  The lists below only address documentation necessary for the application phase of the award process.  If your application is successful, then additional corporate formation and authorization documentation will be required."]
["The resolution templates below are intended to be samples.  Applicants may use their own format as long as it contains ALL of the authorizations contained in the template.\n▪ The person attesting to the signing of the resolution cannot be the same person authorized to execute the documents in the name of the applicant.\n▪ If more than one authorized signatory is identified in the resolution, specifically state whether both signatories are required (i.e. x and y) or only one signatory (i.e. x or y) is required to submit and execute the SHMHP Program documents.\n▪ If the application is being signed by a designee of the authorized signatory, the applicant must also submit a designee letter or other proof of signing authority."]
["The Sponsor shall submit an organizational chart depicting the entity structure control of the Project."]
["Articles of Incorporation (Corp. Code §154, 200 and 202) as certified by the CA Secretary of State.\nBylaws and any amendments thereto (Corp. Code §207(b), 211 and 212)\nCertificate of Amendment of Articles of Incorporation (Corp. Code §900-910 (general stock), §5810-5820 (public benefit and religious corporations), §7810-7820 (mutual benefit corporations), or §12500-12510 (general cooperative corporations)) as applicable.\nRestated Articles of Incorporation (Corp. Code §901, 906, 910 (general stock), §5811, 5815, 5819 (public benefit and religious corporations), §7811, 7815 and 7819 (mutual benefit corporations) and §12501, 12506 and 12510 (general cooperative corporations)) as applicable.\nStatement of Information (CA Secretary of State form SI-100 or SI-200)\nShareholder Agreements (Corp. Code §186) if applicable.\nCertificate of Good Standing certified by Secretary of State."]
["Any other CA Secretary of State filings applicable to revivals, conversions or mergers."]
["Articles of Organization (CA Secretary of State form LLC-1)\nCertificate of Amendment (CA Secretary of State form LLC-2) if applicable.\nRestated Articles of Organization (CA Secretary of State form LLC-10) if applicable.\nCertificate of Correction (CA Secretary of State form LLC-11) if applicable.\nStatement of Information (CA Secretary of State form LLC-12 or LLC-12NC)\nOperating Agreement (Corp. Code §17707.02(s) and 17701.10.)\nCertificate of Good Standing certified by Secretary of State. Certificate of Good Standing must be dated 30 days or less from the application due date."]
["Any other CA Secretary of State filings applicable to revivals, conversions or mergers."]
["Although potentially eligible to apply as the Sponsor, limited partnerships very rarely qualify to be a Sponsor because they lack sufficient historical development experience.  Instead, limited partnerships that are Sponsor-controlled-subsidiaries may be named as the actual borrower in the SHMHP loan documents if the UMR \"Sponsor\" subsidiary control requirements are met.  The following documents are necessary to establish whether the UMR subsidiary control requirements are met.\nCertificate of Limited Partnership (CA Secretary of State form LP-1)\nAmendment to Certificate of Limited Partnership (CA Secretary of State form LP-2) if applicable.\nCertificate of Correction (CA Secretary of State form LP-2) if applicable.\nLimited Partnership Agreement (CA Corp. Code §15901.02(x) and 15901.10)\nCertificate of Good Standing certified by Secretary of State."]
["Any other CA Secretary of State filings applicable to revivals, conversions or mergers."]
["Specific Authorizations- in addition to the general corporate authority established by the foregoing documentation, HCD also needs to verify that each applicant has sufficient specific corporate authority to apply for an SHMHP award under this NOFA.  Usually this is done by the Sponsor providing a valid (as determined by the California Corporations Code) resolution establishing the following:  (1) that the Sponsor entity has specific authority to apply for a specific amount of funds under this NOFA for the purposes of providing a restricted affordable housing development; (2) the resolution must indicate by both name and position who has authority to sign documents on behalf of the Sponsor; and (3) The resolution must indicate that the Sponsor is authorized and willing to execute any and all documents necessary to effectuate the award and its purposes.  The foregoing is a brief paraphrase of the required language and it should not be used in your documentation.  Please consult legal counsel to ensure sufficiency of your entity’s resolutions.  One or more of the above sample resolutions may be used if appropriate to your particular corporate structure."]

{"sheet":"Application Support","index":14,"n_rows":31,"n_cols":42,"rows_kept":31,"cut":false,"hidden":false,"merged":[[30,29,30,31],[30,32,30,34],[30,35,30,37],[30,0,30,1],[30,2,30,4],[30,5,30,8],[30,9,30,14],[30,15,30,16],[30,17,30,28],[29,0,29,1],[29,2,29,4],[29,5,29,8],[29,9,29,14],[29,15,29,16],[29,17,29,28],[29,29,29,31],[29,32,29,34],[29,35,29,37],[28,0,28,1],[28,2,28,4],[28,5,28,8],[28,9,28,14],[28,15,28,16],[28,17,28,28],[28,29,28,31],[28,32,28,34],[28,35,28,37],[26,29,26,31],[26,32,26,34],[26,35,26,37],[27,0,27,1],[27,2,27,4],[27,5,27,8],[27,9,27,14],[27,15,27,16],[27,17,27,28],[27,29,27,31],[26,0,26,1],[26,2,26,4],[26,5,26,8],[26,9,26,14],[26,15,26,16],[26,17,26,28],[27,32,27,34],[27,35,27,37],[25,0,25,1],[25,2,25,4],[25,5,25,8],[25,9,25,14],[25,15,25,16],[25,17,25,28],[25,29,25,31],[25,32,25,34],[25,35,25,37],[24,0,24,1],[24,2,24,4],[24,5,24,8],[24,9,24,14],[24,15,24,16],[24,17,24,28],[24,29,24,31],[24,32,24,34],[24,35,24,37],[22,29,22,31],[22,32,22,34],[22,35,22,37],[23,0,23,1],[23,2,23,4],[23,5,23,8],[23,9,23,14],[23,15,23,16],[23,17,23,28],[23,29,23,31],[22,0,22,1],[22,2,22,4],[22,5,22,8],[22,9,22,14],[22,15,22,16],[22,17,22,28],[23,32,23,34],[23,35,23,37],[21,0,21,1],[21,2,21,4],[21,5,21,8],[21,9,21,14],[21,15,21,16],[21,17,21,28],[21,29,21,31],[21,32,21,34],[21,35,21,37],[20,0,20,1],[20,2,20,4],[20,5,20,8],[20,9,20,14],[20,15,20,16],[20,17,20,28],[20,29,20,31],[20,32,20,34],[20,35,20,37],[18,29,18,31],[18,32,18,34],[18,35,18,37],[19,0,19,1],[19,2,19,4],[19,5,19,8],[19,9,19,14],[19,15,19,16],[19,17,19,28],[19,29,19,31],[18,0,18,1],[18,2,18,4],[18,5,18,8],[18,9,18,14],[18,15,18,16],[18,17,18,28],[19,32,19,34],[19,35,19,37],[17,0,17,1],[17,2,17,4],[17,5,17,8],[17,9,17,14],[17,15,17,16],[17,17,17,28],[17,29,17,31],[17,32,17,34],[17,35,17,37],[16,0,16,1],[16,2,16,4],[16,5,16,8],[16,9,16,14],[16,15,16,16],[16,17,16,28],[16,29,16,31],[16,32,16,34],[16,35,16,37],[14,29,14,31],[14,32,14,34],[14,35,14,37],[15,0,15,1],[15,2,15,4],[15,5,15,8],[15,9,15,14],[15,15,15,16],[15,17,15,28],[15,29,15,31],[14,0,14,1],[14,2,14,4],[14,5,14,8],[14,9,14,14],[14,15,14,16],[14,17,14,28],[15,32,15,34],[15,35,15,37],[13,0,13,1],[13,2,13,4],[13,5,13,8],[13,9,13,14],[13,15,13,16],[13,17,13,28],[13,29,13,31],[13,32,13,34],[13,35,13,37],[12,0,12,1],[12,2,12,4],[12,5,12,8],[12,9,12,14],[12,15,12,16],[12,17,12,28],[12,29,12,31],[12,32,12,34],[12,35,12,37],[10,29,10,31],[10,32,10,34],[10,35,10,37],[11,0,11,1],[11,2,11,4],[11,5,11,8],[11,9,11,14],[11,15,11,16],[11,17,11,28],[11,29,11,31],[10,0,10,1],[10,2,10,4],[10,5,10,8],[10,9,10,14],[10,15,10,16],[10,17,10,28],[11,32,11,34],[11,35,11,37],[9,0,9,1],[9,2,9,4],[9,5,9,8],[9,9,9,14],[9,15,9,16],[9,17,9,28],[9,29,9,31],[9,32,9,34],[9,35,9,37],[8,0,8,1],[8,2,8,4],[8,5,8,8],[8,9,8,14],[8,15,8,16],[8,17,8,28],[8,29,8,31],[8,32,8,34],[8,35,8,37],[6,29,6,31],[6,32,6,34],[6,35,6,37],[7,0,7,1],[7,2,7,4],[7,5,7,8],[7,9,7,14],[7,15,7,16],[7,17,7,28],[7,29,7,31],[6,0,6,1],[6,2,6,4],[6,5,6,8],[6,9,6,14],[6,15,6,16],[6,17,6,28],[7,32,7,34],[7,35,7,37],[4,0,4,37],[5,0,5,1],[5,2,5,4],[5,5,5,8],[5,9,5,14],[5,15,5,16],[5,17,5,28],[5,29,5,31],[5,32,5,34],[5,35,5,37],[0,35,0,37],[0,0,0,34],[3,0,3,3],[3,4,3,14],[3,15,3,16],[3,17,3,27],[3,28,3,31],[3,32,3,37],[1,0,1,37],[2,0,2,2],[2,3,2,21],[2,22,2,25],[2,26,2,29],[2,30,2,33],[2,34,2,37]]}
["Application Development Team (ADT) Support Form",null,null,null,null,null,null,null,null,null,null,null,null,null,null,null,null,null,null,null,null,null,null,null,null,null,null,null,null,null,null,null,null,null,null,{"$f":"'B - Project Requirements'!AJ1","v":"2020-01-07"}]
["Please complete the \"yellow\" cells in the form below and email a copy to: AppSupport@hcd.ca.gov. A member of the Application Development Team will respond to your request within ASAP. "]
["Full Name:",null,null,null,null,null,null,null,null,null,null,null,null,null,null,null,null,null,null,null,null,null,"Date Requested:",null,null,null,null,null,null,null,"Application Version Date:"]
["Organization:",null,null,null,null,null,null,null,null,null,null,null,null,null,null,"Email:",null,null,null,null,null,null,null,null,null,null,null,null,"Contact Phone:"]
["Justification:"]
["Issue #",null,"Program Name & Round",null,null,"Tab",null,null,null,"Section",null,null,null,null,null,"Cell#",null,"Update/Comment",null,null,null,null,null,null,null,null,null,null,null,"Urgency ",null,null,"ADT Status",null,null,"Status Date",null,null,"Requestor","Email","Phone","App Version"]
[1,null,null,null,null,null,null,null,null,null,null,null,null,null,null,null,null,null,null,null,null,null,null,null,null,null,null,null,null,null,null,null,null,null,null,null,null,null,{"$f":"IF(C7=\"\",\"\",$D$3)","v":""},{"$f":"IF(C7=\"\",\"\",$R$4)","v":""},{"$f":"IF(C7=\"\",\"\",$AG$4)","v":""},{"$f":"IF(C7=\"\",\"\",$AI$3)","v":""}]
[2,null,null,null,null,null,null,null,null,null,null,null,null,null,null,null,null,null,null,null,null,null,null,null,null,null,null,null,null,null,null,null,null,null,null,null,null,null,"","",{"$f":"IF(C8=\"\",\"\",$AG$4)","v":""},{"$f":"IF(C8=\"\",\"\",$AI$3)","v":""}]
[3,null,null,null,null,null,null,null,null,null,null,null,null,null,null,null,null,null,null,null,null,null,null,null,null,null,null,null,null,null,null,null,null,null,null,null,null,null,"","",{"$f":"IF(C9=\"\",\"\",$AG$4)","v":""},{"$f":"IF(C9=\"\",\"\",$AI$3)","v":""}]
[4,null,null,null,null,null,null,null,null,null,null,null,null,null,null,null,null,null,null,null,null,null,null,null,null,null,null,null,null,null,null,null,null,null,null,null,null,null,"","",{"$f":"IF(C10=\"\",\"\",$AG$4)","v":""},{"$f":"IF(C10=\"\",\"\",$AI$3)","v":""}]
[5,null,null,null,null,null,null,null,null,null,null,null,null,null,null,null,null,null,null,null,null,null,null,null,null,null,null,null,null,null,null,null,null,null,null,null,null,null,"","",{"$f":"IF(C11=\"\",\"\",$AG$4)","v":""},{"$f":"IF(C11=\"\",\"\",$AI$3)","v":""}]
[6,null,null,null,null,null,null,null,null,null,null,null,null,null,null,null,null,null,null,null,null,null,null,null,null,null,null,null,null,null,null,null,null,null,null,null,null,null,"","","",""]
[7,null,null,null,null,null,null,null,null,null,null,null,null,null,null,null,null,null,null,null,null,null,null,null,null,null,null,null,null,null,null,null,null,null,null,null,null,null,"","","",""]
[8,null,null,null,null,null,null,null,null,null,null,null,null,null,null,null,null,null,null,null,null,null,null,null,null,null,null,null,null,null,null,null,null,null,null,null,null,null,"","","",""]
[9,null,null,null,null,null,null,null,null,null,null,null,null,null,null,null,null,null,null,null,null,null,null,null,null,null,null,null,null,null,null,null,null,null,null,null,null,null,"","","",""]
[10,null,null,null,null,null,null,null,null,null,null,null,null,null,null,null,null,null,null,null,null,null,null,null,null,null,null,null,null,null,null,null,null,null,null,null,null,null,"","","",""]
[11,null,null,null,null,null,null,null,null,null,null,null,null,null,null,null,null,null,null,null,null,null,null,null,null,null,null,null,null,null,null,null,null,null,null,null,null,null,"","","",""]
[12,null,null,null,null,null,null,null,null,null,null,null,null,null,null,null,null,null,null,null,null,null,null,null,null,null,null,null,null,null,null,null,null,null,null,null,null,null,"","","",""]
[13,null,null,null,null,null,null,null,null,null,null,null,null,null,null,null,null,null,null,null,null,null,null,null,null,null,null,null,null,null,null,null,null,null,null,null,null,null,"","","",""]
[14,null,null,null,null,null,null,null,null,null,null,null,null,null,null,null,null,null,null,null,null,null,null,null,null,null,null,null,null,null,null,null,null,null,null,null,null,null,"","","",""]
[15,null,null,null,null,null,null,null,null,null,null,null,null,null,null,null,null,null,null,null,null,null,null,null,null,null,null,null,null,null,null,null,null,null,null,null,null,null,"","","",""]
[16,null,null,null,null,null,null,null,null,null,null,null,null,null,null,null,null,null,null,null,null,null,null,null,null,null,null,null,null,null,null,null,null,null,null,null,null,null,"","","",""]
[17,null,null,null,null,null,null,null,null,null,null,null,null,null,null,null,null,null,null,null,null,null,null,null,null,null,null,null,null,null,null,null,null,null,null,null,null,null,"","","",""]
[18,null,null,null,null,null,null,null,null,null,null,null,null,null,null,null,null,null,null,null,null,null,null,null,null,null,null,null,null,null,null,null,null,null,null,null,null,null,"","","",""]
[19,null,null,null,null,null,null,null,null,null,null,null,null,null,null,null,null,null,null,null,null,null,null,null,null,null,null,null,null,null,null,null,null,null,null,null,null,null,"","","",""]
[20,null,null,null,null,null,null,null,null,null,null,null,null,null,null,null,null,null,null,null,null,null,null,null,null,null,null,null,null,null,null,null,null,null,null,null,null,null,"","","",""]
[21,null,null,null,null,null,null,null,null,null,null,null,null,null,null,null,null,null,null,null,null,null,null,null,null,null,null,null,null,null,null,null,null,null,null,null,null,null,"","","",""]
[22,null,null,null,null,null,null,null,null,null,null,null,null,null,null,null,null,null,null,null,null,null,null,null,null,null,null,null,null,null,null,null,null,null,null,null,null,null,"","","",""]
[23,null,null,null,null,null,null,null,null,null,null,null,null,null,null,null,null,null,null,null,null,null,null,null,null,null,null,null,null,null,null,null,null,null,null,null,null,null,"","","",""]
[24,null,null,null,null,null,null,null,null,null,null,null,null,null,null,null,null,null,null,null,null,null,null,null,null,null,null,null,null,null,null,null,null,null,null,null,null,null,"","","",""]
[25,null,null,null,null,null,null,null,null,null,null,null,null,null,null,null,null,null,null,null,null,null,null,null,null,null,null,null,null,null,null,null,null,null,null,null,null,null,"","","",""]

{"sheet":"Mapping","index":15,"n_rows":3,"n_cols":178,"rows_kept":3,"cut":false,"hidden":true,"merged":[[0,0,0,133],[0,134,0,143],[0,144,0,177]]}
["B - Project Requirements",null,null,null,null,null,null,null,null,null,null,null,null,null,null,null,null,null,null,null,null,null,null,null,null,null,null,null,null,null,null,null,null,null,null,null,null,null,null,null,null,null,null,null,null,null,null,null,null,null,null,null,null,null,null,null,null,null,null,null,null,null,null,null,null,null,null,null,null,null,null,null,null,null,null,null,null,null,null,null,null,null,null,null,null,null,null,null,null,null,null,null,null,null,null,null,null,null,null,null,null,null,null,null,null,null,null,null,null,null,null,null,null,null,null,null,null,null,null,null,null,null,null,null,null,null,null,null,null,null,null,null,null,null,"D- Max Loan & Unit Mix",null,null,null,null,null,null,null,null,null,"E- ProjectSelection"]
["Project_Name","(a)Project Development_Type","Project_County","Project_Address","Project_City","Project_Zip","Assessor_Parcel_Numbers_(APNs)","No_9%_Tax_Credits","Project_Type(s)_Large_Family","Project_Type(s)_Special_Needs","Project_Type(s)_Senior","Project_type(s)_Supportive Housing","Project_type(s)_At_High_Risk","Rural_Area","Rural_Area_Methodology","TCAC_HCD_Opportunity_Status","TCAC_HCD_Opportunity_Tract_ID#","(a)Sponsor_#1_ Entity_ Name","Sponsor1_Eligible_Sponsor_Type","Sponsor1_(b)Organization_Type","Sponsor1_Address","Sponsor1_City","Sponsor1_State","Sponsor1_Zip","Sponsor1_Auth_Rep_Name","Sponsor1_Auth_Rep_Title","Sponsor1_Auth_Rep_Email","Sponsor1_Auth_Rep_Phone","Sponsor1_Contact_Name","Sponsor1_Contact_Title ","Sponsor1_Contact_Email","Sponsor1_Contact_Phone","Sponsor1_Contact_Adress ","Sponsor1_Contact_City ","Sponsor1_Contact_State","Sponsor1_Contact_Zip","(a)Sponsor_#2_ Entity_ Name","Sponsor_#2_Eligible_Sponsor_Type","Sponsor_#2_Organization_Type","Sponsor_#2_Address","Sponsor_#2_City","Sponsor_#2_State","Sponsor_#2_Zip","Sponsor_#2_Auth_Rep_Name","Sponsor_#2_Auth_Rep_Title","Sponsor_#2_Auth_Rep_Email","Sponsor_#2_Auth_Rep_Phone","Sponsor_#2_Contact_Name","Sponsor_#2_Contact_Title ","Sponsor_#2_Contact_Email","Sponsor_#2_Contact_Phone","Sponsor_#2_Contact_Adress ","Sponsor_#2_Contact_City ","Sponsor_#2_Contact_State","Sponsor_#2_Contact_Zip","(Owner/Borrower_Entity)_Legal_Name","(Owner/Borrower_Entity)_Address","(Owner/Borrower_Entity)_City","(Owner/Borrower_Entity)_State","(Owner/Borrower_Entity)_Zip","(Owner/Borrower_Entity)_Auth_Rep_Name","(Owner/Borrower_Entity)_Auth_Rep_Title","(Owner/Borrower_Entity)_Auth_Rep_Email","(Owner/Borrower_Entity)_Auth_Rep_Phone","(Owner/Borrower_Entity)_Contact_Name","(Owner/Borrower_Entity)_Contact_Title","(Owner/Borrower_Entity)_Contact_Email","(Owner/Borrower_Entity)_Contact_Phone ","(Owner/Borrower_Entity)_Contact_Address","(Owner/Borrower_Entity)_Contact_City","(Owner/Borrower_Entity)_Contact_State ","(Owner/Borrower_Entity)_Contact_Zip","(Managing_General_Partner)_Legal_Name","(Managing_General_Partner)_Organization_Type","(Managing_General_Partner)_Address","(Managing_General_Partner)_City ","(Managing_General_Partner)_State ","(Managing_General_Partner)_Zip","(Managing_General_Partner)_Auth_Rep_Name","(Managing_General_Partner)_Auth_Rep_Title","(Managing_General_Partner)_Auth_Rep_Email","(Managing_General_Partner)_Auth_Rep_Phone ","(Managing_General_Partner)_Contact_Name","(Managing_General_Partner)_Contact_Title","(Managing_General_Partner)_Contact_Email","(Managing_General_Partner)_Contact_Phone","(Managing_General_Partner)_Contact_Address","(Managing_General_Partner)_Contact_City","(Managing_General_Partner)_Contact_Sate ","(Managing_General_Partner)_Contact_Zip","(Administrative General Partner #1) Legal Name","(AGP #1) Organization_Type","(AGP #1) Address","(AGP #1)City ","(AGP #1)State ","(AGP #1)Zip","(AGP #1)Auth_Rep_Name","(AGP #1)Auth_Rep_Title","(AGP #1)Auth_Rep_Email","(AGP #1)Auth_Rep_Phone ","(AGP #1)Contact Name","(AGP #1)Contact_Title","(AGP #1)Contact_Email","(AGP #1)Contact_Phone","(AGP #1)Contact_Address","(AGP #1)Contact_City","(AGP #1)Contact_State ","(AGP #1)Contact_Zip","(Administrative_General_Partner_#2)_Legal_Name","(AGP#2)Organization_Type","(AGP#2)Address","(AGP#2)City ","(AGP#2)State ","(AGP#2)Zip","(AGP#2) Auth_Rep_Name","(AGP#2)Auth_Rep_Title","(AGP#2)Authorized_Rep_Email","(AGP#2)Auth_Rep_Phone ","(AGP#2)Auth_Rep_Contact Name","(AGP#2)Auth_Rep_Title","(AGP#2)_Contact_Email","(AGP#2)_Contact_Phone","(AGP#2)_Contact_Address","(AGP#2)_Contact_City","(AGP#2)_Contact_Sate ","(AGP#2)_Contact_Zip","Does_Project_trigger_State_Relocation","Will_Project_be_a_TCAC_Hybrid_project","Is_project_free_from_severe_adverse_environmental_conditions","Will-Require-Demolition","#_of_bdrms_in_demolished_structures","#_of_bdrms_in_new_project","Form_of_site_control","Is_project_a_scattered_site_housing_project","High_or_Highest_Resource_Area ","Rural_Status","Total_Units","Total_MHP_Asssisted_Units","Total_Special_Needs","Total_Supp._Housing","Total_Other_Restricted","Are_any_units_in_this_project_required_to_be_constructed_as_a_condition_of_approval_of _one_or_more_market_rate_developments","MHP_Unit_loan_amount","Sponsor_Loan_amount_Request","Total_Self_Score","Restricted _Units","Units_At_or_below_30%_AMI","%_of_Restricted_Units","Serving_Lowest_Income_Levels_Points","Addressing_most_serious_local_housing_need_Total_Points","(A) Location in a High Resource or Highest Resource Area","(B) Qualifying as both Senior and Special needs","(C) Vacancies filled with the CES system","(D) meeting one of the following","I consisting of the new const or acquisition","ii project qualifies as high risk","iii program loan amount is limited to the amount necessary to reduce rents","Development and Ownership Experience Points max","Primary scoring method","Secondary Scoring Method_Development_Experience","(F)Point Deductions Max","I","II","III","IV","V","VI"," Leverage_of_Other_Funds Max Points","%_of_project_units_that_are_SH_Units","Project_Readiness_Points_Max","Land_Use_approvals","Adaptive Reuse /Infill/Proximity_to_Amenities_Max_points","Infill_Development","Proximity_to_amenities","Sustainable_Building_methods","Large_family_new_construction_located_in_high_highest_Resource","Bonus_point_complete_org_docs","Tiebreaker_Score "]
[{"$f":"'B - Project Requirements'!E4","v":0},{"$f":"'B - Project Requirements'!W4","v":0},{"$f":"'B - Project Requirements'!AI4","v":0},{"$f":"'B - Project Requirements'!F5","v":0},{"$f":"'B - Project Requirements'!W5","v":0},{"$f":"'B - Project Requirements'!AH5","v":0},{"$f":"IF('B - Project Requirements'!AO10=TRUE,\"Yes\",\"N/A\")","v":"N/A"},{"$f":"IF('B - Project Requirements'!AO11=TRUE,\"Yes\",\"N/A\")","v":"N/A"},{"$f":"IF('B - Project Requirements'!AO12=TRUE,\"Yes\",\"N/A\")","v":"N/A"},{"$f":"IF('B - Project Requirements'!AO13=TRUE,\"Yes\",\"N/A\")","v":"N/A"},{"$f":"IF('B - Project Requirements'!AO14=TRUE,\"Yes\",\"N/A\")","v":"N/A"},{"$f":"'B - Project Requirements'!AK17","v":0},{"$f":"'B - Project Requirements'!AK19","v":0},{"$f":"'B - Project Requirements'!AK20","v":0},{"$f":"'B - Project Requirements'!AK22","v":0},{"$f":"'B - Project Requirements'!AK23","v":0},{"$f":"'B - Project Requirements'!AK24","v":0},{"$f":"'B - Project Requirements'!AK25","v":0},{"$f":"'B - Project Requirements'!AK26","v":0},{"$f":"'B - Project Requirements'!O34","v":0},{"$f":"'B - Project Requirements'!L35","v":0},{"$f":"'B - Project Requirements'!AI35","v":0},{"$f":"'B - Project Requirements'!C36","v":0},{"$f":"'B - Project Requirements'!W36","v":0},{"$f":"'B - Project Requirements'!AE36","v":0},{"$f":"'B - Project Requirements'!AI36","v":0},{"$f":"'B - Project Requirements'!E37","v":0},{"$f":"'B - Project Requirements'!O37","v":0},{"$f":"'B - Project Requirements'!Z37","v":0},{"$f":"'B - Project Requirements'!AI37","v":0},{"$f":"'B - Project Requirements'!E38","v":0},{"$f":"'B - Project Requirements'!O38","v":0},{"$f":"'B - Project Requirements'!X38","v":0},{"$f":"'B - Project Requirements'!AH38","v":0},{"$f":"'B - Project Requirements'!C39","v":0},{"$f":"'B - Project Requirements'!W39","v":0},{"$f":"'B - Project Requirements'!AE39","v":0},{"$f":"'B - Project Requirements'!AI39","v":0},{"$f":"'B - Project Requirements'!O49","v":0},{"$f":"'B - Project Requirements'!L50","v":0},{"$f":"'B - Project Requirements'!AI50","v":0},{"$f":"'B - Project Requirements'!C51","v":0},{"$f":"'B - Project Requirements'!W51","v":0},{"$f":"'B - Project Requirements'!AE51","v":0},{"$f":"'B - Project Requirements'!AI51","v":0},{"$f":"'B - Project Requirements'!E52","v":0},{"$f":"'B - Project Requirements'!O52","v":0},{"$f":"'B - Project Requirements'!Z52","v":0},{"$f":"'B - Project Requirements'!AI52","v":0},{"$f":"'B - Project Requirements'!E53","v":0},{"$f":"'B - Project Requirements'!N53","v":0},{"$f":"'B - Project Requirements'!X53","v":0},{"$f":"'B - Project Requirements'!AH53","v":0},{"$f":"'B - Project Requirements'!C54","v":0},{"$f":"'B - Project Requirements'!W54","v":0},{"$f":"'B - Project Requirements'!AE54","v":0},{"$f":"'B - Project Requirements'!AI54","v":0},{"$f":"'B - Project Requirements'!D72","v":0},{"$f":"'B - Project Requirements'!C73","v":0},{"$f":"'B - Project Requirements'!W73","v":0},{"$f":"'B - Project Requirements'!AE73","v":0},{"$f":"'B - Project Requirements'!AI73","v":0},{"$f":"'B - Project Requirements'!E74","v":0},{"$f":"'B - Project Requirements'!O74","v":0},{"$f":"'B - Project Requirements'!Z74","v":0},{"$f":"'B - Project Requirements'!AI74","v":0},{"$f":"'B - Project Requirements'!E75","v":0},{"$f":"'B - Project Requirements'!N75","v":0},{"$f":"'B - Project Requirements'!X75","v":0},{"$f":"'B - Project Requirements'!AH75","v":0},{"$f":"'B - Project Requirements'!C76","v":0},{"$f":"'B - Project Requirements'!W76","v":0},{"$f":"'B - Project Requirements'!AE76","v":0},{"$f":"'B - Project Requirements'!AI76","v":0},{"$f":"'B - Project Requirements'!D86","v":0},{"$f":"'B - Project Requirements'!AE86","v":0},{"$f":"'B - Project Requirements'!C87","v":0},{"$f":"'B - Project Requirements'!W87","v":0},{"$f":"'B - Project Requirements'!AE87","v":0},{"$f":"'B - Project Requirements'!AI87","v":0},{"$f":"'B - Project Requirements'!E88","v":0},{"$f":"'B - Project Requirements'!O88","v":0},{"$f":"'B - Project Requirements'!Z88","v":0},{"$f":"'B - Project Requirements'!AI88","v":0},{"$f":"'B - Project Requirements'!E89","v":0},{"$f":"'B - Project Requirements'!N89","v":0},{"$f":"'B - Project Requirements'!X89","v":0},{"$f":"'B - Project Requirements'!AH89","v":0},{"$f":"'B - Project Requirements'!C90","v":0},{"$f":"'B - Project Requirements'!W90","v":0},{"$f":"'B - Project Requirements'!AE90","v":0},{"$f":"'B - Project Requirements'!AI90","v":0},{"$f":"'B - Project Requirements'!D100","v":0},{"$f":"'B - Project Requirements'!AE100","v":0},{"$f":"'B - Project Requirements'!C101","v":0},{"$f":"'B - Project Requirements'!W101","v":0},{"$f":"'B - Project Requirements'!AE101","v":0},{"$f":"'B - Project Requirements'!AI101","v":0},{"$f":"'B - Project Requirements'!E102","v":0},{"$f":"'B - Project Requirements'!O102","v":0},{"$f":"'B - Project Requirements'!Z102","v":0},{"$f":"'B - Project Requirements'!AI102","v":0},{"$f":"'B - Project Requirements'!E103","v":0},{"$f":"'B - Project Requirements'!N103","v":0},{"$f":"'B - Project Requirements'!X103","v":0},{"$f":"'B - Project Requirements'!AH103","v":0},{"$f":"'B - Project Requirements'!C104","v":0},{"$f":"'B - Project Requirements'!W104","v":0},{"$f":"'B - Project Requirements'!AE104","v":0},{"$f":"'B - Project Requirements'!AI104","v":0},{"$f":"'B - Project Requirements'!D114","v":0},{"$f":"'B - Project Requirements'!AE114","v":0},{"$f":"'B - Project Requirements'!C115","v":0},{"$f":"'B - Project Requirements'!W115","v":0},{"$f":"'B - Project Requirements'!AE115","v":0},{"$f":"'B - Project Requirements'!AI115","v":0},{"$f":"'B - Project Requirements'!E116","v":0},{"$f":"'B - Project Requirements'!O116","v":0},{"$f":"'B - Project Requirements'!Z116","v":0},{"$f":"'B - Project Requirements'!AI116","v":0},{"$f":"'B - Project Requirements'!E117","v":0},{"$f":"'B - Project Requirements'!N117","v":0},{"$f":"'B - Project Requirements'!X117","v":0},{"$f":"'B - Project Requirements'!AH117","v":0},{"$f":"'B - Project Requirements'!C118","v":0},{"$f":"'B - Project Requirements'!W118","v":0},{"$f":"'B - Project Requirements'!AE118","v":0},{"$f":"'B - Project Requirements'!AI118","v":0},{"$f":"'B - Project Requirements'!K127","v":0},{"$f":"'B - Project Requirements'!AK141","v":0},{"$f":"'B - Project Requirements'!AK142","v":0},{"$f":"'B - Project Requirements'!U144","v":0},{"$f":"'B - Project Requirements'!AK145","v":0},{"$f":"'B - Project Requirements'!L146","v":0},{"$f":"'D - Max Loan & Unit Mix'!Q3","v":0},{"$f":"'D - Max Loan & Unit Mix'!X3","v":"Not Rural"},{"$f":"'D - Max Loan & Unit Mix'!E36","v":0},{"$f":"'D - Max Loan & Unit Mix'!G36","v":0},{"$f":"'D - Max Loan & Unit Mix'!I36","v":0},{"$f":"'D - Max Loan & Unit Mix'!K36","v":0},{"$f":"'D - Max Loan & Unit Mix'!M36","v":0},{"$f":"'D - Max Loan & Unit Mix'!AJ40","v":0},{"$f":"'D - Max Loan & Unit Mix'!AJ57","v":0},{"$f":"'D - Max Loan & Unit Mix'!AJ62","v":0},{"$f":"'E - Project Selection'!AA1","v":0},{"$f":"'E - Project Selection'!Q19","v":0},{"$f":"'E - Project Selection'!Z19","v":0},{"$f":"'E - Project Selection'!AG19","v":0},{"$f":"'E - Project Selection'!AK19","v":0},{"$f":"'E - Project Selection'!AK20","v":0},{"$f":"'E - Project Selection'!AK22","v":0},{"$f":"'E - Project Selection'!AK23","v":0},{"$f":"'E - Project Selection'!AK24","v":0},{"$f":"'E - Project Selection'!AK26","v":0},{"$f":"'E - Project Selection'!AK27","v":0},{"$f":"'E - Project Selection'!AK28","v":0},{"$f":"'E - Project Selection'!AK29","v":0},{"$f":"'E - Project Selection'!AK31","v":0},{"$f":"'E - Project Selection'!AK34","v":0},{"$f":"'E - Project Selection'!AK50","v":0},{"$f":"'E - Project Selection'!AK58","v":0},{"$f":"'E - Project Selection'!AK59","v":0},{"$f":"'E - Project Selection'!AK60","v":0},{"$f":"'E - Project Selection'!AK61","v":0},{"$f":"'E - Project Selection'!AK62","v":0},{"$f":"'E - Project Selection'!AK63","v":0},{"$f":"'E - Project Selection'!AK64","v":0},{"$f":"'E - Project Selection'!AK69","v":0},{"$f":"'E - Project Selection'!AB78","v":0},{"$f":"'E - Project Selection'!AK81","v":0},{"$f":"'E - Project Selection'!AK85","v":0},{"$f":"'E - Project Selection'!AK97","v":0},{"$f":"'E - Project Selection'!AK98","v":0},{"$f":"'E - Project Selection'!AK100","v":0},{"$f":"'E - Project Selection'!AK102","v":0},{"$f":"'E - Project Selection'!AK104","v":0},{"$f":"'E - Project Selection'!AK111","v":0},{"$f":"'E - Project Selection'!AK112","v":0}]

{"sheet":"TCAC Map 2019","index":16,"n_rows":6049,"n_cols":5,"rows_kept":6049,"cut":false,"hidden":true,"merged":[]}
["Tract FIPS Code","County","Final Category"]
[6001400100,"Alameda","High Resource",null,"High Resource"]
[6001400200,"Alameda","High Resource",null,"High Segregation & Poverty"]
[6001404300,"Alameda","High Resource",null,"Highest Resource"]
[6001404400,"Alameda","High Resource",null,"Low Resource"]
[6001404501,"Alameda","High Resource"]
[6001404502,"Alameda","High Resource"]
[6001404600,"Alameda","High Resource"]
[6001404700,"Alameda","High Resource"]
[6001420300,"Alameda","High Resource"]
[6001421100,"Alameda","High Resource"]
[6001421400,"Alameda","High Resource"]
[6001421600,"Alameda","High Resource"]
[6001421700,"Alameda","High Resource"]
[6001422100,"Alameda","High Resource"]
[6001422200,"Alameda","High Resource"]
[6001422300,"Alameda","High Resource"]
[6001422400,"Alameda","High Resource"]
[6001422600,"Alameda","High Resource"]
[6001423000,"Alameda","High Resource"]
[6001423100,"Alameda","High Resource"]
[6001423200,"Alameda","High Resource"]
[6001423300,"Alameda","High Resource"]
[6001423400,"Alameda","High Resource"]
[6001423500,"Alameda","High Resource"]
[6001423601,"Alameda","High Resource"]
[6001423901,"Alameda","High Resource"]
[6001423902,"Alameda","High Resource"]
[6001424001,"Alameda","High Resource"]
[6001427300,"Alameda","High Resource"]
[6001427700,"Alameda","High Resource"]
[6001427800,"Alameda","High Resource"]
[6001427900,"Alameda","High Resource"]
[6001428100,"Alameda","High Resource"]
[6001428200,"Alameda","High Resource"]
[6001428301,"Alameda","High Resource"]
[6001428400,"Alameda","High Resource"]
[6001428500,"Alameda","High Resource"]
[6001428600,"Alameda","High Resource"]
[6001430600,"Alameda","High Resource"]
[6001430700,"Alameda","High Resource"]
[6001430800,"Alameda","High Resource"]
[6001430900,"Alameda","High Resource"]
[6001440332,"Alameda","High Resource"]
[6001441100,"Alameda","High Resource"]
[6001441302,"Alameda","High Resource"]
[6001441401,"Alameda","High Resource"]
[6001441402,"Alameda","High Resource"]
[6001441501,"Alameda","High Resource"]
[6001441521,"Alameda","High Resource"]
[6001441522,"Alameda","High Resource"]
[6001441601,"Alameda","High Resource"]
[6001441800,"Alameda","High Resource"]
[6001441921,"Alameda","High Resource"]
[6001441923,"Alameda","High Resource"]
[6001441924,"Alameda","High Resource"]
[6001441927,"Alameda","High Resource"]
[6001442301,"Alameda","High Resource"]
[6001442302,"Alameda","High Resource"]
[6001442601,"Alameda","High Resource"]
[6001442602,"Alameda","High Resource"]
[6001442700,"Alameda","High Resource"]
[6001442900,"Alameda","High Resource"]
[6001443001,"Alameda","High Resource"]
[6001443002,"Alameda","High Resource"]
[6001444602,"Alameda","High Resource"]
[6001450102,"Alameda","High Resource"]
[6001450300,"Alameda","High Resource"]
[6001450400,"Alameda","High Resource"]
[6001450501,"Alameda","High Resource"]
[6001450601,"Alameda","High Resource"]
[6001450602,"Alameda","High Resource"]
[6001450701,"Alameda","High Resource"]
[6001450741,"Alameda","High Resource"]
[6001450742,"Alameda","High Resource"]
[6001450746,"Alameda","High Resource"]
[6001451102,"Alameda","High Resource"]
[6001451505,"Alameda","High Resource"]
[6001451601,"Alameda","High Resource"]
[6001451602,"Alameda","High Resource"]
[6001451701,"Alameda","High Resource"]
[6001451703,"Alameda","High Resource"]
[6001451704,"Alameda","High Resource"]
[6005000200,"Amador","High Resource"]
[6005000304,"Amador","High Resource"]
[6007000102,"Butte","High Resource"]
[6007000104,"Butte","High Resource"]
[6007000202,"Butte","High Resource"]
[6007000501,"Butte","High Resource"]
[6007000502,"Butte","High Resource"]
[6007000603,"Butte","High Resource"]
[6007000604,"Butte","High Resource"]
[6007001000,"Butte","High Resource"]
[6007001100,"Butte","High Resource"]
[6007002200,"Butte","High Resource"]
[6009000121,"Calaveras","High Resource"]
[6009000122,"Calaveras","High Resource"]
[6011000100,"Colusa","High Resource"]
[6013304005,"Contra Costa","High Resource"]
[6013321102,"Contra Costa","High Resource"]
[6013321103,"Contra Costa","High Resource"]
[6013323000,"Contra Costa","High Resource"]
[6013325000,"Contra Costa","High Resource"]
[6013337300,"Contra Costa","High Resource"]
[6013338201,"Contra Costa","High Resource"]
[6013338203,"Contra Costa","High Resource"]
[6013338204,"Contra Costa","High Resource"]
[6013338301,"Contra Costa","High Resource"]
[6013338302,"Contra Costa","High Resource"]
[6013339001,"Contra Costa","High Resource"]
[6013339002,"Contra Costa","High Resource"]
[6013340001,"Contra Costa","High Resource"]
[6013351102,"Contra Costa","High Resource"]
[6013351103,"Contra Costa","High Resource"]
[6013355112,"Contra Costa","High Resource"]
[6013355301,"Contra Costa","High Resource"]
[6013355302,"Contra Costa","High Resource"]
[6013355304,"Contra Costa","High Resource"]
[6013355306,"Contra Costa","High Resource"]
[6013389100,"Contra Costa","High Resource"]
[6013390100,"Contra Costa","High Resource"]
[6013390200,"Contra Costa","High Resource"]
[6013391000,"Contra Costa","High Resource"]
[6013392000,"Contra Costa","High Resource"]
[6015000102,"Del Norte","High Resource"]
[6015000105,"Del Norte","High Resource"]
[6017030502,"El Dorado","High Resource"]
[6017030504,"El Dorado","High Resource"]
[6017030808,"El Dorado","High Resource"]
[6017030810,"El Dorado","High Resource"]
[6017030902,"El Dorado","High Resource"]
[6017031405,"El Dorado","High Resource"]
[6017031503,"El Dorado","High Resource"]
[6019001409,"Fresno","High Resource"]
[6019001600,"Fresno","High Resource"]
[6019001700,"Fresno","High Resource"]
[6019003104,"Fresno","High Resource"]
[6019003600,"Fresno","High Resource"]
[6019004002,"Fresno","High Resource"]
[6019004100,"Fresno","High Resource"]
[6019004210,"Fresno","High Resource"]
[6019004213,"Fresno","High Resource"]
[6019004503,"Fresno","High Resource"]
[6019004601,"Fresno","High Resource"]
[6019005405,"Fresno","High Resource"]
[6019005406,"Fresno","High Resource"]
[6019005602,"Fresno","High Resource"]
[6019005607,"Fresno","High Resource"]
[6019005608,"Fresno","High Resource"]
[6019005704,"Fresno","High Resource"]
[6019006000,"Fresno","High Resource"]
[6019006100,"Fresno","High Resource"]
[6019006403,"Fresno","High Resource"]
[6019006603,"Fresno","High Resource"]
[6019007004,"Fresno","High Resource"]
[6019007300,"Fresno","High Resource"]
[6019007500,"Fresno","High Resource"]
[6021010100,"Glenn","High Resource"]
[6023000700,"Humboldt","High Resource"]
[6023001101,"Humboldt","High Resource"]
[6023001200,"Humboldt","High Resource"]
[6023010300,"Humboldt","High Resource"]
[6023010501,"Humboldt","High Resource"]
[6023010502,"Humboldt","High Resource"]
[6025010300,"Imperial","High Resource"]
[6025010600,"Imperial","High Resource"]
[6025010900,"Imperial","High Resource"]
[6025011801,"Imperial","High Resource"]
[6025011803,"Imperial","High Resource"]
[6025940000,"Imperial","High Resource"]
[6027000100,"Inyo","High Resource"]
[6029000504,"Kern","High Resource"]
[6029000507,"Kern","High Resource"]
[6029000903,"Kern","High Resource"]
[6029000905,"Kern","High Resource"]
[6029000908,"Kern","High Resource"]
[6029000910,"Kern","High Resource"]
[6029001802,"Kern","High Resource"]
[6029002818,"Kern","High Resource"]
[6029002819,"Kern","High Resource"]
[6029003114,"Kern","High Resource"]
[6029003123,"Kern","High Resource"]
[6029003124,"Kern","High Resource"]
[6029003205,"Kern","High Resource"]
[6029003206,"Kern","High Resource"]
[6029003600,"Kern","High Resource"]
[6029003700,"Kern","High Resource"]
[6029004101,"Kern","High Resource"]
[6029004401,"Kern","High Resource"]
[6029004902,"Kern","High Resource"]
[6029005104,"Kern","High Resource"]
[6029005201,"Kern","High Resource"]
[6029005401,"Kern","High Resource"]
[6029005404,"Kern","High Resource"]
[6029005501,"Kern","High Resource"]
[6029005506,"Kern","High Resource"]
[6029005801,"Kern","High Resource"]
[6029006004,"Kern","High Resource"]
[6029006201,"Kern","High Resource"]
[6031000200,"Kings","High Resource"]
[6031000405,"Kings","High Resource"]
[6031000500,"Kings","High Resource"]
[6031000701,"Kings","High Resource"]
[6031000900,"Kings","High Resource"]
[6033000100,"Lake","High Resource"]
[6033000400,"Lake","High Resource"]
[6033001000,"Lake","High Resource"]
[6035040200,"Lassen","High Resource"]
[6035040500,"Lassen","High Resource"]
[6037101122,"Los Angeles","High Resource"]
[6037101300,"Los Angeles","High Resource"]
[6037103300,"Los Angeles","High Resource"]
[6037106603,"Los Angeles","High Resource"]
[6037106642,"Los Angeles","High Resource"]
[6037106645,"Los Angeles","High Resource"]
[6037106646,"Los Angeles","High Resource"]
[6037108102,"Los Angeles","High Resource"]
[6037109200,"Los Angeles","High Resource"]
[6037109800,"Los Angeles","High Resource"]
[6037111201,"Los Angeles","High Resource"]
[6037111205,"Los Angeles","High Resource"]
[6037111206,"Los Angeles","High Resource"]
[6037111400,"Los Angeles","High Resource"]
[6037113101,"Los Angeles","High Resource"]
[6037113102,"Los Angeles","High Resource"]
[6037113211,"Los Angeles","High Resource"]
[6037113212,"Los Angeles","High Resource"]
[6037113213,"Los Angeles","High Resource"]
[6037113232,"Los Angeles","High Resource"]
[6037113235,"Los Angeles","High Resource"]
[6037113237,"Los Angeles","High Resource"]
[6037113303,"Los Angeles","High Resource"]
[6037113321,"Los Angeles","High Resource"]
[6037113322,"Los Angeles","High Resource"]
[6037115101,"Los Angeles","High Resource"]
[6037115104,"Los Angeles","High Resource"]
[6037115301,"Los Angeles","High Resource"]
[6037117301,"Los Angeles","High Resource"]
[6037117302,"Los Angeles","High Resource"]
[6037123902,"Los Angeles","High Resource"]
[6037124000,"Los Angeles","High Resource"]
[6037124400,"Los Angeles","High Resource"]
[6037124500,"Los Angeles","High Resource"]
[6037124600,"Los Angeles","High Resource"]
[6037124902,"Los Angeles","High Resource"]
[6037124903,"Los Angeles","High Resource"]
[6037125100,"Los Angeles","High Resource"]
[6037125200,"Los Angeles","High Resource"]
[6037125401,"Los Angeles","High Resource"]
[6037125402,"Los Angeles","High Resource"]
[6037125501,"Los Angeles","High Resource"]
[6037125502,"Los Angeles","High Resource"]
[6037128602,"Los Angeles","High Resource"]
[6037128801,"Los Angeles","High Resource"]
[6037131200,"Los Angeles","High Resource"]
[6037132001,"Los Angeles","High Resource"]
[6037132900,"Los Angeles","High Resource"]
[6037134302,"Los Angeles","High Resource"]
[6037134424,"Los Angeles","High Resource"]
[6037135102,"Los Angeles","High Resource"]
[6037135113,"Los Angeles","High Resource"]
[6037135201,"Los Angeles","High Resource"]
[6037137104,"Los Angeles","High Resource"]
[6037137501,"Los Angeles","High Resource"]
[6037139001,"Los Angeles","High Resource"]
[6037139200,"Los Angeles","High Resource"]
[6037139401,"Los Angeles","High Resource"]
[6037139402,"Los Angeles","High Resource"]
[6037139502,"Los Angeles","High Resource"]
[6037139503,"Los Angeles","High Resource"]
[6037143200,"Los Angeles","High Resource"]
[6037181500,"Los Angeles","High Resource"]
[6037181600,"Los Angeles","High Resource"]
[6037183103,"Los Angeles","High Resource"]
[6037183104,"Los Angeles","High Resource"]
[6037183221,"Los Angeles","High Resource"]
[6037183222,"Los Angeles","High Resource"]
[6037183300,"Los Angeles","High Resource"]
[6037183402,"Los Angeles","High Resource"]
[6037183510,"Los Angeles","High Resource"]
[6037185100,"Los Angeles","High Resource"]
[6037185204,"Los Angeles","High Resource"]
[6037186100,"Los Angeles","High Resource"]
[6037186201,"Los Angeles","High Resource"]
[6037186202,"Los Angeles","High Resource"]
[6037186203,"Los Angeles","High Resource"]
[6037186403,"Los Angeles","High Resource"]
[6037187101,"Los Angeles","High Resource"]
[6037188300,"Los Angeles","High Resource"]
[6037189201,"Los Angeles","High Resource"]
[6037189500,"Los Angeles","High Resource"]
[6037189600,"Los Angeles","High Resource"]
[6037189903,"Los Angeles","High Resource"]
[6037189904,"Los Angeles","High Resource"]
[6037189905,"Los Angeles","High Resource"]
[6037190100,"Los Angeles","High Resource"]
[6037190202,"Los Angeles","High Resource"]
[6037190301,"Los Angeles","High Resource"]
[6037190401,"Los Angeles","High Resource"]
[6037190402,"Los Angeles","High Resource"]
[6037191000,"Los Angeles","High Resource"]
[6037191110,"Los Angeles","High Resource"]
[6037192410,"Los Angeles","High Resource"]
[6037195300,"Los Angeles","High Resource"]
[6037195400,"Los Angeles","High Resource"]
[6037195500,"Los Angeles","High Resource"]
[6037195803,"Los Angeles","High Resource"]
[6037195901,"Los Angeles","High Resource"]
[6037195902,"Los Angeles","High Resource"]
[6037197300,"Los Angeles","High Resource"]
[6037197410,"Los Angeles","High Resource"]
[6037197500,"Los Angeles","High Resource"]
[6037201302,"Los Angeles","High Resource"]
[6037211121,"Los Angeles","High Resource"]
[6037211500,"Los Angeles","High Resource"]
[6037211703,"Los Angeles","High Resource"]
[6037211704,"Los Angeles","High Resource"]
[6037211802,"Los Angeles","High Resource"]
[6037211803,"Los Angeles","High Resource"]
[6037212502,"Los Angeles","High Resource"]
[6037212610,"Los Angeles","High Resource"]
[6037212701,"Los Angeles","High Resource"]
[6037212702,"Los Angeles","High Resource"]
[6037212900,"Los Angeles","High Resource"]
[6037216200,"Los Angeles","High Resource"]
[6037216900,"Los Angeles","High Resource"]
[6037217002,"Los Angeles","High Resource"]
[6037217100,"Los Angeles","High Resource"]
[6037217200,"Los Angeles","High Resource"]
[6037218110,"Los Angeles","High Resource"]
[6037218220,"Los Angeles","High Resource"]
[6037236000,"Los Angeles","High Resource"]
[6037264103,"Los Angeles","High Resource"]
[6037264301,"Los Angeles","High Resource"]
[6037265305,"Los Angeles","High Resource"]
[6037265510,"Los Angeles","High Resource"]
[6037267402,"Los Angeles","High Resource"]
[6037267403,"Los Angeles","High Resource"]
[6037267404,"Los Angeles","High Resource"]
[6037267501,"Los Angeles","High Resource"]
[6037267502,"Los Angeles","High Resource"]
[6037267700,"Los Angeles","High Resource"]
[6037269601,"Los Angeles","High Resource"]
[6037269602,"Los Angeles","High Resource"]
[6037269700,"Los Angeles","High Resource"]
[6037269904,"Los Angeles","High Resource"]
[6037269907,"Los Angeles","High Resource"]
[6037270100,"Los Angeles","High Resource"]
[6037271200,"Los Angeles","High Resource"]
[6037271300,"Los Angeles","High Resource"]
[6037271702,"Los Angeles","High Resource"]
[6037271801,"Los Angeles","High Resource"]
[6037271802,"Los Angeles","High Resource"]
[6037272100,"Los Angeles","High Resource"]
[6037272201,"Los Angeles","High Resource"]
[6037272202,"Los Angeles","High Resource"]
[6037272301,"Los Angeles","High Resource"]
[6037272302,"Los Angeles","High Resource"]
[6037274100,"Los Angeles","High Resource"]
[6037275101,"Los Angeles","High Resource"]
[6037275200,"Los Angeles","High Resource"]
[6037275302,"Los Angeles","High Resource"]
[6037275400,"Los Angeles","High Resource"]
[6037275603,"Los Angeles","High Resource"]
[6037276100,"Los Angeles","High Resource"]
[6037276400,"Los Angeles","High Resource"]
[6037276500,"Los Angeles","High Resource"]
[6037276601,"Los Angeles","High Resource"]
[6037276604,"Los Angeles","High Resource"]
[6037277100,"Los Angeles","High Resource"]
[6037278001,"Los Angeles","High Resource"]
[6037295103,"Los Angeles","High Resource"]
[6037296300,"Los Angeles","High Resource"]
[6037296401,"Los Angeles","High Resource"]
[6037296402,"Los Angeles","High Resource"]
[6037297000,"Los Angeles","High Resource"]
[6037297300,"Los Angeles","High Resource"]
[6037297400,"Los Angeles","High Resource"]
[6037297500,"Los Angeles","High Resource"]
[6037301000,"Los Angeles","High Resource"]
[6037301100,"Los Angeles","High Resource"]
[6037301203,"Los Angeles","High Resource"]
[6037301204,"Los Angeles","High Resource"]
[6037301206,"Los Angeles","High Resource"]
[6037301400,"Los Angeles","High Resource"]
[6037301501,"Los Angeles","High Resource"]
[6037301602,"Los Angeles","High Resource"]
[6037301701,"Los Angeles","High Resource"]
[6037301801,"Los Angeles","High Resource"]
[6037301802,"Los Angeles","High Resource"]
[6037301900,"Los Angeles","High Resource"]
[6037302002,"Los Angeles","High Resource"]
[6037302003,"Los Angeles","High Resource"]
[6037302004,"Los Angeles","High Resource"]
[6037302102,"Los Angeles","High Resource"]
[6037302104,"Los Angeles","High Resource"]
[6037302506,"Los Angeles","High Resource"]
[6037310202,"Los Angeles","High Resource"]
[6037310400,"Los Angeles","High Resource"]
[6037310501,"Los Angeles","High Resource"]
[6037310601,"Los Angeles","High Resource"]
[6037310701,"Los Angeles","High Resource"]
[6037310702,"Los Angeles","High Resource"]
[6037310800,"Los Angeles","High Resource"]
[6037310900,"Los Angeles","High Resource"]
[6037311100,"Los Angeles","High Resource"]
[6037311801,"Los Angeles","High Resource"]
[6037311802,"Los Angeles","High Resource"]
[6037400302,"Los Angeles","High Resource"]
[6037400304,"Los Angeles","High Resource"]
[6037400403,"Los Angeles","High Resource"]
[6037400900,"Los Angeles","High Resource"]
[6037401101,"Los Angeles","High Resource"]
[6037401202,"Los Angeles","High Resource"]
[6037401203,"Los Angeles","High Resource"]
[6037401303,"Los Angeles","High Resource"]
[6037401304,"Los Angeles","High Resource"]
[6037401311,"Los Angeles","High Resource"]
[6037401312,"Los Angeles","High Resource"]
[6037401601,"Los Angeles","High Resource"]
[6037401602,"Los Angeles","High Resource"]
[6037401603,"Los Angeles","High Resource"]
[6037401701,"Los Angeles","High Resource"]
[6037401901,"Los Angeles","High Resource"]
[6037403319,"Los Angeles","High Resource"]
[6037403403,"Los Angeles","High Resource"]
[6037403408,"Los Angeles","High Resource"]
[6037403500,"Los Angeles","High Resource"]
[6037403600,"Los Angeles","High Resource"]
[6037403702,"Los Angeles","High Resource"]
[6037403703,"Los Angeles","High Resource"]
[6037403721,"Los Angeles","High Resource"]
[6037403722,"Los Angeles","High Resource"]
[6037403801,"Los Angeles","High Resource"]
[6037403802,"Los Angeles","High Resource"]
[6037405400,"Los Angeles","High Resource"]
[6037405500,"Los Angeles","High Resource"]
[6037405600,"Los Angeles","High Resource"]
[6037405701,"Los Angeles","High Resource"]
[6037405702,"Los Angeles","High Resource"]
[6037406000,"Los Angeles","High Resource"]
[6037406101,"Los Angeles","High Resource"]
[6037406102,"Los Angeles","High Resource"]
[6037406402,"Los Angeles","High Resource"]
[6037406411,"Los Angeles","High Resource"]
[6037406412,"Los Angeles","High Resource"]
[6037406500,"Los Angeles","High Resource"]
[6037406601,"Los Angeles","High Resource"]
[6037408005,"Los Angeles","High Resource"]
[6037408136,"Los Angeles","High Resource"]
[6037408212,"Los Angeles","High Resource"]
[6037408504,"Los Angeles","High Resource"]
[6037408505,"Los Angeles","High Resource"]
[6037408623,"Los Angeles","High Resource"]
[6037408624,"Los Angeles","High Resource"]
[6037408626,"Los Angeles","High Resource"]
[6037408627,"Los Angeles","High Resource"]
[6037408630,"Los Angeles","High Resource"]
[6037408631,"Los Angeles","High Resource"]
[6037408705,"Los Angeles","High Resource"]
[6037408706,"Los Angeles","High Resource"]
[6037408722,"Los Angeles","High Resource"]
[6037408723,"Los Angeles","High Resource"]
[6037430002,"Los Angeles","High Resource"]
[6037430003,"Los Angeles","High Resource"]
[6037430302,"Los Angeles","High Resource"]
[6037430901,"Los Angeles","High Resource"]
[6037430902,"Los Angeles","High Resource"]
[6037431001,"Los Angeles","High Resource"]
[6037431002,"Los Angeles","High Resource"]
[6037431300,"Los Angeles","High Resource"]
[6037431400,"Los Angeles","High Resource"]
[6037431501,"Los Angeles","High Resource"]
[6037431502,"Los Angeles","High Resource"]
[6037432101,"Los Angeles","High Resource"]
[6037432102,"Los Angeles","High Resource"]
[6037460000,"Los Angeles","High Resource"]
[6037460100,"Los Angeles","High Resource"]
[6037460200,"Los Angeles","High Resource"]
[6037460302,"Los Angeles","High Resource"]
[6037460401,"Los Angeles","High Resource"]
[6037460800,"Los Angeles","High Resource"]
[6037461200,"Los Angeles","High Resource"]
[6037461300,"Los Angeles","High Resource"]
[6037461400,"Los Angeles","High Resource"]
[6037462500,"Los Angeles","High Resource"]
[6037462600,"Los Angeles","High Resource"]
[6037462700,"Los Angeles","High Resource"]
[6037462800,"Los Angeles","High Resource"]
[6037462900,"Los Angeles","High Resource"]
[6037463000,"Los Angeles","High Resource"]
[6037463101,"Los Angeles","High Resource"]
[6037463102,"Los Angeles","High Resource"]
[6037463200,"Los Angeles","High Resource"]
[6037463400,"Los Angeles","High Resource"]
[6037463500,"Los Angeles","High Resource"]
[6037463601,"Los Angeles","High Resource"]
[6037463700,"Los Angeles","High Resource"]
[6037463900,"Los Angeles","High Resource"]
[6037480102,"Los Angeles","High Resource"]
[6037480201,"Los Angeles","High Resource"]
[6037480302,"Los Angeles","High Resource"]
[6037480303,"Los Angeles","High Resource"]
[6037480304,"Los Angeles","High Resource"]
[6037480804,"Los Angeles","High Resource"]
[6037480901,"Los Angeles","High Resource"]
[6037480902,"Los Angeles","High Resource"]
[6037480903,"Los Angeles","High Resource"]
[6037481001,"Los Angeles","High Resource"]
[6037481002,"Los Angeles","High Resource"]
[6037481101,"Los Angeles","High Resource"]
[6037481102,"Los Angeles","High Resource"]
[6037481103,"Los Angeles","High Resource"]
[6037481201,"Los Angeles","High Resource"]
[6037481202,"Los Angeles","High Resource"]
[6037481401,"Los Angeles","High Resource"]
[6037481402,"Los Angeles","High Resource"]
[6037481500,"Los Angeles","High Resource"]
[6037481603,"Los Angeles","High Resource"]
[6037481604,"Los Angeles","High Resource"]
[6037481605,"Los Angeles","High Resource"]
[6037481606,"Los Angeles","High Resource"]
[6037481711,"Los Angeles","High Resource"]
[6037481712,"Los Angeles","High Resource"]
[6037481713,"Los Angeles","High Resource"]
[6037481714,"Los Angeles","High Resource"]
[6037481800,"Los Angeles","High Resource"]
[6037481901,"Los Angeles","High Resource"]
[6037481902,"Los Angeles","High Resource"]
[6037482002,"Los Angeles","High Resource"]
[6037482101,"Los Angeles","High Resource"]
[6037482102,"Los Angeles","High Resource"]
[6037482201,"Los Angeles","High Resource"]
[6037482202,"Los Angeles","High Resource"]
[6037482600,"Los Angeles","High Resource"]
[6037482701,"Los Angeles","High Resource"]
[6037482702,"Los Angeles","High Resource"]
[6037500300,"Los Angeles","High Resource"]
[6037501300,"Los Angeles","High Resource"]
[6037501501,"Los Angeles","High Resource"]
[6037501503,"Los Angeles","High Resource"]
[6037501600,"Los Angeles","High Resource"]
[6037501700,"Los Angeles","High Resource"]
[6037501802,"Los Angeles","High Resource"]
[6037501900,"Los Angeles","High Resource"]
[6037503201,"Los Angeles","High Resource"]
[6037503301,"Los Angeles","High Resource"]
[6037503302,"Los Angeles","High Resource"]
[6037503501,"Los Angeles","High Resource"]
[6037503502,"Los Angeles","High Resource"]
[6037503601,"Los Angeles","High Resource"]
[6037503702,"Los Angeles","High Resource"]
[6037503703,"Los Angeles","High Resource"]
[6037503801,"Los Angeles","High Resource"]
[6037503802,"Los Angeles","High Resource"]
[6037503901,"Los Angeles","High Resource"]
[6037503902,"Los Angeles","High Resource"]
[6037504001,"Los Angeles","High Resource"]
[6037504101,"Los Angeles","High Resource"]
[6037532400,"Los Angeles","High Resource"]
[6037543601,"Los Angeles","High Resource"]
[6037550100,"Los Angeles","High Resource"]
[6037550300,"Los Angeles","High Resource"]
[6037550500,"Los Angeles","High Resource"]
[6037550601,"Los Angeles","High Resource"]
[6037550602,"Los Angeles","High Resource"]
[6037550700,"Los Angeles","High Resource"]
[6037550901,"Los Angeles","High Resource"]
[6037550902,"Los Angeles","High Resource"]
[6037551000,"Los Angeles","High Resource"]
[6037551102,"Los Angeles","High Resource"]
[6037551201,"Los Angeles","High Resource"]
[6037551202,"Los Angeles","High Resource"]
[6037551300,"Los Angeles","High Resource"]
[6037551401,"Los Angeles","High Resource"]
[6037551402,"Los Angeles","High Resource"]
[6037551501,"Los Angeles","High Resource"]
[6037551502,"Los Angeles","High Resource"]
[6037551800,"Los Angeles","High Resource"]
[6037552001,"Los Angeles","High Resource"]
[6037552002,"Los Angeles","High Resource"]
[6037553200,"Los Angeles","High Resource"]
[6037553300,"Los Angeles","High Resource"]
[6037554513,"Los Angeles","High Resource"]
[6037554521,"Los Angeles","High Resource"]
[6037554522,"Los Angeles","High Resource"]
[6037554802,"Los Angeles","High Resource"]
[6037554900,"Los Angeles","High Resource"]
[6037555001,"Los Angeles","High Resource"]
[6037555103,"Los Angeles","High Resource"]
[6037555202,"Los Angeles","High Resource"]
[6037570001,"Los Angeles","High Resource"]
[6037570002,"Los Angeles","High Resource"]
[6037570003,"Los Angeles","High Resource"]
[6037570701,"Los Angeles","High Resource"]
[6037570702,"Los Angeles","High Resource"]
[6037570800,"Los Angeles","High Resource"]
[6037570901,"Los Angeles","High Resource"]
[6037570902,"Los Angeles","High Resource"]
[6037571101,"Los Angeles","High Resource"]
[6037571200,"Los Angeles","High Resource"]
[6037571300,"Los Angeles","High Resource"]
[6037571400,"Los Angeles","High Resource"]
[6037571503,"Los Angeles","High Resource"]
[6037571504,"Los Angeles","High Resource"]
[6037571800,"Los Angeles","High Resource"]
[6037571900,"Los Angeles","High Resource"]
[6037572001,"Los Angeles","High Resource"]
[6037572002,"Los Angeles","High Resource"]
[6037573403,"Los Angeles","High Resource"]
[6037573800,"Los Angeles","High Resource"]
[6037573902,"Los Angeles","High Resource"]
[6037574202,"Los Angeles","High Resource"]
[6037574500,"Los Angeles","High Resource"]
[6037574902,"Los Angeles","High Resource"]
[6037575001,"Los Angeles","High Resource"]
[6037576700,"Los Angeles","High Resource"]
[6037577000,"Los Angeles","High Resource"]
[6037577100,"Los Angeles","High Resource"]
[6037577602,"Los Angeles","High Resource"]
[6037599000,"Los Angeles","High Resource"]
[6037601301,"Los Angeles","High Resource"]
[6037602301,"Los Angeles","High Resource"]
[6037602302,"Los Angeles","High Resource"]
[6037603006,"Los Angeles","High Resource"]
[6037603400,"Los Angeles","High Resource"]
[6037603500,"Los Angeles","High Resource"]
[6037603600,"Los Angeles","High Resource"]
[6037604002,"Los Angeles","High Resource"]
[6037650003,"Los Angeles","High Resource"]
[6037650101,"Los Angeles","High Resource"]
[6037650200,"Los Angeles","High Resource"]
[6037650901,"Los Angeles","High Resource"]
[6037650902,"Los Angeles","High Resource"]
[6037670001,"Los Angeles","High Resource"]
[6037670002,"Los Angeles","High Resource"]
[6037670003,"Los Angeles","High Resource"]
[6037670100,"Los Angeles","High Resource"]
[6037700102,"Los Angeles","High Resource"]
[6037701801,"Los Angeles","High Resource"]
[6037702802,"Los Angeles","High Resource"]
[6037702803,"Los Angeles","High Resource"]
[6037702901,"Los Angeles","High Resource"]
[6037703001,"Los Angeles","High Resource"]
[6037703002,"Los Angeles","High Resource"]
[6037703200,"Los Angeles","High Resource"]
[6037901213,"Los Angeles","High Resource"]
[6037910202,"Los Angeles","High Resource"]
[6037910301,"Los Angeles","High Resource"]
[6037910302,"Los Angeles","High Resource"]
[6037910805,"Los Angeles","High Resource"]
[6037910807,"Los Angeles","High Resource"]
[6037910810,"Los Angeles","High Resource"]
[6037910813,"Los Angeles","High Resource"]
[6037920012,"Los Angeles","High Resource"]
[6037920013,"Los Angeles","High Resource"]
[6037920017,"Los Angeles","High Resource"]
[6037920026,"Los Angeles","High Resource"]
[6037920028,"Los Angeles","High Resource"]
[6037920029,"Los Angeles","High Resource"]
[6037920030,"Los Angeles","High Resource"]
[6037920031,"Los Angeles","High Resource"]
[6037920033,"Los Angeles","High Resource"]
[6037920034,"Los Angeles","High Resource"]
[6037920035,"Los Angeles","High Resource"]
[6037920038,"Los Angeles","High Resource"]
[6037920039,"Los Angeles","High Resource"]
[6037920040,"Los Angeles","High Resource"]
[6037920041,"Los Angeles","High Resource"]
[6037920042,"Los Angeles","High Resource"]
[6037920102,"Los Angeles","High Resource"]
[6037920106,"Los Angeles","High Resource"]
[6037920312,"Los Angeles","High Resource"]
[6037920313,"Los Angeles","High Resource"]
[6037920314,"Los Angeles","High Resource"]
[6037920332,"Los Angeles","High Resource"]
[6037920336,"Los Angeles","High Resource"]
[6037930301,"Los Angeles","High Resource"]
[6039000104,"Madera","High Resource"]
[6039000108,"Madera","High Resource"]
[6039000109,"Madera","High Resource"]
[6039000700,"Madera","High Resource"]
[6041101200,"Marin","High Resource"]
[6041102100,"Marin","High Resource"]
[6041102202,"Marin","High Resource"]
[6041103100,"Marin","High Resource"]
[6041103200,"Marin","High Resource"]
[6041104101,"Marin","High Resource"]
[6041108200,"Marin","High Resource"]
[6041109002,"Marin","High Resource"]
[6041119201,"Marin","High Resource"]
[6041119202,"Marin","High Resource"]
[6041121200,"Marin","High Resource"]
[6041131100,"Marin","High Resource"]
[6043000301,"Mariposa","High Resource"]
[6045010300,"Mendocino","High Resource"]
[6045010500,"Mendocino","High Resource"]
[6045011102,"Mendocino","High Resource"]
[6045011700,"Mendocino","High Resource"]
[6047000203,"Merced","High Resource"]
[6047000401,"Merced","High Resource"]
[6047000601,"Merced","High Resource"]
[6047000602,"Merced","High Resource"]
[6047001002,"Merced","High Resource"]
[6047001101,"Merced","High Resource"]
[6047001200,"Merced","High Resource"]
[6047002301,"Merced","High Resource"]
[6047002500,"Merced","High Resource"]
[6047002600,"Merced","High Resource"]
[6049000200,"Modoc","High Resource"]
[6051000102,"Mono","High Resource"]
[6053010102,"Monterey","High Resource"]
[6053010202,"Monterey","High Resource"]
[6053010305,"Monterey","High Resource"]
[6053010501,"Monterey","High Resource"]
[6053013000,"Monterey","High Resource"]
[6053014700,"Monterey","High Resource"]
[6055201602,"Napa","High Resource"]
[6055201700,"Napa","High Resource"]
[6057000102,"Nevada","High Resource"]
[6057000103,"Nevada","High Resource"]
[6057000200,"Nevada","High Resource"]
[6057000802,"Nevada","High Resource"]
[6059001506,"Orange","High Resource"]
[6059001507,"Orange","High Resource"]
[6059001704,"Orange","High Resource"]
[6059011707,"Orange","High Resource"]
[6059011718,"Orange","High Resource"]
[6059021809,"Orange","High Resource"]
[6059021810,"Orange","High Resource"]
[6059021815,"Orange","High Resource"]
[6059021816,"Orange","High Resource"]
[6059021817,"Orange","High Resource"]
[6059021820,"Orange","High Resource"]
[6059021822,"Orange","High Resource"]
[6059021825,"Orange","High Resource"]
[6059021827,"Orange","High Resource"]
[6059021828,"Orange","High Resource"]
[6059021830,"Orange","High Resource"]
[6059021903,"Orange","High Resource"]
[6059021905,"Orange","High Resource"]
[6059021912,"Orange","High Resource"]
[6059021917,"Orange","High Resource"]
[6059021919,"Orange","High Resource"]
[6059021921,"Orange","High Resource"]
[6059021922,"Orange","High Resource"]
[6059021924,"Orange","High Resource"]
[6059032002,"Orange","High Resource"]
[6059032013,"Orange","High Resource"]
[6059032022,"Orange","High Resource"]
[6059032023,"Orange","High Resource"]
[6059032028,"Orange","High Resource"]
[6059032031,"Orange","High Resource"]
[6059032032,"Orange","High Resource"]
[6059032036,"Orange","High Resource"]
[6059032039,"Orange","High Resource"]
[6059032040,"Orange","High Resource"]
[6059032041,"Orange","High Resource"]
[6059032042,"Orange","High Resource"]
[6059032043,"Orange","High Resource"]
[6059032048,"Orange","High Resource"]
[6059032050,"Orange","High Resource"]
[6059032054,"Orange","High Resource"]
[6059032055,"Orange","High Resource"]
[6059032061,"Orange","High Resource"]
[6059042103,"Orange","High Resource"]
[6059042114,"Orange","High Resource"]
[6059042305,"Orange","High Resource"]
[6059042315,"Orange","High Resource"]
[6059042320,"Orange","High Resource"]
[6059042323,"Orange","High Resource"]
[6059042327,"Orange","High Resource"]
[6059042328,"Orange","High Resource"]
[6059042329,"Orange","High Resource"]
[6059042330,"Orange","High Resource"]
[6059042331,"Orange","High Resource"]
[6059042333,"Orange","High Resource"]
[6059042335,"Orange","High Resource"]
[6059052417,"Orange","High Resource"]
[6059052418,"Orange","High Resource"]
[6059052422,"Orange","High Resource"]
[6059052425,"Orange","High Resource"]
[6059052427,"Orange","High Resource"]
[6059052505,"Orange","High Resource"]
[6059052515,"Orange","High Resource"]
[6059052517,"Orange","High Resource"]
[6059052519,"Orange","High Resource"]
[6059052520,"Orange","High Resource"]
[6059052521,"Orange","High Resource"]
[6059052523,"Orange","High Resource"]
[6059052524,"Orange","High Resource"]
[6059062612,"Orange","High Resource"]
[6059062614,"Orange","High Resource"]
[6059062640,"Orange","High Resource"]
[6059062641,"Orange","High Resource"]
[6059062649,"Orange","High Resource"]
[6059063102,"Orange","High Resource"]
[6059063500,"Orange","High Resource"]
[6059063805,"Orange","High Resource"]
[6059063806,"Orange","High Resource"]
[6059075506,"Orange","High Resource"]
[6059075702,"Orange","High Resource"]
[6059075703,"Orange","High Resource"]
[6059075810,"Orange","High Resource"]
[6059075813,"Orange","High Resource"]
[6059099224,"Orange","High Resource"]
[6059099225,"Orange","High Resource"]
[6059099230,"Orange","High Resource"]
[6059099231,"Orange","High Resource"]
[6059099233,"Orange","High Resource"]
[6059099234,"Orange","High Resource"]
[6059099235,"Orange","High Resource"]
[6059099239,"Orange","High Resource"]
[6059099243,"Orange","High Resource"]
[6059099246,"Orange","High Resource"]
[6059099251,"Orange","High Resource"]
[6059099306,"Orange","High Resource"]
[6059099309,"Orange","High Resource"]
[6059099310,"Orange","High Resource"]
[6059099406,"Orange","High Resource"]
[6059099407,"Orange","High Resource"]
[6059099408,"Orange","High Resource"]
[6059099413,"Orange","High Resource"]
[6059099415,"Orange","High Resource"]
[6059099416,"Orange","High Resource"]
[6059099508,"Orange","High Resource"]
[6059099509,"Orange","High Resource"]
[6059099604,"Orange","High Resource"]
[6059099605,"Orange","High Resource"]
[6059110012,"Orange","High Resource"]
[6059110015,"Orange","High Resource"]
[6059110106,"Orange","High Resource"]
[6059110108,"Orange","High Resource"]
[6059110114,"Orange","High Resource"]
[6059110115,"Orange","High Resource"]
[6059110118,"Orange","High Resource"]
[6059110604,"Orange","High Resource"]
[6059110605,"Orange","High Resource"]
[6059980000,"Orange","High Resource"]
[6061020104,"Placer","High Resource"]
[6061020106,"Placer","High Resource"]
[6061020712,"Placer","High Resource"]
[6061020714,"Placer","High Resource"]
[6061020715,"Placer","High Resource"]
[6061021045,"Placer","High Resource"]
[6061021046,"Placer","High Resource"]
[6061021103,"Placer","High Resource"]
[6061021108,"Placer","High Resource"]
[6061021129,"Placer","High Resource"]
[6061021203,"Placer","High Resource"]
[6061021204,"Placer","High Resource"]
[6061021902,"Placer","High Resource"]
[6061022011,"Placer","High Resource"]
[6061022500,"Placer","High Resource"]
[6061023200,"Placer","High Resource"]
[6061023300,"Placer","High Resource"]
[6061023700,"Placer","High Resource"]
[6061023800,"Placer","High Resource"]
[6061023900,"Placer","High Resource"]
[6063000502,"Plumas","High Resource"]
[6065030602,"Riverside","High Resource"]
[6065030603,"Riverside","High Resource"]
[6065030700,"Riverside","High Resource"]
[6065031001,"Riverside","High Resource"]
[6065031200,"Riverside","High Resource"]
[6065031702,"Riverside","High Resource"]
[6065040302,"Riverside","High Resource"]
[6065040303,"Riverside","High Resource"]
[6065040404,"Riverside","High Resource"]
[6065040405,"Riverside","High Resource"]
[6065040603,"Riverside","High Resource"]
[6065040604,"Riverside","High Resource"]
[6065040702,"Riverside","High Resource"]
[6065040703,"Riverside","High Resource"]
[6065040807,"Riverside","High Resource"]
[6065040808,"Riverside","High Resource"]
[6065040809,"Riverside","High Resource"]
[6065040812,"Riverside","High Resource"]
[6065040813,"Riverside","High Resource"]
[6065040815,"Riverside","High Resource"]
[6065040901,"Riverside","High Resource"]
[6065041403,"Riverside","High Resource"]
[6065041404,"Riverside","High Resource"]
[6065041409,"Riverside","High Resource"]
[6065041702,"Riverside","High Resource"]
[6065041704,"Riverside","High Resource"]
[6065041807,"Riverside","High Resource"]
[6065041809,"Riverside","High Resource"]
[6065041813,"Riverside","High Resource"]
[6065041904,"Riverside","High Resource"]
[6065041906,"Riverside","High Resource"]
[6065042007,"Riverside","High Resource"]
[6065042012,"Riverside","High Resource"]
[6065042206,"Riverside","High Resource"]
[6065042619,"Riverside","High Resource"]
[6065042708,"Riverside","High Resource"]
[6065042709,"Riverside","High Resource"]
[6065042715,"Riverside","High Resource"]
[6065042717,"Riverside","High Resource"]
[6065042719,"Riverside","High Resource"]
[6065042720,"Riverside","High Resource"]
[6065042724,"Riverside","High Resource"]
[6065042726,"Riverside","High Resource"]
[6065042728,"Riverside","High Resource"]
[6065042729,"Riverside","High Resource"]
[6065042731,"Riverside","High Resource"]
[6065042732,"Riverside","High Resource"]
[6065042737,"Riverside","High Resource"]
[6065042742,"Riverside","High Resource"]
[6065042743,"Riverside","High Resource"]
[6065042744,"Riverside","High Resource"]
[6065043009,"Riverside","High Resource"]
[6065043216,"Riverside","High Resource"]
[6065043220,"Riverside","High Resource"]
[6065043222,"Riverside","High Resource"]
[6065043266,"Riverside","High Resource"]
[6065043270,"Riverside","High Resource"]
[6065043271,"Riverside","High Resource"]
[6065043274,"Riverside","High Resource"]
[6065043279,"Riverside","High Resource"]
[6065043802,"Riverside","High Resource"]
[6065043807,"Riverside","High Resource"]
[6065043810,"Riverside","High Resource"]
[6065043814,"Riverside","High Resource"]
[6065043818,"Riverside","High Resource"]
[6065043820,"Riverside","High Resource"]
[6065043822,"Riverside","High Resource"]
[6065044402,"Riverside","High Resource"]
[6065044404,"Riverside","High Resource"]
[6065044517,"Riverside","High Resource"]
[6065044520,"Riverside","High Resource"]
[6065044602,"Riverside","High Resource"]
[6065044604,"Riverside","High Resource"]
[6065044606,"Riverside","High Resource"]
[6065044701,"Riverside","High Resource"]
[6065044805,"Riverside","High Resource"]
[6065044806,"Riverside","High Resource"]
[6065044807,"Riverside","High Resource"]
[6065044917,"Riverside","High Resource"]
[6065044918,"Riverside","High Resource"]
[6065044919,"Riverside","High Resource"]
[6065044921,"Riverside","High Resource"]
[6065044932,"Riverside","High Resource"]
[6065045103,"Riverside","High Resource"]
[6065045108,"Riverside","High Resource"]
[6065045109,"Riverside","High Resource"]
[6065045110,"Riverside","High Resource"]
[6065045116,"Riverside","High Resource"]
[6065045120,"Riverside","High Resource"]
[6065045124,"Riverside","High Resource"]
[6065045212,"Riverside","High Resource"]
[6065045608,"Riverside","High Resource"]
[6065046404,"Riverside","High Resource"]
[6065048200,"Riverside","High Resource"]
[6065048300,"Riverside","High Resource"]
[6065049000,"Riverside","High Resource"]
[6065049100,"Riverside","High Resource"]
[6065049400,"Riverside","High Resource"]
[6065049800,"Riverside","High Resource"]
[6065940600,"Riverside","High Resource"]
[6065940700,"Riverside","High Resource"]
[6065940800,"Riverside","High Resource"]
[6065941200,"Riverside","High Resource"]
[6065941300,"Riverside","High Resource"]
[6065941400,"Riverside","High Resource"]
[6067001500,"Sacramento","High Resource"]
[6067002300,"Sacramento","High Resource"]
[6067002400,"Sacramento","High Resource"]
[6067003300,"Sacramento","High Resource"]
[6067003900,"Sacramento","High Resource"]
[6067004004,"Sacramento","High Resource"]
[6067004008,"Sacramento","High Resource"]
[6067004009,"Sacramento","High Resource"]
[6067004011,"Sacramento","High Resource"]
[6067004012,"Sacramento","High Resource"]
[6067005403,"Sacramento","High Resource"]
[6067005404,"Sacramento","High Resource"]
[6067005701,"Sacramento","High Resource"]
[6067005702,"Sacramento","High Resource"]
[6067006004,"Sacramento","High Resource"]
[6067007010,"Sacramento","High Resource"]
[6067007015,"Sacramento","High Resource"]
[6067007017,"Sacramento","High Resource"]
[6067007020,"Sacramento","High Resource"]
[6067007102,"Sacramento","High Resource"]
[6067007103,"Sacramento","High Resource"]
[6067007105,"Sacramento","High Resource"]
[6067007107,"Sacramento","High Resource"]
[6067007701,"Sacramento","High Resource"]
[6067007702,"Sacramento","High Resource"]
[6067007904,"Sacramento","High Resource"]
[6067008005,"Sacramento","High Resource"]
[6067008009,"Sacramento","High Resource"]
[6067008010,"Sacramento","High Resource"]
[6067008203,"Sacramento","High Resource"]
[6067008204,"Sacramento","High Resource"]
[6067008206,"Sacramento","High Resource"]
[6067008207,"Sacramento","High Resource"]
[6067008208,"Sacramento","High Resource"]
[6067008209,"Sacramento","High Resource"]
[6067008402,"Sacramento","High Resource"]
[6067008404,"Sacramento","High Resource"]
[6067008702,"Sacramento","High Resource"]
[6067008912,"Sacramento","High Resource"]
[6067009307,"Sacramento","High Resource"]
[6067009309,"Sacramento","High Resource"]
[6067009310,"Sacramento","High Resource"]
[6067009312,"Sacramento","High Resource"]
[6067009314,"Sacramento","High Resource"]
[6067009322,"Sacramento","High Resource"]
[6067009323,"Sacramento","High Resource"]
[6067009326,"Sacramento","High Resource"]
[6067009328,"Sacramento","High Resource"]
[6067009329,"Sacramento","High Resource"]
[6067009330,"Sacramento","High Resource"]
[6067009331,"Sacramento","High Resource"]
[6067009332,"Sacramento","High Resource"]
[6067009403,"Sacramento","High Resource"]
[6067009406,"Sacramento","High Resource"]
[6067009408,"Sacramento","High Resource"]
[6067009612,"Sacramento","High Resource"]
[6067009615,"Sacramento","High Resource"]
[6067009616,"Sacramento","High Resource"]
[6067009617,"Sacramento","High Resource"]
[6067009618,"Sacramento","High Resource"]
[6067009619,"Sacramento","High Resource"]
[6069000802,"San Benito","High Resource"]
[6071000208,"San Bernardino","High Resource"]
[6071000401,"San Bernardino","High Resource"]
[6071000403,"San Bernardino","High Resource"]
[6071000404,"San Bernardino","High Resource"]
[6071000604,"San Bernardino","High Resource"]
[6071000605,"San Bernardino","High Resource"]
[6071000606,"San Bernardino","High Resource"]
[6071000808,"San Bernardino","High Resource"]
[6071000821,"San Bernardino","High Resource"]
[6071000901,"San Bernardino","High Resource"]
[6071000903,"San Bernardino","High Resource"]
[6071000904,"San Bernardino","High Resource"]
[6071001200,"San Bernardino","High Resource"]
[6071001311,"San Bernardino","High Resource"]
[6071001702,"San Bernardino","High Resource"]
[6071001703,"San Bernardino","High Resource"]
[6071001804,"San Bernardino","High Resource"]
[6071001903,"San Bernardino","High Resource"]
[6071001905,"San Bernardino","High Resource"]
[6071001906,"San Bernardino","High Resource"]
[6071002016,"San Bernardino","High Resource"]
[6071002027,"San Bernardino","High Resource"]
[6071002038,"San Bernardino","High Resource"]
[6071002103,"San Bernardino","High Resource"]
[6071002107,"San Bernardino","High Resource"]
[6071002206,"San Bernardino","High Resource"]
[6071002304,"San Bernardino","High Resource"]
[6071002305,"San Bernardino","High Resource"]
[6071002703,"San Bernardino","High Resource"]
[6071007104,"San Bernardino","High Resource"]
[6071007105,"San Bernardino","High Resource"]
[6071007302,"San Bernardino","High Resource"]
[6071007306,"San Bernardino","High Resource"]
[6071008001,"San Bernardino","High Resource"]
[6071008100,"San Bernardino","High Resource"]
[6071008401,"San Bernardino","High Resource"]
[6071008402,"San Bernardino","High Resource"]
[6071008404,"San Bernardino","High Resource"]
[6071008601,"San Bernardino","High Resource"]
[6071008602,"San Bernardino","High Resource"]
[6071008706,"San Bernardino","High Resource"]
[6071008708,"San Bernardino","High Resource"]
[6071008709,"San Bernardino","High Resource"]
[6071008800,"San Bernardino","High Resource"]
[6071009107,"San Bernardino","High Resource"]
[6071009108,"San Bernardino","High Resource"]
[6071009109,"San Bernardino","High Resource"]
[6071009711,"San Bernardino","High Resource"]
[6071009717,"San Bernardino","High Resource"]
[6071010023,"San Bernardino","High Resource"]
[6071010024,"San Bernardino","High Resource"]
[6071010416,"San Bernardino","High Resource"]
[6071010419,"San Bernardino","High Resource"]
[6071010420,"San Bernardino","High Resource"]
[6071010804,"San Bernardino","High Resource"]
[6071011001,"San Bernardino","High Resource"]
[6071011002,"San Bernardino","High Resource"]
[6071011203,"San Bernardino","High Resource"]
[6071011206,"San Bernardino","High Resource"]
[6071012700,"San Bernardino","High Resource"]
[6073000100,"San Diego","High Resource"]
[6073000201,"San Diego","High Resource"]
[6073000202,"San Diego","High Resource"]
[6073000300,"San Diego","High Resource"]
[6073000400,"San Diego","High Resource"]
[6073000500,"San Diego","High Resource"]
[6073000600,"San Diego","High Resource"]
[6073000700,"San Diego","High Resource"]
[6073000800,"San Diego","High Resource"]
[6073000900,"San Diego","High Resource"]
[6073001000,"San Diego","High Resource"]
[6073001100,"San Diego","High Resource"]
[6073001200,"San Diego","High Resource"]
[6073001300,"San Diego","High Resource"]
[6073001400,"San Diego","High Resource"]
[6073001500,"San Diego","High Resource"]
[6073001900,"San Diego","High Resource"]
[6073002001,"San Diego","High Resource"]
[6073004200,"San Diego","High Resource"]
[6073004300,"San Diego","High Resource"]
[6073004400,"San Diego","High Resource"]
[6073005600,"San Diego","High Resource"]
[6073005900,"San Diego","High Resource"]
[6073006000,"San Diego","High Resource"]
[6073006100,"San Diego","High Resource"]
[6073006200,"San Diego","High Resource"]
[6073006801,"San Diego","High Resource"]
[6073006802,"San Diego","High Resource"]
[6073006900,"San Diego","High Resource"]
[6073007600,"San Diego","High Resource"]
[6073007903,"San Diego","High Resource"]
[6073007905,"San Diego","High Resource"]
[6073008305,"San Diego","High Resource"]
[6073008339,"San Diego","High Resource"]
[6073008341,"San Diego","High Resource"]
[6073008343,"San Diego","High Resource"]
[6073008344,"San Diego","High Resource"]
[6073008345,"San Diego","High Resource"]
[6073008350,"San Diego","High Resource"]
[6073008351,"San Diego","High Resource"]
[6073008352,"San Diego","High Resource"]
[6073008353,"San Diego","High Resource"]
[6073008355,"San Diego","High Resource"]
[6073008357,"San Diego","High Resource"]
[6073008358,"San Diego","High Resource"]
[6073008359,"San Diego","High Resource"]
[6073008360,"San Diego","High Resource"]
[6073008363,"San Diego","High Resource"]
[6073008501,"San Diego","High Resource"]
[6073008502,"San Diego","High Resource"]
[6073008503,"San Diego","High Resource"]
[6073008504,"San Diego","High Resource"]
[6073008510,"San Diego","High Resource"]
[6073008512,"San Diego","High Resource"]
[6073008513,"San Diego","High Resource"]
[6073008701,"San Diego","High Resource"]
[6073008702,"San Diego","High Resource"]
[6073008901,"San Diego","High Resource"]
[6073008902,"San Diego","High Resource"]
[6073009102,"San Diego","High Resource"]
[6073009103,"San Diego","High Resource"]
[6073009104,"San Diego","High Resource"]
[6073009106,"San Diego","High Resource"]
[6073009107,"San Diego","High Resource"]
[6073009201,"San Diego","High Resource"]
[6073009202,"San Diego","High Resource"]
[6073009301,"San Diego","High Resource"]
[6073009304,"San Diego","High Resource"]
[6073009305,"San Diego","High Resource"]
[6073009306,"San Diego","High Resource"]
[6073009400,"San Diego","High Resource"]
[6073009502,"San Diego","High Resource"]
[6073009509,"San Diego","High Resource"]
[6073009602,"San Diego","High Resource"]
[6073009603,"San Diego","High Resource"]
[6073009604,"San Diego","High Resource"]
[6073009703,"San Diego","High Resource"]
[6073009802,"San Diego","High Resource"]
[6073009804,"San Diego","High Resource"]
[6073010601,"San Diego","High Resource"]
[6073010800,"San Diego","High Resource"]
[6073013311,"San Diego","High Resource"]
[6073013410,"San Diego","High Resource"]
[6073013411,"San Diego","High Resource"]
[6073013414,"San Diego","High Resource"]
[6073013415,"San Diego","High Resource"]
[6073013417,"San Diego","High Resource"]
[6073013418,"San Diego","High Resource"]
[6073013419,"San Diego","High Resource"]
[6073013420,"San Diego","High Resource"]
[6073013421,"San Diego","High Resource"]
[6073013701,"San Diego","High Resource"]
[6073014804,"San Diego","High Resource"]
[6073015200,"San Diego","High Resource"]
[6073017009,"San Diego","High Resource"]
[6073017010,"San Diego","High Resource"]
[6073017014,"San Diego","High Resource"]
[6073017018,"San Diego","High Resource"]
[6073017019,"San Diego","High Resource"]
[6073017021,"San Diego","High Resource"]
[6073017031,"San Diego","High Resource"]
[6073017035,"San Diego","High Resource"]
[6073017040,"San Diego","High Resource"]
[6073017041,"San Diego","High Resource"]
[6073017048,"San Diego","High Resource"]
[6073017049,"San Diego","High Resource"]
[6073017050,"San Diego","High Resource"]
[6073017051,"San Diego","High Resource"]
[6073017054,"San Diego","High Resource"]
[6073017404,"San Diego","High Resource"]
[6073017502,"San Diego","High Resource"]
[6073017813,"San Diego","High Resource"]
[6073017900,"San Diego","High Resource"]
[6073019103,"San Diego","High Resource"]
[6073019803,"San Diego","High Resource"]
[6073020020,"San Diego","High Resource"]
[6073020026,"San Diego","High Resource"]
[6073020801,"San Diego","High Resource"]
[6073020807,"San Diego","High Resource"]
[6073020809,"San Diego","High Resource"]
[6073020904,"San Diego","High Resource"]
[6073021205,"San Diego","High Resource"]
[6073021400,"San Diego","High Resource"]
[6073021600,"San Diego","High Resource"]
[6073021800,"San Diego","High Resource"]
[6075010200,"San Francisco","High Resource"]
[6075010300,"San Francisco","High Resource"]
[6075010400,"San Francisco","High Resource"]
[6075010500,"San Francisco","High Resource"]
[6075010800,"San Francisco","High Resource"]
[6075010900,"San Francisco","High Resource"]
[6075011000,"San Francisco","High Resource"]
[6075011100,"San Francisco","High Resource"]
[6075011200,"San Francisco","High Resource"]
[6075012800,"San Francisco","High Resource"]
[6075013101,"San Francisco","High Resource"]
[6075013200,"San Francisco","High Resource"]
[6075013500,"San Francisco","High Resource"]
[6075015300,"San Francisco","High Resource"]
[6075015801,"San Francisco","High Resource"]
[6075015802,"San Francisco","High Resource"]
[6075016300,"San Francisco","High Resource"]
[6075016400,"San Francisco","High Resource"]
[6075016801,"San Francisco","High Resource"]
[6075016900,"San Francisco","High Resource"]
[6075020300,"San Francisco","High Resource"]
[6075020402,"San Francisco","High Resource"]
[6075020500,"San Francisco","High Resource"]
[6075020600,"San Francisco","High Resource"]
[6075020700,"San Francisco","High Resource"]
[6075021000,"San Francisco","High Resource"]
[6075021500,"San Francisco","High Resource"]
[6075021700,"San Francisco","High Resource"]
[6075021800,"San Francisco","High Resource"]
[6075022702,"San Francisco","High Resource"]
[6075022704,"San Francisco","High Resource"]
[6075031100,"San Francisco","High Resource"]
[6075032602,"San Francisco","High Resource"]
[6075032801,"San Francisco","High Resource"]
[6075032802,"San Francisco","High Resource"]
[6075032901,"San Francisco","High Resource"]
[6075032902,"San Francisco","High Resource"]
[6075033000,"San Francisco","High Resource"]
[6075033100,"San Francisco","High Resource"]
[6075035201,"San Francisco","High Resource"]
[6075035202,"San Francisco","High Resource"]
[6075035300,"San Francisco","High Resource"]
[6075035400,"San Francisco","High Resource"]
[6075042601,"San Francisco","High Resource"]
[6075042700,"San Francisco","High Resource"]
[6075045200,"San Francisco","High Resource"]
[6075047802,"San Francisco","High Resource"]
[6075047901,"San Francisco","High Resource"]
[6075047902,"San Francisco","High Resource"]
[6075060400,"San Francisco","High Resource"]
[6077003108,"San Joaquin","High Resource"]
[6077003109,"San Joaquin","High Resource"]
[6077003111,"San Joaquin","High Resource"]
[6077003112,"San Joaquin","High Resource"]
[6077003203,"San Joaquin","High Resource"]
[6077003209,"San Joaquin","High Resource"]
[6077003214,"San Joaquin","High Resource"]
[6077003500,"San Joaquin","High Resource"]
[6077003601,"San Joaquin","High Resource"]
[6077003602,"San Joaquin","High Resource"]
[6077003801,"San Joaquin","High Resource"]
[6077004002,"San Joaquin","High Resource"]
[6077004106,"San Joaquin","High Resource"]
[6077004202,"San Joaquin","High Resource"]
[6077004204,"San Joaquin","High Resource"]
[6077004305,"San Joaquin","High Resource"]
[6077004307,"San Joaquin","High Resource"]
[6077004901,"San Joaquin","High Resource"]
[6077005001,"San Joaquin","High Resource"]
[6077005106,"San Joaquin","High Resource"]
[6077005113,"San Joaquin","High Resource"]
[6077005114,"San Joaquin","High Resource"]
[6077005122,"San Joaquin","High Resource"]
[6077005123,"San Joaquin","High Resource"]
[6077005124,"San Joaquin","High Resource"]
[6077005125,"San Joaquin","High Resource"]
[6077005126,"San Joaquin","High Resource"]
[6077005132,"San Joaquin","High Resource"]
[6077005133,"San Joaquin","High Resource"]
[6077005134,"San Joaquin","High Resource"]
[6077005135,"San Joaquin","High Resource"]
[6077005202,"San Joaquin","High Resource"]
[6077005302,"San Joaquin","High Resource"]
[6077005303,"San Joaquin","High Resource"]
[6077005305,"San Joaquin","High Resource"]
[6077005307,"San Joaquin","High Resource"]
[6077005308,"San Joaquin","High Resource"]
[6077005405,"San Joaquin","High Resource"]
[6077005502,"San Joaquin","High Resource"]
[6079010403,"San Luis Obispo","High Resource"]
[6079010503,"San Luis Obispo","High Resource"]
[6079010603,"San Luis Obispo","High Resource"]
[6079010701,"San Luis Obispo","High Resource"]
[6079011101,"San Luis Obispo","High Resource"]
[6079011200,"San Luis Obispo","High Resource"]
[6079011300,"San Luis Obispo","High Resource"]
[6079011701,"San Luis Obispo","High Resource"]
[6079011800,"San Luis Obispo","High Resource"]
[6079011901,"San Luis Obispo","High Resource"]
[6079011902,"San Luis Obispo","High Resource"]
[6079012505,"San Luis Obispo","High Resource"]
[6079012900,"San Luis Obispo","High Resource"]
[6079013000,"San Luis Obispo","High Resource"]
[6081600401,"San Mateo","High Resource"]
[6081600500,"San Mateo","High Resource"]
[6081600900,"San Mateo","High Resource"]
[6081601100,"San Mateo","High Resource"]
[6081601603,"San Mateo","High Resource"]
[6081601605,"San Mateo","High Resource"]
[6081601700,"San Mateo","High Resource"]
[6081601800,"San Mateo","High Resource"]
[6081601901,"San Mateo","High Resource"]
[6081601902,"San Mateo","High Resource"]
[6081602500,"San Mateo","High Resource"]
[6081602600,"San Mateo","High Resource"]
[6081602700,"San Mateo","High Resource"]
[6081602800,"San Mateo","High Resource"]
[6081602900,"San Mateo","High Resource"]
[6081603000,"San Mateo","High Resource"]
[6081603100,"San Mateo","High Resource"]
[6081603200,"San Mateo","High Resource"]
[6081603400,"San Mateo","High Resource"]
[6081603700,"San Mateo","High Resource"]
[6081603801,"San Mateo","High Resource"]
[6081603802,"San Mateo","High Resource"]
[6081604400,"San Mateo","High Resource"]
[6081604500,"San Mateo","High Resource"]
[6081604600,"San Mateo","High Resource"]
[6081604800,"San Mateo","High Resource"]
[6081605400,"San Mateo","High Resource"]
[6081605500,"San Mateo","High Resource"]
[6081605900,"San Mateo","High Resource"]
[6081606300,"San Mateo","High Resource"]
[6081606400,"San Mateo","High Resource"]
[6081606700,"San Mateo","High Resource"]
[6081606900,"San Mateo","High Resource"]
[6081607000,"San Mateo","High Resource"]
[6081607100,"San Mateo","High Resource"]
[6081607200,"San Mateo","High Resource"]
[6081607300,"San Mateo","High Resource"]
[6081608400,"San Mateo","High Resource"]
[6081608501,"San Mateo","High Resource"]
[6081608502,"San Mateo","High Resource"]
[6081608600,"San Mateo","High Resource"]
[6081609202,"San Mateo","High Resource"]
[6081609700,"San Mateo","High Resource"]
[6081609800,"San Mateo","High Resource"]
[6081610100,"San Mateo","High Resource"]
[6081611100,"San Mateo","High Resource"]
[6081613000,"San Mateo","High Resource"]
[6081613700,"San Mateo","High Resource"]
[6083000102,"Santa Barbara","High Resource"]
[6083000200,"Santa Barbara","High Resource"]
[6083000302,"Santa Barbara","High Resource"]
[6083000400,"Santa Barbara","High Resource"]
[6083000600,"Santa Barbara","High Resource"]
[6083001203,"Santa Barbara","High Resource"]
[6083001306,"Santa Barbara","High Resource"]
[6083001706,"Santa Barbara","High Resource"]
[6083001901,"Santa Barbara","High Resource"]
[6083002005,"Santa Barbara","High Resource"]
[6083002008,"Santa Barbara","High Resource"]
[6083002009,"Santa Barbara","High Resource"]
[6083002010,"Santa Barbara","High Resource"]
[6083002012,"Santa Barbara","High Resource"]
[6083002013,"Santa Barbara","High Resource"]
[6083002906,"Santa Barbara","High Resource"]
[6083002909,"Santa Barbara","High Resource"]
[6083002915,"Santa Barbara","High Resource"]
[6083002930,"Santa Barbara","High Resource"]
[6083002932,"Santa Barbara","High Resource"]
[6083003001,"Santa Barbara","High Resource"]
[6083003005,"Santa Barbara","High Resource"]
[6085500500,"Santa Clara","High Resource"]
[6085502301,"Santa Clara","High Resource"]
[6085502302,"Santa Clara","High Resource"]
[6085502400,"Santa Clara","High Resource"]
[6085502500,"Santa Clara","High Resource"]
[6085502601,"Santa Clara","High Resource"]
[6085502603,"Santa Clara","High Resource"]
[6085502604,"Santa Clara","High Resource"]
[6085502701,"Santa Clara","High Resource"]
[6085502702,"Santa Clara","High Resource"]
[6085502800,"Santa Clara","High Resource"]
[6085502901,"Santa Clara","High Resource"]
[6085502902,"Santa Clara","High Resource"]
[6085502903,"Santa Clara","High Resource"]
[6085502907,"Santa Clara","High Resource"]
[6085502908,"Santa Clara","High Resource"]
[6085503001,"Santa Clara","High Resource"]
[6085503003,"Santa Clara","High Resource"]
[6085503313,"Santa Clara","High Resource"]
[6085503329,"Santa Clara","High Resource"]
[6085503331,"Santa Clara","High Resource"]
[6085503332,"Santa Clara","High Resource"]
[6085503333,"Santa Clara","High Resource"]
[6085503334,"Santa Clara","High Resource"]
[6085504308,"Santa Clara","High Resource"]
[6085504320,"Santa Clara","High Resource"]
[6085504411,"Santa Clara","High Resource"]
[6085504413,"Santa Clara","High Resource"]
[6085504414,"Santa Clara","High Resource"]
[6085504415,"Santa Clara","High Resource"]
[6085504416,"Santa Clara","High Resource"]
[6085504417,"Santa Clara","High Resource"]
[6085504420,"Santa Clara","High Resource"]
[6085504421,"Santa Clara","High Resource"]
[6085504422,"Santa Clara","High Resource"]
[6085504423,"Santa Clara","High Resource"]
[6085504505,"Santa Clara","High Resource"]
[6085504507,"Santa Clara","High Resource"]
[6085504803,"Santa Clara","High Resource"]
[6085504901,"Santa Clara","High Resource"]
[6085505008,"Santa Clara","High Resource"]
[6085505402,"Santa Clara","High Resource"]
[6085505403,"Santa Clara","High Resource"]
[6085505800,"Santa Clara","High Resource"]
[6085505900,"Santa Clara","High Resource"]
[6085506000,"Santa Clara","High Resource"]
[6085506203,"Santa Clara","High Resource"]
[6085506204,"Santa Clara","High Resource"]
[6085506601,"Santa Clara","High Resource"]
[6085506603,"Santa Clara","High Resource"]
[6085506605,"Santa Clara","High Resource"]
[6085506702,"Santa Clara","High Resource"]
[6085506703,"Santa Clara","High Resource"]
[6085506802,"Santa Clara","High Resource"]
[6085506803,"Santa Clara","High Resource"]
[6085507205,"Santa Clara","High Resource"]
[6085508202,"Santa Clara","High Resource"]
[6085508504,"Santa Clara","High Resource"]
[6085508505,"Santa Clara","High Resource"]
[6085508507,"Santa Clara","High Resource"]
[6085508601,"Santa Clara","High Resource"]
[6085508602,"Santa Clara","High Resource"]
[6085508703,"Santa Clara","High Resource"]
[6085509102,"Santa Clara","High Resource"]
[6085509105,"Santa Clara","High Resource"]
[6085509107,"Santa Clara","High Resource"]
[6085509108,"Santa Clara","High Resource"]
[6085509201,"Santa Clara","High Resource"]
[6085509202,"Santa Clara","High Resource"]
[6085509302,"Santa Clara","High Resource"]
[6085509500,"Santa Clara","High Resource"]
[6085511705,"Santa Clara","High Resource"]
[6085511911,"Santa Clara","High Resource"]
[6085511916,"Santa Clara","High Resource"]
[6085512047,"Santa Clara","High Resource"]
[6085512503,"Santa Clara","High Resource"]
[6085513000,"Santa Clara","High Resource"]
[6085513500,"Santa Clara","High Resource"]
[6087100100,"Santa Cruz","High Resource"]
[6087100900,"Santa Cruz","High Resource"]
[6087101100,"Santa Cruz","High Resource"]
[6087120301,"Santa Cruz","High Resource"]
[6087120900,"Santa Cruz","High Resource"]
[6087121403,"Santa Cruz","High Resource"]
[6087121600,"Santa Cruz","High Resource"]
[6087121700,"Santa Cruz","High Resource"]
[6087122002,"Santa Cruz","High Resource"]
[6087122003,"Santa Cruz","High Resource"]
[6087122100,"Santa Cruz","High Resource"]
[6089010300,"Shasta","High Resource"]
[6089010500,"Shasta","High Resource"]
[6089010703,"Shasta","High Resource"]
[6089010803,"Shasta","High Resource"]
[6089010805,"Shasta","High Resource"]
[6089011402,"Shasta","High Resource"]
[6089011403,"Shasta","High Resource"]
[6089011701,"Shasta","High Resource"]
[6089011802,"Shasta","High Resource"]
[6089012604,"Shasta","High Resource"]
[6093000300,"Siskiyou","High Resource"]
[6093000701,"Siskiyou","High Resource"]
[6093001200,"Siskiyou","High Resource"]
[6095252000,"Solano","High Resource"]
[6095252104,"Solano","High Resource"]
[6095252105,"Solano","High Resource"]
[6095252106,"Solano","High Resource"]
[6095252108,"Solano","High Resource"]
[6095253403,"Solano","High Resource"]
[6097150607,"Sonoma","High Resource"]
[6097150610,"Sonoma","High Resource"]
[6097151503,"Sonoma","High Resource"]
[6097151504,"Sonoma","High Resource"]
[6097151601,"Sonoma","High Resource"]
[6097151602,"Sonoma","High Resource"]
[6097153401,"Sonoma","High Resource"]
[6097153706,"Sonoma","High Resource"]
[6097153804,"Sonoma","High Resource"]
[6097153806,"Sonoma","High Resource"]
[6097153903,"Sonoma","High Resource"]
[6097154100,"Sonoma","High Resource"]
[6097154303,"Sonoma","High Resource"]
[6099000202,"Stanislaus","High Resource"]
[6099000203,"Stanislaus","High Resource"]
[6099000403,"Stanislaus","High Resource"]
[6099000404,"Stanislaus","High Resource"]
[6099000501,"Stanislaus","High Resource"]
[6099000503,"Stanislaus","High Resource"]
[6099000505,"Stanislaus","High Resource"]
[6099000506,"Stanislaus","High Resource"]
[6099000806,"Stanislaus","High Resource"]
[6099000807,"Stanislaus","High Resource"]
[6099000908,"Stanislaus","High Resource"]
[6099000909,"Stanislaus","High Resource"]
[6099001001,"Stanislaus","High Resource"]
[6099001100,"Stanislaus","High Resource"]
[6099001300,"Stanislaus","High Resource"]
[6099002005,"Stanislaus","High Resource"]
[6099002006,"Stanislaus","High Resource"]
[6099002701,"Stanislaus","High Resource"]
[6099002801,"Stanislaus","High Resource"]
[6099002803,"Stanislaus","High Resource"]
[6099003604,"Stanislaus","High Resource"]
[6099003805,"Stanislaus","High Resource"]
[6099003904,"Stanislaus","High Resource"]
[6099003907,"Stanislaus","High Resource"]
[6099003909,"Stanislaus","High Resource"]
[6099004000,"Stanislaus","High Resource"]
[6101050504,"Sutter","High Resource"]
[6101050603,"Sutter","High Resource"]
[6101050701,"Sutter","High Resource"]
[6101051000,"Sutter","High Resource"]
[6103000100,"Tehama","High Resource"]
[6103000600,"Tehama","High Resource"]
[6105000101,"Trinity","High Resource"]
[6107000301,"Tulare","High Resource"]
[6107000401,"Tulare","High Resource"]
[6107000402,"Tulare","High Resource"]
[6107000701,"Tulare","High Resource"]
[6107001006,"Tulare","High Resource"]
[6107001703,"Tulare","High Resource"]
[6107001704,"Tulare","High Resource"]
[6107001902,"Tulare","High Resource"]
[6107002002,"Tulare","High Resource"]
[6107002003,"Tulare","High Resource"]
[6107002007,"Tulare","High Resource"]
[6107002009,"Tulare","High Resource"]
[6107002100,"Tulare","High Resource"]
[6107002500,"Tulare","High Resource"]
[6107002602,"Tulare","High Resource"]
[6107003501,"Tulare","High Resource"]
[6109001100,"Tuolumne","High Resource"]
[6109002100,"Tuolumne","High Resource"]
[6111000902,"Ventura","High Resource"]
[6111001102,"Ventura","High Resource"]
[6111001201,"Ventura","High Resource"]
[6111001401,"Ventura","High Resource"]
[6111001402,"Ventura","High Resource"]
[6111001506,"Ventura","High Resource"]
[6111001507,"Ventura","High Resource"]
[6111001601,"Ventura","High Resource"]
[6111001602,"Ventura","High Resource"]
[6111001900,"Ventura","High Resource"]
[6111002000,"Ventura","High Resource"]
[6111002700,"Ventura","High Resource"]
[6111005202,"Ventura","High Resource"]
[6111005203,"Ventura","High Resource"]
[6111005205,"Ventura","High Resource"]
[6111005303,"Ventura","High Resource"]
[6111005305,"Ventura","High Resource"]
[6111005306,"Ventura","High Resource"]
[6111005401,"Ventura","High Resource"]
[6111005404,"Ventura","High Resource"]
[6111005502,"Ventura","High Resource"]
[6111005503,"Ventura","High Resource"]
[6111005504,"Ventura","High Resource"]
[6111005700,"Ventura","High Resource"]
[6111005911,"Ventura","High Resource"]
[6111006000,"Ventura","High Resource"]
[6111006500,"Ventura","High Resource"]
[6111006800,"Ventura","High Resource"]
[6111006900,"Ventura","High Resource"]
[6111007100,"Ventura","High Resource"]
[6111007506,"Ventura","High Resource"]
[6111007513,"Ventura","High Resource"]
[6111007514,"Ventura","High Resource"]
[6111007612,"Ventura","High Resource"]
[6111007613,"Ventura","High Resource"]
[6111007614,"Ventura","High Resource"]
[6111007903,"Ventura","High Resource"]
[6111008303,"Ventura","High Resource"]
[6111008304,"Ventura","High Resource"]
[6111008402,"Ventura","High Resource"]
[6111008500,"Ventura","High Resource"]
[6113010302,"Yolo","High Resource"]
[6113010310,"Yolo","High Resource"]
[6113010312,"Yolo","High Resource"]
[6113010501,"Yolo","High Resource"]
[6113010505,"Yolo","High Resource"]
[6113010608,"Yolo","High Resource"]
[6113011002,"Yolo","High Resource"]
[6113011203,"Yolo","High Resource"]
[6113011205,"Yolo","High Resource"]
[6113011500,"Yolo","High Resource"]
[6115040200,"Yuba","High Resource"]
[6115040303,"Yuba","High Resource"]
[6115040700,"Yuba","High Resource"]
[6001401300,"Alameda","High Segregation & Poverty"]
[6001401400,"Alameda","High Segregation & Poverty"]
[6001401800,"Alameda","High Segregation & Poverty"]
[6001402500,"Alameda","High Segregation & Poverty"]
[6001402600,"Alameda","High Segregation & Poverty"]
[6001402800,"Alameda","High Segregation & Poverty"]
[6001403100,"Alameda","High Segregation & Poverty"]
[6001405800,"Alameda","High Segregation & Poverty"]
[6001405901,"Alameda","High Segregation & Poverty"]
[6001405902,"Alameda","High Segregation & Poverty"]
[6001406000,"Alameda","High Segregation & Poverty"]
[6001406202,"Alameda","High Segregation & Poverty"]
[6001407200,"Alameda","High Segregation & Poverty"]
[6001407500,"Alameda","High Segregation & Poverty"]
[6001408400,"Alameda","High Segregation & Poverty"]
[6001408600,"Alameda","High Segregation & Poverty"]
[6001408700,"Alameda","High Segregation & Poverty"]
[6001408800,"Alameda","High Segregation & Poverty"]
[6001408900,"Alameda","High Segregation & Poverty"]
[6001409100,"Alameda","High Segregation & Poverty"]
[6001409300,"Alameda","High Segregation & Poverty"]
[6001409500,"Alameda","High Segregation & Poverty"]
[6001410500,"Alameda","High Segregation & Poverty"]
[6007001300,"Butte","High Segregation & Poverty"]
[6007002800,"Butte","High Segregation & Poverty"]
[6007003001,"Butte","High Segregation & Poverty"]
[6007003002,"Butte","High Segregation & Poverty"]
[6013307202,"Contra Costa","High Segregation & Poverty"]
[6013365002,"Contra Costa","High Segregation & Poverty"]
[6013369001,"Contra Costa","High Segregation & Poverty"]
[6015000104,"Del Norte","High Segregation & Poverty"]
[6019000200,"Fresno","High Segregation & Poverty"]
[6019000300,"Fresno","High Segregation & Poverty"]
[6019000400,"Fresno","High Segregation & Poverty"]
[6019000501,"Fresno","High Segregation & Poverty"]
[6019000502,"Fresno","High Segregation & Poverty"]
[6019000600,"Fresno","High Segregation & Poverty"]
[6019000700,"Fresno","High Segregation & Poverty"]
[6019000800,"Fresno","High Segregation & Poverty"]
[6019000901,"Fresno","High Segregation & Poverty"]
[6019000902,"Fresno","High Segregation & Poverty"]
[6019001000,"Fresno","High Segregation & Poverty"]
[6019001100,"Fresno","High Segregation & Poverty"]
[6019001201,"Fresno","High Segregation & Poverty"]
[6019001202,"Fresno","High Segregation & Poverty"]
[6019001301,"Fresno","High Segregation & Poverty"]
[6019001303,"Fresno","High Segregation & Poverty"]
[6019001304,"Fresno","High Segregation & Poverty"]
[6019001407,"Fresno","High Segregation & Poverty"]
[6019001408,"Fresno","High Segregation & Poverty"]
[6019002000,"Fresno","High Segregation & Poverty"]
[6019002300,"Fresno","High Segregation & Poverty"]
[6019002400,"Fresno","High Segregation & Poverty"]
[6019002501,"Fresno","High Segregation & Poverty"]
[6019002502,"Fresno","High Segregation & Poverty"]
[6019002601,"Fresno","High Segregation & Poverty"]
[6019002701,"Fresno","High Segregation & Poverty"]
[6019002702,"Fresno","High Segregation & Poverty"]
[6019002800,"Fresno","High Segregation & Poverty"]
[6019002903,"Fresno","High Segregation & Poverty"]
[6019002905,"Fresno","High Segregation & Poverty"]
[6019002906,"Fresno","High Segregation & Poverty"]
[6019003003,"Fresno","High Segregation & Poverty"]
[6019003201,"Fresno","High Segregation & Poverty"]
[6019003202,"Fresno","High Segregation & Poverty"]
[6019003302,"Fresno","High Segregation & Poverty"]
[6019003400,"Fresno","High Segregation & Poverty"]
[6019003702,"Fresno","High Segregation & Poverty"]
[6019003805,"Fresno","High Segregation & Poverty"]
[6019003807,"Fresno","High Segregation & Poverty"]
[6019003900,"Fresno","High Segregation & Poverty"]
[6019004205,"Fresno","High Segregation & Poverty"]
[6019004404,"Fresno","High Segregation & Poverty"]
[6019004505,"Fresno","High Segregation & Poverty"]
[6019004701,"Fresno","High Segregation & Poverty"]
[6019004703,"Fresno","High Segregation & Poverty"]
[6019004704,"Fresno","High Segregation & Poverty"]
[6019004801,"Fresno","High Segregation & Poverty"]
[6019004802,"Fresno","High Segregation & Poverty"]
[6019005100,"Fresno","High Segregation & Poverty"]
[6019005202,"Fresno","High Segregation & Poverty"]
[6019005203,"Fresno","High Segregation & Poverty"]
[6019005204,"Fresno","High Segregation & Poverty"]
[6019005302,"Fresno","High Segregation & Poverty"]
[6019005403,"Fresno","High Segregation & Poverty"]
[6019005804,"Fresno","High Segregation & Poverty"]
[6019006201,"Fresno","High Segregation & Poverty"]
[6019006501,"Fresno","High Segregation & Poverty"]
[6019006502,"Fresno","High Segregation & Poverty"]
[6019006602,"Fresno","High Segregation & Poverty"]
[6019006604,"Fresno","High Segregation & Poverty"]
[6019006802,"Fresno","High Segregation & Poverty"]
[6019006900,"Fresno","High Segregation & Poverty"]
[6019007100,"Fresno","High Segregation & Poverty"]
[6019007400,"Fresno","High Segregation & Poverty"]
[6019007600,"Fresno","High Segregation & Poverty"]
[6019007802,"Fresno","High Segregation & Poverty"]
[6019008200,"Fresno","High Segregation & Poverty"]
[6019008301,"Fresno","High Segregation & Poverty"]
[6019008302,"Fresno","High Segregation & Poverty"]
[6019008401,"Fresno","High Segregation & Poverty"]
[6019008501,"Fresno","High Segregation & Poverty"]
[6019008502,"Fresno","High Segregation & Poverty"]
[6023000100,"Humboldt","High Segregation & Poverty"]
[6023000300,"Humboldt","High Segregation & Poverty"]
[6025011400,"Imperial","High Segregation & Poverty"]
[6029000600,"Kern","High Segregation & Poverty"]
[6029001102,"Kern","High Segregation & Poverty"]
[6029001103,"Kern","High Segregation & Poverty"]
[6029001201,"Kern","High Segregation & Poverty"]
[6029001202,"Kern","High Segregation & Poverty"]
[6029001300,"Kern","High Segregation & Poverty"]
[6029001400,"Kern","High Segregation & Poverty"]
[6029001500,"Kern","High Segregation & Poverty"]
[6029001600,"Kern","High Segregation & Poverty"]
[6029001902,"Kern","High Segregation & Poverty"]
[6029002000,"Kern","High Segregation & Poverty"]
[6029002100,"Kern","High Segregation & Poverty"]
[6029002200,"Kern","High Segregation & Poverty"]
[6029002301,"Kern","High Segregation & Poverty"]
[6029002302,"Kern","High Segregation & Poverty"]
[6029002500,"Kern","High Segregation & Poverty"]
[6029002600,"Kern","High Segregation & Poverty"]
[6029002812,"Kern","High Segregation & Poverty"]
[6029002813,"Kern","High Segregation & Poverty"]
[6029002900,"Kern","High Segregation & Poverty"]
[6029003000,"Kern","High Segregation & Poverty"]
[6029003115,"Kern","High Segregation & Poverty"]
[6029003121,"Kern","High Segregation & Poverty"]
[6029004102,"Kern","High Segregation & Poverty"]
[6029004200,"Kern","High Segregation & Poverty"]
[6029004402,"Kern","High Segregation & Poverty"]
[6029004500,"Kern","High Segregation & Poverty"]
[6029004701,"Kern","High Segregation & Poverty"]
[6029004702,"Kern","High Segregation & Poverty"]
[6029004800,"Kern","High Segregation & Poverty"]
[6029004901,"Kern","High Segregation & Poverty"]
[6029005003,"Kern","High Segregation & Poverty"]
[6029005300,"Kern","High Segregation & Poverty"]
[6029005508,"Kern","High Segregation & Poverty"]
[6029005600,"Kern","High Segregation & Poverty"]
[6029005900,"Kern","High Segregation & Poverty"]
[6029006304,"Kern","High Segregation & Poverty"]
[6029006401,"Kern","High Segregation & Poverty"]
[6029006403,"Kern","High Segregation & Poverty"]
[6029006404,"Kern","High Segregation & Poverty"]
[6031001100,"Kings","High Segregation & Poverty"]
[6031001300,"Kings","High Segregation & Poverty"]
[6031001401,"Kings","High Segregation & Poverty"]
[6031001402,"Kings","High Segregation & Poverty"]
[6031001601,"Kings","High Segregation & Poverty"]
[6031001701,"Kings","High Segregation & Poverty"]
[6033000502,"Lake","High Segregation & Poverty"]
[6033000701,"Lake","High Segregation & Poverty"]
[6033000702,"Lake","High Segregation & Poverty"]
[6033000801,"Lake","High Segregation & Poverty"]
[6033000802,"Lake","High Segregation & Poverty"]
[6035040304,"Lassen","High Segregation & Poverty"]
[6037104701,"Los Angeles","High Segregation & Poverty"]
[6037104703,"Los Angeles","High Segregation & Poverty"]
[6037106405,"Los Angeles","High Segregation & Poverty"]
[6037115302,"Los Angeles","High Segregation & Poverty"]
[6037117201,"Los Angeles","High Segregation & Poverty"]
[6037117405,"Los Angeles","High Segregation & Poverty"]
[6037117407,"Los Angeles","High Segregation & Poverty"]
[6037117408,"Los Angeles","High Segregation & Poverty"]
[6037117510,"Los Angeles","High Segregation & Poverty"]
[6037117520,"Los Angeles","High Segregation & Poverty"]
[6037117530,"Los Angeles","High Segregation & Poverty"]
[6037119320,"Los Angeles","High Segregation & Poverty"]
[6037119340,"Los Angeles","High Segregation & Poverty"]
[6037120030,"Los Angeles","High Segregation & Poverty"]
[6037120103,"Los Angeles","High Segregation & Poverty"]
[6037120104,"Los Angeles","High Segregation & Poverty"]
[6037120105,"Los Angeles","High Segregation & Poverty"]
[6037120106,"Los Angeles","High Segregation & Poverty"]
[6037120107,"Los Angeles","High Segregation & Poverty"]
[6037120108,"Los Angeles","High Segregation & Poverty"]
[6037122410,"Los Angeles","High Segregation & Poverty"]
[6037123010,"Los Angeles","High Segregation & Poverty"]
[6037123203,"Los Angeles","High Segregation & Poverty"]
[6037123204,"Los Angeles","High Segregation & Poverty"]
[6037123206,"Los Angeles","High Segregation & Poverty"]
[6037124105,"Los Angeles","High Segregation & Poverty"]
[6037124204,"Los Angeles","High Segregation & Poverty"]
[6037127103,"Los Angeles","High Segregation & Poverty"]
[6037127520,"Los Angeles","High Segregation & Poverty"]
[6037127603,"Los Angeles","High Segregation & Poverty"]
[6037128102,"Los Angeles","High Segregation & Poverty"]
[6037128210,"Los Angeles","High Segregation & Poverty"]
[6037128302,"Los Angeles","High Segregation & Poverty"]
[6037128303,"Los Angeles","High Segregation & Poverty"]
[6037134305,"Los Angeles","High Segregation & Poverty"]
[6037134521,"Los Angeles","High Segregation & Poverty"]
[6037134710,"Los Angeles","High Segregation & Poverty"]
[6037183810,"Los Angeles","High Segregation & Poverty"]
[6037183820,"Los Angeles","High Segregation & Poverty"]
[6037186301,"Los Angeles","High Segregation & Poverty"]
[6037190510,"Los Angeles","High Segregation & Poverty"]
[6037190901,"Los Angeles","High Segregation & Poverty"]
[6037190902,"Los Angeles","High Segregation & Poverty"]
[6037191302,"Los Angeles","High Segregation & Poverty"]
[6037191410,"Los Angeles","High Segregation & Poverty"]
[6037191710,"Los Angeles","High Segregation & Poverty"]
[6037191720,"Los Angeles","High Segregation & Poverty"]
[6037191810,"Los Angeles","High Segregation & Poverty"]
[6037195710,"Los Angeles","High Segregation & Poverty"]
[6037197700,"Los Angeles","High Segregation & Poverty"]
[6037199000,"Los Angeles","High Segregation & Poverty"]
[6037199120,"Los Angeles","High Segregation & Poverty"]
[6037199201,"Los Angeles","High Segregation & Poverty"]
[6037199700,"Los Angeles","High Segregation & Poverty"]
[6037199900,"Los Angeles","High Segregation & Poverty"]
[6037201401,"Los Angeles","High Segregation & Poverty"]
[6037201504,"Los Angeles","High Segregation & Poverty"]
[6037203100,"Los Angeles","High Segregation & Poverty"]
[6037203200,"Los Angeles","High Segregation & Poverty"]
[6037203300,"Los Angeles","High Segregation & Poverty"]
[6037203500,"Los Angeles","High Segregation & Poverty"]
[6037203710,"Los Angeles","High Segregation & Poverty"]
[6037203720,"Los Angeles","High Segregation & Poverty"]
[6037204200,"Los Angeles","High Segregation & Poverty"]
[6037204300,"Los Angeles","High Segregation & Poverty"]
[6037204410,"Los Angeles","High Segregation & Poverty"]
[6037204420,"Los Angeles","High Segregation & Poverty"]
[6037204600,"Los Angeles","High Segregation & Poverty"]
[6037204920,"Los Angeles","High Segregation & Poverty"]
[6037205110,"Los Angeles","High Segregation & Poverty"]
[6037205120,"Los Angeles","High Segregation & Poverty"]
[6037206010,"Los Angeles","High Segregation & Poverty"]
[6037206032,"Los Angeles","High Segregation & Poverty"]
[6037206050,"Los Angeles","High Segregation & Poverty"]
[6037206200,"Los Angeles","High Segregation & Poverty"]
[6037206300,"Los Angeles","High Segregation & Poverty"]
[6037207101,"Los Angeles","High Segregation & Poverty"]
[6037207102,"Los Angeles","High Segregation & Poverty"]
[6037207103,"Los Angeles","High Segregation & Poverty"]
[6037207502,"Los Angeles","High Segregation & Poverty"]
[6037208000,"Los Angeles","High Segregation & Poverty"]
[6037208301,"Los Angeles","High Segregation & Poverty"]
[6037208302,"Los Angeles","High Segregation & Poverty"]
[6037208720,"Los Angeles","High Segregation & Poverty"]
[6037208801,"Los Angeles","High Segregation & Poverty"]
[6037208802,"Los Angeles","High Segregation & Poverty"]
[6037208902,"Los Angeles","High Segregation & Poverty"]
[6037208903,"Los Angeles","High Segregation & Poverty"]
[6037208904,"Los Angeles","High Segregation & Poverty"]
[6037209102,"Los Angeles","High Segregation & Poverty"]
[6037209103,"Los Angeles","High Segregation & Poverty"]
[6037209104,"Los Angeles","High Segregation & Poverty"]
[6037209200,"Los Angeles","High Segregation & Poverty"]
[6037209300,"Los Angeles","High Segregation & Poverty"]
[6037209401,"Los Angeles","High Segregation & Poverty"]
[6037209402,"Los Angeles","High Segregation & Poverty"]
[6037209403,"Los Angeles","High Segregation & Poverty"]
[6037209510,"Los Angeles","High Segregation & Poverty"]
[6037209520,"Los Angeles","High Segregation & Poverty"]
[6037209810,"Los Angeles","High Segregation & Poverty"]
[6037209820,"Los Angeles","High Segregation & Poverty"]
[6037210010,"Los Angeles","High Segregation & Poverty"]
[6037211122,"Los Angeles","High Segregation & Poverty"]
[6037211310,"Los Angeles","High Segregation & Poverty"]
[6037211804,"Los Angeles","High Segregation & Poverty"]
[6037212203,"Los Angeles","High Segregation & Poverty"]
[6037212204,"Los Angeles","High Segregation & Poverty"]
[6037212303,"Los Angeles","High Segregation & Poverty"]
[6037212304,"Los Angeles","High Segregation & Poverty"]
[6037212305,"Los Angeles","High Segregation & Poverty"]
[6037212620,"Los Angeles","High Segregation & Poverty"]
[6037218120,"Los Angeles","High Segregation & Poverty"]
[6037218210,"Los Angeles","High Segregation & Poverty"]
[6037219800,"Los Angeles","High Segregation & Poverty"]
[6037219901,"Los Angeles","High Segregation & Poverty"]
[6037220100,"Los Angeles","High Segregation & Poverty"]
[6037221110,"Los Angeles","High Segregation & Poverty"]
[6037221120,"Los Angeles","High Segregation & Poverty"]
[6037221303,"Los Angeles","High Segregation & Poverty"]
[6037221401,"Los Angeles","High Segregation & Poverty"]
[6037221500,"Los Angeles","High Segregation & Poverty"]
[6037221601,"Los Angeles","High Segregation & Poverty"]
[6037221602,"Los Angeles","High Segregation & Poverty"]
[6037221710,"Los Angeles","High Segregation & Poverty"]
[6037221900,"Los Angeles","High Segregation & Poverty"]
[6037222100,"Los Angeles","High Segregation & Poverty"]
[6037222200,"Los Angeles","High Segregation & Poverty"]
[6037222500,"Los Angeles","High Segregation & Poverty"]
[6037224010,"Los Angeles","High Segregation & Poverty"]
[6037224020,"Los Angeles","High Segregation & Poverty"]
[6037224310,"Los Angeles","High Segregation & Poverty"]
[6037224320,"Los Angeles","High Segregation & Poverty"]
[6037224420,"Los Angeles","High Segregation & Poverty"]
[6037224600,"Los Angeles","High Segregation & Poverty"]
[6037226001,"Los Angeles","High Segregation & Poverty"]
[6037226002,"Los Angeles","High Segregation & Poverty"]
[6037226410,"Los Angeles","High Segregation & Poverty"]
[6037226420,"Los Angeles","High Segregation & Poverty"]
[6037226700,"Los Angeles","High Segregation & Poverty"]
[6037227010,"Los Angeles","High Segregation & Poverty"]
[6037227020,"Los Angeles","High Segregation & Poverty"]
[6037228210,"Los Angeles","High Segregation & Poverty"]
[6037228220,"Los Angeles","High Segregation & Poverty"]
[6037228310,"Los Angeles","High Segregation & Poverty"]
[6037228320,"Los Angeles","High Segregation & Poverty"]
[6037228410,"Los Angeles","High Segregation & Poverty"]
[6037228420,"Los Angeles","High Segregation & Poverty"]
[6037228500,"Los Angeles","High Segregation & Poverty"]
[6037228600,"Los Angeles","High Segregation & Poverty"]
[6037228710,"Los Angeles","High Segregation & Poverty"]
[6037228720,"Los Angeles","High Segregation & Poverty"]
[6037228800,"Los Angeles","High Segregation & Poverty"]
[6037228900,"Los Angeles","High Segregation & Poverty"]
[6037229100,"Los Angeles","High Segregation & Poverty"]
[6037229200,"Los Angeles","High Segregation & Poverty"]
[6037229300,"Los Angeles","High Segregation & Poverty"]
[6037229410,"Los Angeles","High Segregation & Poverty"]
[6037229420,"Los Angeles","High Segregation & Poverty"]
[6037231100,"Los Angeles","High Segregation & Poverty"]
[6037231210,"Los Angeles","High Segregation & Poverty"]
[6037231220,"Los Angeles","High Segregation & Poverty"]
[6037231300,"Los Angeles","High Segregation & Poverty"]
[6037231600,"Los Angeles","High Segregation & Poverty"]
[6037231710,"Los Angeles","High Segregation & Poverty"]
[6037231720,"Los Angeles","High Segregation & Poverty"]
[6037231800,"Los Angeles","High Segregation & Poverty"]
[6037231900,"Los Angeles","High Segregation & Poverty"]
[6037232110,"Los Angeles","High Segregation & Poverty"]
[6037232120,"Los Angeles","High Segregation & Poverty"]
[6037232200,"Los Angeles","High Segregation & Poverty"]
[6037232300,"Los Angeles","High Segregation & Poverty"]
[6037232500,"Los Angeles","High Segregation & Poverty"]
[6037232600,"Los Angeles","High Segregation & Poverty"]
[6037232700,"Los Angeles","High Segregation & Poverty"]
[6037232800,"Los Angeles","High Segregation & Poverty"]
[6037234901,"Los Angeles","High Segregation & Poverty"]
[6037236202,"Los Angeles","High Segregation & Poverty"]
[6037236204,"Los Angeles","High Segregation & Poverty"]
[6037237101,"Los Angeles","High Segregation & Poverty"]
[6037237102,"Los Angeles","High Segregation & Poverty"]
[6037237401,"Los Angeles","High Segregation & Poverty"]
[6037237500,"Los Angeles","High Segregation & Poverty"]
[6037237710,"Los Angeles","High Segregation & Poverty"]
[6037237720,"Los Angeles","High Segregation & Poverty"]
[6037238310,"Los Angeles","High Segregation & Poverty"]
[6037238320,"Los Angeles","High Segregation & Poverty"]
[6037239201,"Los Angeles","High Segregation & Poverty"]
[6037239202,"Los Angeles","High Segregation & Poverty"]
[6037239310,"Los Angeles","High Segregation & Poverty"]
[6037239320,"Los Angeles","High Segregation & Poverty"]
[6037239330,"Los Angeles","High Segregation & Poverty"]
[6037239502,"Los Angeles","High Segregation & Poverty"]
[6037239601,"Los Angeles","High Segregation & Poverty"]
[6037239602,"Los Angeles","High Segregation & Poverty"]
[6037239701,"Los Angeles","High Segregation & Poverty"]
[6037239702,"Los Angeles","High Segregation & Poverty"]
[6037239801,"Los Angeles","High Segregation & Poverty"]
[6037239802,"Los Angeles","High Segregation & Poverty"]
[6037240010,"Los Angeles","High Segregation & Poverty"]
[6037240020,"Los Angeles","High Segregation & Poverty"]
[6037240200,"Los Angeles","High Segregation & Poverty"]
[6037240401,"Los Angeles","High Segregation & Poverty"]
[6037240402,"Los Angeles","High Segregation & Poverty"]
[6037240500,"Los Angeles","High Segregation & Poverty"]
[6037240800,"Los Angeles","High Segregation & Poverty"]
[6037240900,"Los Angeles","High Segregation & Poverty"]
[6037241001,"Los Angeles","High Segregation & Poverty"]
[6037241110,"Los Angeles","High Segregation & Poverty"]
[6037241120,"Los Angeles","High Segregation & Poverty"]
[6037241202,"Los Angeles","High Segregation & Poverty"]
[6037241400,"Los Angeles","High Segregation & Poverty"]
[6037242000,"Los Angeles","High Segregation & Poverty"]
[6037242100,"Los Angeles","High Segregation & Poverty"]
[6037242200,"Los Angeles","High Segregation & Poverty"]
[6037242300,"Los Angeles","High Segregation & Poverty"]
[6037242600,"Los Angeles","High Segregation & Poverty"]
[6037242700,"Los Angeles","High Segregation & Poverty"]
[6037243000,"Los Angeles","High Segregation & Poverty"]
[6037243100,"Los Angeles","High Segregation & Poverty"]
[6037291110,"Los Angeles","High Segregation & Poverty"]
[6037292000,"Los Angeles","High Segregation & Poverty"]
[6037293202,"Los Angeles","High Segregation & Poverty"]
[6037294410,"Los Angeles","High Segregation & Poverty"]
[6037294610,"Los Angeles","High Segregation & Poverty"]
[6037294701,"Los Angeles","High Segregation & Poverty"]
[6037294810,"Los Angeles","High Segregation & Poverty"]
[6037294820,"Los Angeles","High Segregation & Poverty"]
[6037294830,"Los Angeles","High Segregation & Poverty"]
[6037296210,"Los Angeles","High Segregation & Poverty"]
[6037296220,"Los Angeles","High Segregation & Poverty"]
[6037297110,"Los Angeles","High Segregation & Poverty"]
[6037402303,"Los Angeles","High Segregation & Poverty"]
[6037402304,"Los Angeles","High Segregation & Poverty"]
[6037402702,"Los Angeles","High Segregation & Poverty"]
[6037402801,"Los Angeles","High Segregation & Poverty"]
[6037402902,"Los Angeles","High Segregation & Poverty"]
[6037404201,"Los Angeles","High Segregation & Poverty"]
[6037408800,"Los Angeles","High Segregation & Poverty"]
[6037432802,"Los Angeles","High Segregation & Poverty"]
[6037433305,"Los Angeles","High Segregation & Poverty"]
[6037433403,"Los Angeles","High Segregation & Poverty"]
[6037433501,"Los Angeles","High Segregation & Poverty"]
[6037433602,"Los Angeles","High Segregation & Poverty"]
[6037433801,"Los Angeles","High Segregation & Poverty"]
[6037433901,"Los Angeles","High Segregation & Poverty"]
[6037461502,"Los Angeles","High Segregation & Poverty"]
[6037461902,"Los Angeles","High Segregation & Poverty"]
[6037462201,"Los Angeles","High Segregation & Poverty"]
[6037462202,"Los Angeles","High Segregation & Poverty"]
[6037482304,"Los Angeles","High Segregation & Poverty"]
[6037530902,"Los Angeles","High Segregation & Poverty"]
[6037531301,"Los Angeles","High Segregation & Poverty"]
[6037532605,"Los Angeles","High Segregation & Poverty"]
[6037532606,"Los Angeles","High Segregation & Poverty"]
[6037532800,"Los Angeles","High Segregation & Poverty"]
[6037532900,"Los Angeles","High Segregation & Poverty"]
[6037533103,"Los Angeles","High Segregation & Poverty"]
[6037533104,"Los Angeles","High Segregation & Poverty"]
[6037533105,"Los Angeles","High Segregation & Poverty"]
[6037533107,"Los Angeles","High Segregation & Poverty"]
[6037533201,"Los Angeles","High Segregation & Poverty"]
[6037533300,"Los Angeles","High Segregation & Poverty"]
[6037533403,"Los Angeles","High Segregation & Poverty"]
[6037533503,"Los Angeles","High Segregation & Poverty"]
[6037533701,"Los Angeles","High Segregation & Poverty"]
[6037533702,"Los Angeles","High Segregation & Poverty"]
[6037533806,"Los Angeles","High Segregation & Poverty"]
[6037533901,"Los Angeles","High Segregation & Poverty"]
[6037534001,"Los Angeles","High Segregation & Poverty"]
[6037534101,"Los Angeles","High Segregation & Poverty"]
[6037534102,"Los Angeles","High Segregation & Poverty"]
[6037534201,"Los Angeles","High Segregation & Poverty"]
[6037534202,"Los Angeles","High Segregation & Poverty"]
[6037534301,"Los Angeles","High Segregation & Poverty"]
[6037534302,"Los Angeles","High Segregation & Poverty"]
[6037534404,"Los Angeles","High Segregation & Poverty"]
[6037534803,"Los Angeles","High Segregation & Poverty"]
[6037535002,"Los Angeles","High Segregation & Poverty"]
[6037535101,"Los Angeles","High Segregation & Poverty"]
[6037535102,"Los Angeles","High Segregation & Poverty"]
[6037535300,"Los Angeles","High Segregation & Poverty"]
[6037535400,"Los Angeles","High Segregation & Poverty"]
[6037535606,"Los Angeles","High Segregation & Poverty"]
[6037540201,"Los Angeles","High Segregation & Poverty"]
[6037540202,"Los Angeles","High Segregation & Poverty"]
[6037540400,"Los Angeles","High Segregation & Poverty"]
[6037540502,"Los Angeles","High Segregation & Poverty"]
[6037540600,"Los Angeles","High Segregation & Poverty"]
[6037540901,"Los Angeles","High Segregation & Poverty"]
[6037541400,"Los Angeles","High Segregation & Poverty"]
[6037541603,"Los Angeles","High Segregation & Poverty"]
[6037541604,"Los Angeles","High Segregation & Poverty"]
[6037541801,"Los Angeles","High Segregation & Poverty"]
[6037542105,"Los Angeles","High Segregation & Poverty"]
[6037542501,"Los Angeles","High Segregation & Poverty"]
[6037542502,"Los Angeles","High Segregation & Poverty"]
[6037542601,"Los Angeles","High Segregation & Poverty"]
[6037543905,"Los Angeles","High Segregation & Poverty"]
[6037550000,"Los Angeles","High Segregation & Poverty"]
[6037552602,"Los Angeles","High Segregation & Poverty"]
[6037554105,"Los Angeles","High Segregation & Poverty"]
[6037555211,"Los Angeles","High Segregation & Poverty"]
[6037555212,"Los Angeles","High Segregation & Poverty"]
[6037570403,"Los Angeles","High Segregation & Poverty"]
[6037570603,"Los Angeles","High Segregation & Poverty"]
[6037571600,"Los Angeles","High Segregation & Poverty"]
[6037571704,"Los Angeles","High Segregation & Poverty"]
[6037572500,"Los Angeles","High Segregation & Poverty"]
[6037572800,"Los Angeles","High Segregation & Poverty"]
[6037573002,"Los Angeles","High Segregation & Poverty"]
[6037573003,"Los Angeles","High Segregation & Poverty"]
[6037573004,"Los Angeles","High Segregation & Poverty"]
[6037573300,"Los Angeles","High Segregation & Poverty"]
[6037575101,"Los Angeles","High Segregation & Poverty"]
[6037575102,"Los Angeles","High Segregation & Poverty"]
[6037575202,"Los Angeles","High Segregation & Poverty"]
[6037575401,"Los Angeles","High Segregation & Poverty"]
[6037575402,"Los Angeles","High Segregation & Poverty"]
[6037575801,"Los Angeles","High Segregation & Poverty"]
[6037575802,"Los Angeles","High Segregation & Poverty"]
[6037575803,"Los Angeles","High Segregation & Poverty"]
[6037575901,"Los Angeles","High Segregation & Poverty"]
[6037575902,"Los Angeles","High Segregation & Poverty"]
[6037576200,"Los Angeles","High Segregation & Poverty"]
[6037576401,"Los Angeles","High Segregation & Poverty"]
[6037576403,"Los Angeles","High Segregation & Poverty"]
[6037576502,"Los Angeles","High Segregation & Poverty"]
[6037576901,"Los Angeles","High Segregation & Poverty"]
[6037600100,"Los Angeles","High Segregation & Poverty"]
[6037600201,"Los Angeles","High Segregation & Poverty"]
[6037600302,"Los Angeles","High Segregation & Poverty"]
[6037600303,"Los Angeles","High Segregation & Poverty"]
[6037600304,"Los Angeles","High Segregation & Poverty"]
[6037600602,"Los Angeles","High Segregation & Poverty"]
[6037601501,"Los Angeles","High Segregation & Poverty"]
[6037601700,"Los Angeles","High Segregation & Poverty"]
[6037601801,"Los Angeles","High Segregation & Poverty"]
[6037602505,"Los Angeles","High Segregation & Poverty"]
[6037602801,"Los Angeles","High Segregation & Poverty"]
[6037701100,"Los Angeles","High Segregation & Poverty"]
[6037900506,"Los Angeles","High Segregation & Poverty"]
[6037900602,"Los Angeles","High Segregation & Poverty"]
[6037900605,"Los Angeles","High Segregation & Poverty"]
[6037900606,"Los Angeles","High Segregation & Poverty"]
[6037900607,"Los Angeles","High Segregation & Poverty"]
[6037900608,"Los Angeles","High Segregation & Poverty"]
[6037900609,"Los Angeles","High Segregation & Poverty"]
[6037900701,"Los Angeles","High Segregation & Poverty"]
[6037900703,"Los Angeles","High Segregation & Poverty"]
[6037900806,"Los Angeles","High Segregation & Poverty"]
[6037901010,"Los Angeles","High Segregation & Poverty"]
[6037910101,"Los Angeles","High Segregation & Poverty"]
[6037910402,"Los Angeles","High Segregation & Poverty"]
[6037910403,"Los Angeles","High Segregation & Poverty"]
[6037910501,"Los Angeles","High Segregation & Poverty"]
[6037910504,"Los Angeles","High Segregation & Poverty"]
[6037910601,"Los Angeles","High Segregation & Poverty"]
[6037910602,"Los Angeles","High Segregation & Poverty"]
[6037980010,"Los Angeles","High Segregation & Poverty"]
[6039000602,"Madera","High Segregation & Poverty"]
[6039000603,"Madera","High Segregation & Poverty"]
[6039000604,"Madera","High Segregation & Poverty"]
[6039000800,"Madera","High Segregation & Poverty"]
[6039000900,"Madera","High Segregation & Poverty"]
[6041112201,"Marin","High Segregation & Poverty"]
[6041129000,"Marin","High Segregation & Poverty"]
[6047001003,"Merced","High Segregation & Poverty"]
[6047001004,"Merced","High Segregation & Poverty"]
[6047001005,"Merced","High Segregation & Poverty"]
[6047001301,"Merced","High Segregation & Poverty"]
[6047001302,"Merced","High Segregation & Poverty"]
[6047001401,"Merced","High Segregation & Poverty"]
[6047001502,"Merced","High Segregation & Poverty"]
[6047001503,"Merced","High Segregation & Poverty"]
[6047001601,"Merced","High Segregation & Poverty"]
[6047001700,"Merced","High Segregation & Poverty"]
[6047001901,"Merced","High Segregation & Poverty"]
[6047002201,"Merced","High Segregation & Poverty"]
[6053000501,"Monterey","High Segregation & Poverty"]
[6053000701,"Monterey","High Segregation & Poverty"]
[6053000702,"Monterey","High Segregation & Poverty"]
[6053000900,"Monterey","High Segregation & Poverty"]
[6053001300,"Monterey","High Segregation & Poverty"]
[6053010607,"Monterey","High Segregation & Poverty"]
[6053014102,"Monterey","High Segregation & Poverty"]
[6059001801,"Orange","High Segregation & Poverty"]
[6059011720,"Orange","High Segregation & Poverty"]
[6059063605,"Orange","High Segregation & Poverty"]
[6059074405,"Orange","High Segregation & Poverty"]
[6059074407,"Orange","High Segregation & Poverty"]
[6059074501,"Orange","High Segregation & Poverty"]
[6059074805,"Orange","High Segregation & Poverty"]
[6059074806,"Orange","High Segregation & Poverty"]
[6059074902,"Orange","High Segregation & Poverty"]
[6059075002,"Orange","High Segregation & Poverty"]
[6059075003,"Orange","High Segregation & Poverty"]
[6059075004,"Orange","High Segregation & Poverty"]
[6059087403,"Orange","High Segregation & Poverty"]
[6059087405,"Orange","High Segregation & Poverty"]
[6059087504,"Orange","High Segregation & Poverty"]
[6059087803,"Orange","High Segregation & Poverty"]
[6059099402,"Orange","High Segregation & Poverty"]
[6059099802,"Orange","High Segregation & Poverty"]
[6059110603,"Orange","High Segregation & Poverty"]
[6065030103,"Riverside","High Segregation & Poverty"]
[6065030300,"Riverside","High Segregation & Poverty"]
[6065030400,"Riverside","High Segregation & Poverty"]
[6065030501,"Riverside","High Segregation & Poverty"]
[6065030502,"Riverside","High Segregation & Poverty"]
[6065030503,"Riverside","High Segregation & Poverty"]
[6065031002,"Riverside","High Segregation & Poverty"]
[6065031300,"Riverside","High Segregation & Poverty"]
[6065031602,"Riverside","High Segregation & Poverty"]
[6065040203,"Riverside","High Segregation & Poverty"]
[6065040301,"Riverside","High Segregation & Poverty"]
[6065040502,"Riverside","High Segregation & Poverty"]
[6065041001,"Riverside","High Segregation & Poverty"]
[6065041101,"Riverside","High Segregation & Poverty"]
[6065041302,"Riverside","High Segregation & Poverty"]
[6065041410,"Riverside","High Segregation & Poverty"]
[6065041703,"Riverside","High Segregation & Poverty"]
[6065042010,"Riverside","High Segregation & Poverty"]
[6065042404,"Riverside","High Segregation & Poverty"]
[6065042505,"Riverside","High Segregation & Poverty"]
[6065042515,"Riverside","High Segregation & Poverty"]
[6065042520,"Riverside","High Segregation & Poverty"]
[6065042706,"Riverside","High Segregation & Poverty"]
[6065042800,"Riverside","High Segregation & Poverty"]
[6065042904,"Riverside","High Segregation & Poverty"]
[6065043403,"Riverside","High Segregation & Poverty"]
[6065043601,"Riverside","High Segregation & Poverty"]
[6065043602,"Riverside","High Segregation & Poverty"]
[6065044101,"Riverside","High Segregation & Poverty"]
[6065044200,"Riverside","High Segregation & Poverty"]
[6065044507,"Riverside","High Segregation & Poverty"]
[6065044509,"Riverside","High Segregation & Poverty"]
[6065044510,"Riverside","High Segregation & Poverty"]
[6065044907,"Riverside","High Segregation & Poverty"]
[6065044915,"Riverside","High Segregation & Poverty"]
[6065045209,"Riverside","High Segregation & Poverty"]
[6065045303,"Riverside","High Segregation & Poverty"]
[6065045502,"Riverside","High Segregation & Poverty"]
[6065045604,"Riverside","High Segregation & Poverty"]
[6065045605,"Riverside","High Segregation & Poverty"]
[6065045609,"Riverside","High Segregation & Poverty"]
[6065045703,"Riverside","High Segregation & Poverty"]
[6065045704,"Riverside","High Segregation & Poverty"]
[6065045705,"Riverside","High Segregation & Poverty"]
[6065045706,"Riverside","High Segregation & Poverty"]
[6065046102,"Riverside","High Segregation & Poverty"]
[6065046200,"Riverside","High Segregation & Poverty"]
[6067000600,"Sacramento","High Segregation & Poverty"]
[6067002200,"Sacramento","High Segregation & Poverty"]
[6067002800,"Sacramento","High Segregation & Poverty"]
[6067003202,"Sacramento","High Segregation & Poverty"]
[6067003203,"Sacramento","High Segregation & Poverty"]
[6067003204,"Sacramento","High Segregation & Poverty"]
[6067003700,"Sacramento","High Segregation & Poverty"]
[6067004100,"Sacramento","High Segregation & Poverty"]
[6067004203,"Sacramento","High Segregation & Poverty"]
[6067004402,"Sacramento","High Segregation & Poverty"]
[6067004501,"Sacramento","High Segregation & Poverty"]
[6067004502,"Sacramento","High Segregation & Poverty"]
[6067004601,"Sacramento","High Segregation & Poverty"]
[6067004602,"Sacramento","High Segregation & Poverty"]
[6067004701,"Sacramento","High Segregation & Poverty"]
[6067004702,"Sacramento","High Segregation & Poverty"]
[6067004802,"Sacramento","High Segregation & Poverty"]
[6067004903,"Sacramento","High Segregation & Poverty"]
[6067005001,"Sacramento","High Segregation & Poverty"]
[6067005002,"Sacramento","High Segregation & Poverty"]
[6067005101,"Sacramento","High Segregation & Poverty"]
[6067005301,"Sacramento","High Segregation & Poverty"]
[6067005502,"Sacramento","High Segregation & Poverty"]
[6067005505,"Sacramento","High Segregation & Poverty"]
[6067005506,"Sacramento","High Segregation & Poverty"]
[6067005605,"Sacramento","High Segregation & Poverty"]
[6067006201,"Sacramento","High Segregation & Poverty"]
[6067006202,"Sacramento","High Segregation & Poverty"]
[6067006300,"Sacramento","High Segregation & Poverty"]
[6067006500,"Sacramento","High Segregation & Poverty"]
[6067006600,"Sacramento","High Segregation & Poverty"]
[6067006702,"Sacramento","High Segregation & Poverty"]
[6067006800,"Sacramento","High Segregation & Poverty"]
[6067006900,"Sacramento","High Segregation & Poverty"]
[6067007001,"Sacramento","High Segregation & Poverty"]
[6067007019,"Sacramento","High Segregation & Poverty"]
[6067007301,"Sacramento","High Segregation & Poverty"]
[6067007423,"Sacramento","High Segregation & Poverty"]
[6067007424,"Sacramento","High Segregation & Poverty"]
[6067008911,"Sacramento","High Segregation & Poverty"]
[6067009110,"Sacramento","High Segregation & Poverty"]
[6067009501,"Sacramento","High Segregation & Poverty"]
[6067009606,"Sacramento","High Segregation & Poverty"]
[6067009634,"Sacramento","High Segregation & Poverty"]
[6071000301,"San Bernardino","High Segregation & Poverty"]
[6071000823,"San Bernardino","High Segregation & Poverty"]
[6071001503,"San Bernardino","High Segregation & Poverty"]
[6071001504,"San Bernardino","High Segregation & Poverty"]
[6071001600,"San Bernardino","High Segregation & Poverty"]
[6071001813,"San Bernardino","High Segregation & Poverty"]
[6071002804,"San Bernardino","High Segregation & Poverty"]
[6071003102,"San Bernardino","High Segregation & Poverty"]
[6071003404,"San Bernardino","High Segregation & Poverty"]
[6071003505,"San Bernardino","High Segregation & Poverty"]
[6071003510,"San Bernardino","High Segregation & Poverty"]
[6071004101,"San Bernardino","High Segregation & Poverty"]
[6071004103,"San Bernardino","High Segregation & Poverty"]
[6071004104,"San Bernardino","High Segregation & Poverty"]
[6071004201,"San Bernardino","High Segregation & Poverty"]
[6071004202,"San Bernardino","High Segregation & Poverty"]
[6071004302,"San Bernardino","High Segregation & Poverty"]
[6071004404,"San Bernardino","High Segregation & Poverty"]
[6071004800,"San Bernardino","High Segregation & Poverty"]
[6071004900,"San Bernardino","High Segregation & Poverty"]
[6071005300,"San Bernardino","High Segregation & Poverty"]
[6071005400,"San Bernardino","High Segregation & Poverty"]
[6071005500,"San Bernardino","High Segregation & Poverty"]
[6071005600,"San Bernardino","High Segregation & Poverty"]
[6071005701,"San Bernardino","High Segregation & Poverty"]
[6071005800,"San Bernardino","High Segregation & Poverty"]
[6071006203,"San Bernardino","High Segregation & Poverty"]
[6071006204,"San Bernardino","High Segregation & Poverty"]
[6071006301,"San Bernardino","High Segregation & Poverty"]
[6071006302,"San Bernardino","High Segregation & Poverty"]
[6071006401,"San Bernardino","High Segregation & Poverty"]
[6071006402,"San Bernardino","High Segregation & Poverty"]
[6071006500,"San Bernardino","High Segregation & Poverty"]
[6071007000,"San Bernardino","High Segregation & Poverty"]
[6071007107,"San Bernardino","High Segregation & Poverty"]
[6071007200,"San Bernardino","High Segregation & Poverty"]
[6071007303,"San Bernardino","High Segregation & Poverty"]
[6071007407,"San Bernardino","High Segregation & Poverty"]
[6071007408,"San Bernardino","High Segregation & Poverty"]
[6071007601,"San Bernardino","High Segregation & Poverty"]
[6071008002,"San Bernardino","High Segregation & Poverty"]
[6071009112,"San Bernardino","High Segregation & Poverty"]
[6071009114,"San Bernardino","High Segregation & Poverty"]
[6071009116,"San Bernardino","High Segregation & Poverty"]
[6071009117,"San Bernardino","High Segregation & Poverty"]
[6071009400,"San Bernardino","High Segregation & Poverty"]
[6071009500,"San Bernardino","High Segregation & Poverty"]
[6071009716,"San Bernardino","High Segregation & Poverty"]
[6071009800,"San Bernardino","High Segregation & Poverty"]
[6071009904,"San Bernardino","High Segregation & Poverty"]
[6071009905,"San Bernardino","High Segregation & Poverty"]
[6071009912,"San Bernardino","High Segregation & Poverty"]
[6071009913,"San Bernardino","High Segregation & Poverty"]
[6071010014,"San Bernardino","High Segregation & Poverty"]
[6071012500,"San Bernardino","High Segregation & Poverty"]
[6073002201,"San Diego","High Segregation & Poverty"]
[6073002202,"San Diego","High Segregation & Poverty"]
[6073002301,"San Diego","High Segregation & Poverty"]
[6073002302,"San Diego","High Segregation & Poverty"]
[6073002601,"San Diego","High Segregation & Poverty"]
[6073002707,"San Diego","High Segregation & Poverty"]
[6073002708,"San Diego","High Segregation & Poverty"]
[6073002709,"San Diego","High Segregation & Poverty"]
[6073002710,"San Diego","High Segregation & Poverty"]
[6073003301,"San Diego","High Segregation & Poverty"]
[6073003303,"San Diego","High Segregation & Poverty"]
[6073003304,"San Diego","High Segregation & Poverty"]
[6073003305,"San Diego","High Segregation & Poverty"]
[6073003404,"San Diego","High Segregation & Poverty"]
[6073003502,"San Diego","High Segregation & Poverty"]
[6073003601,"San Diego","High Segregation & Poverty"]
[6073003603,"San Diego","High Segregation & Poverty"]
[6073003901,"San Diego","High Segregation & Poverty"]
[6073003902,"San Diego","High Segregation & Poverty"]
[6073004100,"San Diego","High Segregation & Poverty"]
[6073004700,"San Diego","High Segregation & Poverty"]
[6073004800,"San Diego","High Segregation & Poverty"]
[6073004900,"San Diego","High Segregation & Poverty"]
[6073005000,"San Diego","High Segregation & Poverty"]
[6073005100,"San Diego","High Segregation & Poverty"]
[6073005200,"San Diego","High Segregation & Poverty"]
[6073005700,"San Diego","High Segregation & Poverty"]
[6073010005,"San Diego","High Segregation & Poverty"]
[6073010013,"San Diego","High Segregation & Poverty"]
[6073010112,"San Diego","High Segregation & Poverty"]
[6073011802,"San Diego","High Segregation & Poverty"]
[6073012302,"San Diego","High Segregation & Poverty"]
[6073012401,"San Diego","High Segregation & Poverty"]
[6073012501,"San Diego","High Segregation & Poverty"]
[6073013203,"San Diego","High Segregation & Poverty"]
[6073015701,"San Diego","High Segregation & Poverty"]
[6073015703,"San Diego","High Segregation & Poverty"]
[6073015801,"San Diego","High Segregation & Poverty"]
[6073015802,"San Diego","High Segregation & Poverty"]
[6073015901,"San Diego","High Segregation & Poverty"]
[6073015902,"San Diego","High Segregation & Poverty"]
[6073016301,"San Diego","High Segregation & Poverty"]
[6073018603,"San Diego","High Segregation & Poverty"]
[6073020028,"San Diego","High Segregation & Poverty"]
[6073020202,"San Diego","High Segregation & Poverty"]
[6073020213,"San Diego","High Segregation & Poverty"]
[6073020214,"San Diego","High Segregation & Poverty"]
[6075011800,"San Francisco","High Segregation & Poverty"]
[6075012202,"San Francisco","High Segregation & Poverty"]
[6075012301,"San Francisco","High Segregation & Poverty"]
[6075012502,"San Francisco","High Segregation & Poverty"]
[6075017801,"San Francisco","High Segregation & Poverty"]
[6075017902,"San Francisco","High Segregation & Poverty"]
[6075023102,"San Francisco","High Segregation & Poverty"]
[6075023103,"San Francisco","High Segregation & Poverty"]
[6075060502,"San Francisco","High Segregation & Poverty"]
[6075061100,"San Francisco","High Segregation & Poverty"]
[6075980501,"San Francisco","High Segregation & Poverty"]
[6075980600,"San Francisco","High Segregation & Poverty"]
[6077000100,"San Joaquin","High Segregation & Poverty"]
[6077000300,"San Joaquin","High Segregation & Poverty"]
[6077000402,"San Joaquin","High Segregation & Poverty"]
[6077000500,"San Joaquin","High Segregation & Poverty"]
[6077000600,"San Joaquin","High Segregation & Poverty"]
[6077000700,"San Joaquin","High Segregation & Poverty"]
[6077000900,"San Joaquin","High Segregation & Poverty"]
[6077001600,"San Joaquin","High Segregation & Poverty"]
[6077001700,"San Joaquin","High Segregation & Poverty"]
[6077001900,"San Joaquin","High Segregation & Poverty"]
[6077002000,"San Joaquin","High Segregation & Poverty"]
[6077002201,"San Joaquin","High Segregation & Poverty"]
[6077002202,"San Joaquin","High Segregation & Poverty"]
[6077002300,"San Joaquin","High Segregation & Poverty"]
[6077002401,"San Joaquin","High Segregation & Poverty"]
[6077002503,"San Joaquin","High Segregation & Poverty"]
[6077003110,"San Joaquin","High Segregation & Poverty"]
[6077003113,"San Joaquin","High Segregation & Poverty"]
[6077003217,"San Joaquin","High Segregation & Poverty"]
[6077003307,"San Joaquin","High Segregation & Poverty"]
[6077003312,"San Joaquin","High Segregation & Poverty"]
[6077003313,"San Joaquin","High Segregation & Poverty"]
[6077003406,"San Joaquin","High Segregation & Poverty"]
[6077003407,"San Joaquin","High Segregation & Poverty"]
[6077003409,"San Joaquin","High Segregation & Poverty"]
[6077003700,"San Joaquin","High Segregation & Poverty"]
[6077004403,"San Joaquin","High Segregation & Poverty"]
[6077004404,"San Joaquin","High Segregation & Poverty"]
[6077004502,"San Joaquin","High Segregation & Poverty"]
[6083002101,"Santa Barbara","High Segregation & Poverty"]
[6083002403,"Santa Barbara","High Segregation & Poverty"]
[6083002404,"Santa Barbara","High Segregation & Poverty"]
[6083002702,"Santa Barbara","High Segregation & Poverty"]
[6083002705,"Santa Barbara","High Segregation & Poverty"]
[6085503105,"Santa Clara","High Segregation & Poverty"]
[6089010100,"Shasta","High Segregation & Poverty"]
[6089010704,"Shasta","High Segregation & Poverty"]
[6095250900,"Solano","High Segregation & Poverty"]
[6095251100,"Solano","High Segregation & Poverty"]
[6095251600,"Solano","High Segregation & Poverty"]
[6095251802,"Solano","High Segregation & Poverty"]
[6095252605,"Solano","High Segregation & Poverty"]
[6099000803,"Stanislaus","High Segregation & Poverty"]
[6099001601,"Stanislaus","High Segregation & Poverty"]
[6099001603,"Stanislaus","High Segregation & Poverty"]
[6099001604,"Stanislaus","High Segregation & Poverty"]
[6099001700,"Stanislaus","High Segregation & Poverty"]
[6099001800,"Stanislaus","High Segregation & Poverty"]
[6099002004,"Stanislaus","High Segregation & Poverty"]
[6099002100,"Stanislaus","High Segregation & Poverty"]
[6099002200,"Stanislaus","High Segregation & Poverty"]
[6099002302,"Stanislaus","High Segregation & Poverty"]
[6099002402,"Stanislaus","High Segregation & Poverty"]
[6099002602,"Stanislaus","High Segregation & Poverty"]
[6099002604,"Stanislaus","High Segregation & Poverty"]
[6099003802,"Stanislaus","High Segregation & Poverty"]
[6101050201,"Sutter","High Segregation & Poverty"]
[6101050202,"Sutter","High Segregation & Poverty"]
[6103001100,"Tehama","High Segregation & Poverty"]
[6107000201,"Tulare","High Segregation & Poverty"]
[6107000202,"Tulare","High Segregation & Poverty"]
[6107000302,"Tulare","High Segregation & Poverty"]
[6107000501,"Tulare","High Segregation & Poverty"]
[6107000600,"Tulare","High Segregation & Poverty"]
[6107000702,"Tulare","High Segregation & Poverty"]
[6107000900,"Tulare","High Segregation & Poverty"]
[6107001004,"Tulare","High Segregation & Poverty"]
[6107001100,"Tulare","High Segregation & Poverty"]
[6107001601,"Tulare","High Segregation & Poverty"]
[6107001701,"Tulare","High Segregation & Poverty"]
[6107002008,"Tulare","High Segregation & Poverty"]
[6107002202,"Tulare","High Segregation & Poverty"]
[6107002204,"Tulare","High Segregation & Poverty"]
[6107002601,"Tulare","High Segregation & Poverty"]
[6107002800,"Tulare","High Segregation & Poverty"]
[6107002901,"Tulare","High Segregation & Poverty"]
[6107003001,"Tulare","High Segregation & Poverty"]
[6107003002,"Tulare","High Segregation & Poverty"]
[6107003200,"Tulare","High Segregation & Poverty"]
[6107003400,"Tulare","High Segregation & Poverty"]
[6107003601,"Tulare","High Segregation & Poverty"]
[6107003602,"Tulare","High Segregation & Poverty"]
[6107004101,"Tulare","High Segregation & Poverty"]
[6107004200,"Tulare","High Segregation & Poverty"]
[6107004300,"Tulare","High Segregation & Poverty"]
[6107004400,"Tulare","High Segregation & Poverty"]
[6109001200,"Tuolumne","High Segregation & Poverty"]
[6111000500,"Ventura","High Segregation & Poverty"]
[6111000600,"Ventura","High Segregation & Poverty"]
[6111003201,"Ventura","High Segregation & Poverty"]
[6111004506,"Ventura","High Segregation & Poverty"]
[6111004902,"Ventura","High Segregation & Poverty"]
[6111005002,"Ventura","High Segregation & Poverty"]
[6113010203,"Yolo","High Segregation & Poverty"]
[6115040301,"Yuba","High Segregation & Poverty"]
[6115040302,"Yuba","High Segregation & Poverty"]
[6115040400,"Yuba","High Segregation & Poverty"]
[6001403800,"Alameda","Highest Resource"]
[6001404200,"Alameda","Highest Resource"]
[6001405100,"Alameda","Highest Resource"]
[6001420100,"Alameda","Highest Resource"]
[6001420200,"Alameda","Highest Resource"]
[6001420500,"Alameda","Highest Resource"]
[6001420600,"Alameda","Highest Resource"]
[6001421200,"Alameda","Highest Resource"]
[6001421300,"Alameda","Highest Resource"]
[6001421500,"Alameda","Highest Resource"]
[6001421800,"Alameda","Highest Resource"]
[6001421900,"Alameda","Highest Resource"]
[6001423800,"Alameda","Highest Resource"]
[6001426100,"Alameda","Highest Resource"]
[6001426200,"Alameda","Highest Resource"]
[6001428302,"Alameda","Highest Resource"]
[6001430101,"Alameda","Highest Resource"]
[6001430102,"Alameda","Highest Resource"]
[6001430200,"Alameda","Highest Resource"]
[6001430300,"Alameda","Highest Resource"]
[6001430400,"Alameda","Highest Resource"]
[6001441200,"Alameda","Highest Resource"]
[6001441301,"Alameda","Highest Resource"]
[6001441523,"Alameda","Highest Resource"]
[6001441524,"Alameda","Highest Resource"]
[6001441925,"Alameda","Highest Resource"]
[6001442000,"Alameda","Highest Resource"]
[6001442100,"Alameda","Highest Resource"]
[6001442200,"Alameda","Highest Resource"]
[6001443102,"Alameda","Highest Resource"]
[6001443103,"Alameda","Highest Resource"]
[6001443104,"Alameda","Highest Resource"]
[6001443105,"Alameda","Highest Resource"]
[6001443200,"Alameda","Highest Resource"]
[6001443301,"Alameda","Highest Resource"]
[6001443321,"Alameda","Highest Resource"]
[6001443322,"Alameda","Highest Resource"]
[6001450101,"Alameda","Highest Resource"]
[6001450200,"Alameda","Highest Resource"]
[6001450502,"Alameda","Highest Resource"]
[6001450603,"Alameda","Highest Resource"]
[6001450604,"Alameda","Highest Resource"]
[6001450605,"Alameda","Highest Resource"]
[6001450606,"Alameda","Highest Resource"]
[6001450607,"Alameda","Highest Resource"]
[6001450743,"Alameda","Highest Resource"]
[6001450744,"Alameda","Highest Resource"]
[6001450745,"Alameda","Highest Resource"]
[6001450750,"Alameda","Highest Resource"]
[6001450751,"Alameda","Highest Resource"]
[6001450752,"Alameda","Highest Resource"]
[6005000401,"Amador","Highest Resource"]
[6005000500,"Amador","Highest Resource"]
[6007000103,"Butte","Highest Resource"]
[6007000201,"Butte","Highest Resource"]
[6007000401,"Butte","Highest Resource"]
[6007000402,"Butte","Highest Resource"]
[6007000601,"Butte","Highest Resource"]
[6007000800,"Butte","Highest Resource"]
[6007000901,"Butte","Highest Resource"]
[6007000904,"Butte","Highest Resource"]
[6007001400,"Butte","Highest Resource"]
[6007001500,"Butte","Highest Resource"]
[6007001600,"Butte","Highest Resource"]
[6009000501,"Calaveras","Highest Resource"]
[6009000503,"Calaveras","Highest Resource"]
[6011000400,"Colusa","Highest Resource"]
[6013304003,"Contra Costa","Highest Resource"]
[6013326000,"Contra Costa","Highest Resource"]
[6013334200,"Contra Costa","Highest Resource"]
[6013340002,"Contra Costa","Highest Resource"]
[6013341000,"Contra Costa","Highest Resource"]
[6013343001,"Contra Costa","Highest Resource"]
[6013343002,"Contra Costa","Highest Resource"]
[6013343003,"Contra Costa","Highest Resource"]
[6013345101,"Contra Costa","Highest Resource"]
[6013345102,"Contra Costa","Highest Resource"]
[6013345103,"Contra Costa","Highest Resource"]
[6013345105,"Contra Costa","Highest Resource"]
[6013345108,"Contra Costa","Highest Resource"]
[6013345111,"Contra Costa","Highest Resource"]
[6013345112,"Contra Costa","Highest Resource"]
[6013345113,"Contra Costa","Highest Resource"]
[6013345114,"Contra Costa","Highest Resource"]
[6013345115,"Contra Costa","Highest Resource"]
[6013345116,"Contra Costa","Highest Resource"]
[6013345202,"Contra Costa","Highest Resource"]
[6013345203,"Contra Costa","Highest Resource"]
[6013345204,"Contra Costa","Highest Resource"]
[6013346101,"Contra Costa","Highest Resource"]
[6013346102,"Contra Costa","Highest Resource"]
[6013346201,"Contra Costa","Highest Resource"]
[6013346203,"Contra Costa","Highest Resource"]
[6013346204,"Contra Costa","Highest Resource"]
[6013347000,"Contra Costa","Highest Resource"]
[6013348000,"Contra Costa","Highest Resource"]
[6013349000,"Contra Costa","Highest Resource"]
[6013350000,"Contra Costa","Highest Resource"]
[6013351101,"Contra Costa","Highest Resource"]
[6013351200,"Contra Costa","Highest Resource"]
[6013352101,"Contra Costa","Highest Resource"]
[6013352102,"Contra Costa","Highest Resource"]
[6013352201,"Contra Costa","Highest Resource"]
[6013352202,"Contra Costa","Highest Resource"]
[6013353001,"Contra Costa","Highest Resource"]
[6013353002,"Contra Costa","Highest Resource"]
[6013354001,"Contra Costa","Highest Resource"]
[6013354002,"Contra Costa","Highest Resource"]
[6013355113,"Contra Costa","Highest Resource"]
[6013355114,"Contra Costa","Highest Resource"]
[6013355115,"Contra Costa","Highest Resource"]
[6013355116,"Contra Costa","Highest Resource"]
[6013355117,"Contra Costa","Highest Resource"]
[6013385100,"Contra Costa","Highest Resource"]
[6015000201,"Del Norte","Highest Resource"]
[6015000202,"Del Norte","Highest Resource"]
[6017030701,"El Dorado","Highest Resource"]
[6017030704,"El Dorado","Highest Resource"]
[6017030706,"El Dorado","Highest Resource"]
[6017030709,"El Dorado","Highest Resource"]
[6017030710,"El Dorado","Highest Resource"]
[6017030801,"El Dorado","Highest Resource"]
[6017030803,"El Dorado","Highest Resource"]
[6017030804,"El Dorado","Highest Resource"]
[6017030807,"El Dorado","Highest Resource"]
[6017030809,"El Dorado","Highest Resource"]
[6017030901,"El Dorado","Highest Resource"]
[6017031700,"El Dorado","Highest Resource"]
[6017031800,"El Dorado","Highest Resource"]
[6019001411,"Fresno","Highest Resource"]
[6019001412,"Fresno","Highest Resource"]
[6019001413,"Fresno","Highest Resource"]
[6019001414,"Fresno","Highest Resource"]
[6019004001,"Fresno","Highest Resource"]
[6019004208,"Fresno","Highest Resource"]
[6019004211,"Fresno","Highest Resource"]
[6019004214,"Fresno","Highest Resource"]
[6019004215,"Fresno","Highest Resource"]
[6019004216,"Fresno","Highest Resource"]
[6019004301,"Fresno","Highest Resource"]
[6019004302,"Fresno","Highest Resource"]
[6019004303,"Fresno","Highest Resource"]
[6019004405,"Fresno","Highest Resource"]
[6019004406,"Fresno","Highest Resource"]
[6019004408,"Fresno","Highest Resource"]
[6019004409,"Fresno","Highest Resource"]
[6019004506,"Fresno","Highest Resource"]
[6019004602,"Fresno","Highest Resource"]
[6019005407,"Fresno","Highest Resource"]
[6019005503,"Fresno","Highest Resource"]
[6019005504,"Fresno","Highest Resource"]
[6019005505,"Fresno","Highest Resource"]
[6019005507,"Fresno","Highest Resource"]
[6019005508,"Fresno","Highest Resource"]
[6019005509,"Fresno","Highest Resource"]
[6019005510,"Fresno","Highest Resource"]
[6019005512,"Fresno","Highest Resource"]
[6019005513,"Fresno","Highest Resource"]
[6019005514,"Fresno","Highest Resource"]
[6019005515,"Fresno","Highest Resource"]
[6019005516,"Fresno","Highest Resource"]
[6019005517,"Fresno","Highest Resource"]
[6019005518,"Fresno","Highest Resource"]
[6019005520,"Fresno","Highest Resource"]
[6019005522,"Fresno","Highest Resource"]
[6019005524,"Fresno","Highest Resource"]
[6019005525,"Fresno","Highest Resource"]
[6019005605,"Fresno","Highest Resource"]
[6019005606,"Fresno","Highest Resource"]
[6019005701,"Fresno","Highest Resource"]
[6019005702,"Fresno","Highest Resource"]
[6019005703,"Fresno","Highest Resource"]
[6019005801,"Fresno","Highest Resource"]
[6019005802,"Fresno","Highest Resource"]
[6019005805,"Fresno","Highest Resource"]
[6019005904,"Fresno","Highest Resource"]
[6019005905,"Fresno","Highest Resource"]
[6019005906,"Fresno","Highest Resource"]
[6019005907,"Fresno","Highest Resource"]
[6019005909,"Fresno","Highest Resource"]
[6019005911,"Fresno","Highest Resource"]
[6019005912,"Fresno","Highest Resource"]
[6019006300,"Fresno","Highest Resource"]
[6019006402,"Fresno","Highest Resource"]
[6019006404,"Fresno","Highest Resource"]
[6019006405,"Fresno","Highest Resource"]
[6019006700,"Fresno","Highest Resource"]
[6019007201,"Fresno","Highest Resource"]
[6019007202,"Fresno","Highest Resource"]
[6021010501,"Glenn","Highest Resource"]
[6021010502,"Glenn","Highest Resource"]
[6023000600,"Humboldt","Highest Resource"]
[6023000800,"Humboldt","Highest Resource"]
[6023000900,"Humboldt","Highest Resource"]
[6023001000,"Humboldt","Highest Resource"]
[6023010200,"Humboldt","Highest Resource"]
[6023010400,"Humboldt","Highest Resource"]
[6023010600,"Humboldt","Highest Resource"]
[6025010800,"Imperial","Highest Resource"]
[6025011000,"Imperial","Highest Resource"]
[6025011100,"Imperial","Highest Resource"]
[6025011201,"Imperial","Highest Resource"]
[6027000200,"Inyo","Highest Resource"]
[6027000300,"Inyo","Highest Resource"]
[6029000503,"Kern","Highest Resource"]
[6029000505,"Kern","Highest Resource"]
[6029000506,"Kern","Highest Resource"]
[6029000909,"Kern","Highest Resource"]
[6029001700,"Kern","Highest Resource"]
[6029002806,"Kern","Highest Resource"]
[6029002807,"Kern","Highest Resource"]
[6029002808,"Kern","Highest Resource"]
[6029002811,"Kern","Highest Resource"]
[6029002820,"Kern","Highest Resource"]
[6029002821,"Kern","Highest Resource"]
[6029003203,"Kern","Highest Resource"]
[6029003204,"Kern","Highest Resource"]
[6029003305,"Kern","Highest Resource"]
[6029003306,"Kern","Highest Resource"]
[6029003500,"Kern","Highest Resource"]
[6029003803,"Kern","Highest Resource"]
[6029003804,"Kern","Highest Resource"]
[6029003805,"Kern","Highest Resource"]
[6029003806,"Kern","Highest Resource"]
[6029003807,"Kern","Highest Resource"]
[6029003808,"Kern","Highest Resource"]
[6029003809,"Kern","Highest Resource"]
[6029003810,"Kern","Highest Resource"]
[6029003811,"Kern","Highest Resource"]
[6029003812,"Kern","Highest Resource"]
[6029003813,"Kern","Highest Resource"]
[6029003900,"Kern","Highest Resource"]
[6029005402,"Kern","Highest Resource"]
[6029005403,"Kern","Highest Resource"]
[6029005700,"Kern","Highest Resource"]
[6029006003,"Kern","Highest Resource"]
[6029006006,"Kern","Highest Resource"]
[6029006007,"Kern","Highest Resource"]
[6029006008,"Kern","Highest Resource"]
[6029006100,"Kern","Highest Resource"]
[6031000100,"Kings","Highest Resource"]
[6031000300,"Kings","Highest Resource"]
[6031000402,"Kings","Highest Resource"]
[6031000404,"Kings","Highest Resource"]
[6031000601,"Kings","Highest Resource"]
[6031000602,"Kings","Highest Resource"]
[6031001001,"Kings","Highest Resource"]
[6033000300,"Lake","Highest Resource"]
[6033001100,"Lake","Highest Resource"]
[6033001300,"Lake","Highest Resource"]
[6035040302,"Lassen","Highest Resource"]
[6035040305,"Lassen","Highest Resource"]
[6037106641,"Los Angeles","Highest Resource"]
[6037106643,"Los Angeles","Highest Resource"]
[6037108101,"Los Angeles","Highest Resource"]
[6037108103,"Los Angeles","Highest Resource"]
[6037108104,"Los Angeles","Highest Resource"]
[6037108201,"Los Angeles","Highest Resource"]
[6037108202,"Los Angeles","Highest Resource"]
[6037111204,"Los Angeles","Highest Resource"]
[6037113231,"Los Angeles","Highest Resource"]
[6037113301,"Los Angeles","Highest Resource"]
[6037124700,"Los Angeles","Highest Resource"]
[6037125600,"Los Angeles","Highest Resource"]
[6037128500,"Los Angeles","Highest Resource"]
[6037128702,"Los Angeles","Highest Resource"]
[6037128802,"Los Angeles","Highest Resource"]
[6037128910,"Los Angeles","Highest Resource"]
[6037134421,"Los Angeles","Highest Resource"]
[6037134422,"Los Angeles","Highest Resource"]
[6037134423,"Los Angeles","Highest Resource"]
[6037135202,"Los Angeles","Highest Resource"]
[6037135203,"Los Angeles","Highest Resource"]
[6037137103,"Los Angeles","Highest Resource"]
[6037137201,"Los Angeles","Highest Resource"]
[6037137301,"Los Angeles","Highest Resource"]
[6037137302,"Los Angeles","Highest Resource"]
[6037137401,"Los Angeles","Highest Resource"]
[6037137402,"Los Angeles","Highest Resource"]
[6037137502,"Los Angeles","Highest Resource"]
[6037137504,"Los Angeles","Highest Resource"]
[6037138000,"Los Angeles","Highest Resource"]
[6037139600,"Los Angeles","Highest Resource"]
[6037139701,"Los Angeles","Highest Resource"]
[6037139702,"Los Angeles","Highest Resource"]
[6037139703,"Los Angeles","Highest Resource"]
[6037139801,"Los Angeles","Highest Resource"]
[6037139802,"Los Angeles","Highest Resource"]
[6037141101,"Los Angeles","Highest Resource"]
[6037141102,"Los Angeles","Highest Resource"]
[6037141201,"Los Angeles","Highest Resource"]
[6037141202,"Los Angeles","Highest Resource"]
[6037141302,"Los Angeles","Highest Resource"]
[6037141303,"Los Angeles","Highest Resource"]
[6037141304,"Los Angeles","Highest Resource"]
[6037141400,"Los Angeles","Highest Resource"]
[6037141500,"Los Angeles","Highest Resource"]
[6037141600,"Los Angeles","Highest Resource"]
[6037141700,"Los Angeles","Highest Resource"]
[6037143100,"Los Angeles","Highest Resource"]
[6037143300,"Los Angeles","Highest Resource"]
[6037143400,"Los Angeles","Highest Resource"]
[6037143500,"Los Angeles","Highest Resource"]
[6037143602,"Los Angeles","Highest Resource"]
[6037143603,"Los Angeles","Highest Resource"]
[6037143604,"Los Angeles","Highest Resource"]
[6037143700,"Los Angeles","Highest Resource"]
[6037143800,"Los Angeles","Highest Resource"]
[6037143901,"Los Angeles","Highest Resource"]
[6037143902,"Los Angeles","Highest Resource"]
[6037181000,"Los Angeles","Highest Resource"]
[6037181300,"Los Angeles","Highest Resource"]
[6037181400,"Los Angeles","Highest Resource"]
[6037187300,"Los Angeles","Highest Resource"]
[6037188201,"Los Angeles","Highest Resource"]
[6037188202,"Los Angeles","Highest Resource"]
[6037189101,"Los Angeles","Highest Resource"]
[6037189102,"Los Angeles","Highest Resource"]
[6037189202,"Los Angeles","Highest Resource"]
[6037189300,"Los Angeles","Highest Resource"]
[6037189400,"Los Angeles","Highest Resource"]
[6037189701,"Los Angeles","Highest Resource"]
[6037189702,"Los Angeles","Highest Resource"]
[6037189800,"Los Angeles","Highest Resource"]
[6037189902,"Los Angeles","Highest Resource"]
[6037191902,"Los Angeles","Highest Resource"]
[6037192001,"Los Angeles","Highest Resource"]
[6037192002,"Los Angeles","Highest Resource"]
[6037192300,"Los Angeles","Highest Resource"]
[6037194101,"Los Angeles","Highest Resource"]
[6037194102,"Los Angeles","Highest Resource"]
[6037194200,"Los Angeles","Highest Resource"]
[6037194300,"Los Angeles","Highest Resource"]
[6037194401,"Los Angeles","Highest Resource"]
[6037194402,"Los Angeles","Highest Resource"]
[6037194500,"Los Angeles","Highest Resource"]
[6037195100,"Los Angeles","Highest Resource"]
[6037195201,"Los Angeles","Highest Resource"]
[6037195202,"Los Angeles","Highest Resource"]
[6037211000,"Los Angeles","Highest Resource"]
[6037211701,"Los Angeles","Highest Resource"]
[6037212800,"Los Angeles","Highest Resource"]
[6037214000,"Los Angeles","Highest Resource"]
[6037214100,"Los Angeles","Highest Resource"]
[6037214400,"Los Angeles","Highest Resource"]
[6037214501,"Los Angeles","Highest Resource"]
[6037214502,"Los Angeles","Highest Resource"]
[6037214503,"Los Angeles","Highest Resource"]
[6037214600,"Los Angeles","Highest Resource"]
[6037214700,"Los Angeles","Highest Resource"]
[6037214800,"Los Angeles","Highest Resource"]
[6037214901,"Los Angeles","Highest Resource"]
[6037214902,"Los Angeles","Highest Resource"]
[6037215101,"Los Angeles","Highest Resource"]
[6037215102,"Los Angeles","Highest Resource"]
[6037216100,"Los Angeles","Highest Resource"]
[6037216300,"Los Angeles","Highest Resource"]
[6037216401,"Los Angeles","Highest Resource"]
[6037216402,"Los Angeles","Highest Resource"]
[6037216800,"Los Angeles","Highest Resource"]
[6037217001,"Los Angeles","Highest Resource"]
[6037261101,"Los Angeles","Highest Resource"]
[6037261102,"Los Angeles","Highest Resource"]
[6037261200,"Los Angeles","Highest Resource"]
[6037262100,"Los Angeles","Highest Resource"]
[6037262200,"Los Angeles","Highest Resource"]
[6037262301,"Los Angeles","Highest Resource"]
[6037262302,"Los Angeles","Highest Resource"]
[6037262303,"Los Angeles","Highest Resource"]
[6037262400,"Los Angeles","Highest Resource"]
[6037262501,"Los Angeles","Highest Resource"]
[6037262601,"Los Angeles","Highest Resource"]
[6037262604,"Los Angeles","Highest Resource"]
[6037262704,"Los Angeles","Highest Resource"]
[6037262706,"Los Angeles","Highest Resource"]
[6037262802,"Los Angeles","Highest Resource"]
[6037264000,"Los Angeles","Highest Resource"]
[6037264102,"Los Angeles","Highest Resource"]
[6037264302,"Los Angeles","Highest Resource"]
[6037265100,"Los Angeles","Highest Resource"]
[6037265201,"Los Angeles","Highest Resource"]
[6037265202,"Los Angeles","Highest Resource"]
[6037265303,"Los Angeles","Highest Resource"]
[6037265304,"Los Angeles","Highest Resource"]
[6037265410,"Los Angeles","Highest Resource"]
[6037265420,"Los Angeles","Highest Resource"]
[6037265520,"Los Angeles","Highest Resource"]
[6037265601,"Los Angeles","Highest Resource"]
[6037265602,"Los Angeles","Highest Resource"]
[6037265700,"Los Angeles","Highest Resource"]
[6037267100,"Los Angeles","Highest Resource"]
[6037267200,"Los Angeles","Highest Resource"]
[6037267600,"Los Angeles","Highest Resource"]
[6037267800,"Los Angeles","Highest Resource"]
[6037267901,"Los Angeles","Highest Resource"]
[6037267902,"Los Angeles","Highest Resource"]
[6037269000,"Los Angeles","Highest Resource"]
[6037269100,"Los Angeles","Highest Resource"]
[6037269300,"Los Angeles","Highest Resource"]
[6037269500,"Los Angeles","Highest Resource"]
[6037269800,"Los Angeles","Highest Resource"]
[6037269903,"Los Angeles","Highest Resource"]
[6037269905,"Los Angeles","Highest Resource"]
[6037269906,"Los Angeles","Highest Resource"]
[6037271100,"Los Angeles","Highest Resource"]
[6037271400,"Los Angeles","Highest Resource"]
[6037271500,"Los Angeles","Highest Resource"]
[6037271600,"Los Angeles","Highest Resource"]
[6037271701,"Los Angeles","Highest Resource"]
[6037271901,"Los Angeles","Highest Resource"]
[6037271902,"Los Angeles","Highest Resource"]
[6037273100,"Los Angeles","Highest Resource"]
[6037273200,"Los Angeles","Highest Resource"]
[6037273300,"Los Angeles","Highest Resource"]
[6037273402,"Los Angeles","Highest Resource"]
[6037273502,"Los Angeles","Highest Resource"]
[6037273600,"Los Angeles","Highest Resource"]
[6037273700,"Los Angeles","Highest Resource"]
[6037273800,"Los Angeles","Highest Resource"]
[6037273902,"Los Angeles","Highest Resource"]
[6037274202,"Los Angeles","Highest Resource"]
[6037275311,"Los Angeles","Highest Resource"]
[6037275602,"Los Angeles","Highest Resource"]
[6037276000,"Los Angeles","Highest Resource"]
[6037276603,"Los Angeles","Highest Resource"]
[6037277000,"Los Angeles","Highest Resource"]
[6037278102,"Los Angeles","Highest Resource"]
[6037293301,"Los Angeles","Highest Resource"]
[6037300100,"Los Angeles","Highest Resource"]
[6037300200,"Los Angeles","Highest Resource"]
[6037300301,"Los Angeles","Highest Resource"]
[6037300400,"Los Angeles","Highest Resource"]
[6037300501,"Los Angeles","Highest Resource"]
[6037300502,"Los Angeles","Highest Resource"]
[6037300600,"Los Angeles","Highest Resource"]
[6037300701,"Los Angeles","Highest Resource"]
[6037300702,"Los Angeles","Highest Resource"]
[6037300800,"Los Angeles","Highest Resource"]
[6037300901,"Los Angeles","Highest Resource"]
[6037300902,"Los Angeles","Highest Resource"]
[6037301205,"Los Angeles","Highest Resource"]
[6037301300,"Los Angeles","Highest Resource"]
[6037310100,"Los Angeles","Highest Resource"]
[6037310201,"Los Angeles","Highest Resource"]
[6037310300,"Los Angeles","Highest Resource"]
[6037310602,"Los Angeles","Highest Resource"]
[6037311000,"Los Angeles","Highest Resource"]
[6037311200,"Los Angeles","Highest Resource"]
[6037311300,"Los Angeles","Highest Resource"]
[6037311400,"Los Angeles","Highest Resource"]
[6037311500,"Los Angeles","Highest Resource"]
[6037311600,"Los Angeles","Highest Resource"]
[6037311700,"Los Angeles","Highest Resource"]
[6037400204,"Los Angeles","Highest Resource"]
[6037400205,"Los Angeles","Highest Resource"]
[6037400206,"Los Angeles","Highest Resource"]
[6037400207,"Los Angeles","Highest Resource"]
[6037400402,"Los Angeles","Highest Resource"]
[6037400404,"Los Angeles","Highest Resource"]
[6037400501,"Los Angeles","Highest Resource"]
[6037401001,"Los Angeles","Highest Resource"]
[6037401002,"Los Angeles","Highest Resource"]
[6037401102,"Los Angeles","Highest Resource"]
[6037401201,"Los Angeles","Highest Resource"]
[6037401800,"Los Angeles","Highest Resource"]
[6037401902,"Los Angeles","Highest Resource"]
[6037403303,"Los Angeles","Highest Resource"]
[6037403304,"Los Angeles","Highest Resource"]
[6037403305,"Los Angeles","Highest Resource"]
[6037403320,"Los Angeles","Highest Resource"]
[6037403322,"Los Angeles","Highest Resource"]
[6037403323,"Los Angeles","Highest Resource"]
[6037403324,"Los Angeles","Highest Resource"]
[6037403325,"Los Angeles","Highest Resource"]
[6037403401,"Los Angeles","Highest Resource"]
[6037403402,"Los Angeles","Highest Resource"]
[6037403404,"Los Angeles","Highest Resource"]
[6037403405,"Los Angeles","Highest Resource"]
[6037403406,"Los Angeles","Highest Resource"]
[6037403407,"Los Angeles","Highest Resource"]
[6037406300,"Los Angeles","Highest Resource"]
[6037408503,"Los Angeles","Highest Resource"]
[6037408625,"Los Angeles","Highest Resource"]
[6037408628,"Los Angeles","Highest Resource"]
[6037408629,"Los Angeles","Highest Resource"]
[6037408703,"Los Angeles","Highest Resource"]
[6037430200,"Los Angeles","Highest Resource"]
[6037430301,"Los Angeles","Highest Resource"]
[6037430400,"Los Angeles","Highest Resource"]
[6037430501,"Los Angeles","Highest Resource"]
[6037430502,"Los Angeles","Highest Resource"]
[6037430600,"Los Angeles","Highest Resource"]
[6037430701,"Los Angeles","Highest Resource"]
[6037430721,"Los Angeles","Highest Resource"]
[6037430723,"Los Angeles","Highest Resource"]
[6037430724,"Los Angeles","Highest Resource"]
[6037430801,"Los Angeles","Highest Resource"]
[6037430802,"Los Angeles","Highest Resource"]
[6037430803,"Los Angeles","Highest Resource"]
[6037431600,"Los Angeles","Highest Resource"]
[6037431700,"Los Angeles","Highest Resource"]
[6037431800,"Los Angeles","Highest Resource"]
[6037431900,"Los Angeles","Highest Resource"]
[6037432000,"Los Angeles","Highest Resource"]
[6037460301,"Los Angeles","Highest Resource"]
[6037460501,"Los Angeles","Highest Resource"]
[6037460502,"Los Angeles","Highest Resource"]
[6037460600,"Los Angeles","Highest Resource"]
[6037460700,"Los Angeles","Highest Resource"]
[6037463300,"Los Angeles","Highest Resource"]
[6037463800,"Los Angeles","Highest Resource"]
[6037464000,"Los Angeles","Highest Resource"]
[6037464100,"Los Angeles","Highest Resource"]
[6037464200,"Los Angeles","Highest Resource"]
[6037480002,"Los Angeles","Highest Resource"]
[6037480011,"Los Angeles","Highest Resource"]
[6037480012,"Los Angeles","Highest Resource"]
[6037480101,"Los Angeles","Highest Resource"]
[6037480202,"Los Angeles","Highest Resource"]
[6037480400,"Los Angeles","Highest Resource"]
[6037480500,"Los Angeles","Highest Resource"]
[6037480600,"Los Angeles","Highest Resource"]
[6037480702,"Los Angeles","Highest Resource"]
[6037480703,"Los Angeles","Highest Resource"]
[6037480704,"Los Angeles","Highest Resource"]
[6037482001,"Los Angeles","Highest Resource"]
[6037500100,"Los Angeles","Highest Resource"]
[6037500201,"Los Angeles","Highest Resource"]
[6037500202,"Los Angeles","Highest Resource"]
[6037503401,"Los Angeles","Highest Resource"]
[6037503402,"Los Angeles","Highest Resource"]
[6037503602,"Los Angeles","Highest Resource"]
[6037503701,"Los Angeles","Highest Resource"]
[6037504002,"Los Angeles","Highest Resource"]
[6037554511,"Los Angeles","Highest Resource"]
[6037554512,"Los Angeles","Highest Resource"]
[6037554514,"Los Angeles","Highest Resource"]
[6037554515,"Los Angeles","Highest Resource"]
[6037554516,"Los Angeles","Highest Resource"]
[6037554517,"Los Angeles","Highest Resource"]
[6037554518,"Los Angeles","Highest Resource"]
[6037554519,"Los Angeles","Highest Resource"]
[6037571000,"Los Angeles","Highest Resource"]
[6037571102,"Los Angeles","Highest Resource"]
[6037573601,"Los Angeles","Highest Resource"]
[6037573700,"Los Angeles","Highest Resource"]
[6037574000,"Los Angeles","Highest Resource"]
[6037574100,"Los Angeles","Highest Resource"]
[6037574201,"Los Angeles","Highest Resource"]
[6037574300,"Los Angeles","Highest Resource"]
[6037574400,"Los Angeles","Highest Resource"]
[6037574602,"Los Angeles","Highest Resource"]
[6037574800,"Los Angeles","Highest Resource"]
[6037574901,"Los Angeles","Highest Resource"]
[6037577200,"Los Angeles","Highest Resource"]
[6037577300,"Los Angeles","Highest Resource"]
[6037577400,"Los Angeles","Highest Resource"]
[6037577501,"Los Angeles","Highest Resource"]
[6037577504,"Los Angeles","Highest Resource"]
[6037577603,"Los Angeles","Highest Resource"]
[6037577604,"Los Angeles","Highest Resource"]
[6037620001,"Los Angeles","Highest Resource"]
[6037620002,"Los Angeles","Highest Resource"]
[6037620101,"Los Angeles","Highest Resource"]
[6037620102,"Los Angeles","Highest Resource"]
[6037620201,"Los Angeles","Highest Resource"]
[6037620301,"Los Angeles","Highest Resource"]
[6037620303,"Los Angeles","Highest Resource"]
[6037620305,"Los Angeles","Highest Resource"]
[6037620400,"Los Angeles","Highest Resource"]
[6037620501,"Los Angeles","Highest Resource"]
[6037620521,"Los Angeles","Highest Resource"]
[6037620522,"Los Angeles","Highest Resource"]
[6037620601,"Los Angeles","Highest Resource"]
[6037620602,"Los Angeles","Highest Resource"]
[6037620701,"Los Angeles","Highest Resource"]
[6037620702,"Los Angeles","Highest Resource"]
[6037620800,"Los Angeles","Highest Resource"]
[6037620901,"Los Angeles","Highest Resource"]
[6037620904,"Los Angeles","Highest Resource"]
[6037621001,"Los Angeles","Highest Resource"]
[6037621002,"Los Angeles","Highest Resource"]
[6037621004,"Los Angeles","Highest Resource"]
[6037621102,"Los Angeles","Highest Resource"]
[6037621104,"Los Angeles","Highest Resource"]
[6037621201,"Los Angeles","Highest Resource"]
[6037621204,"Los Angeles","Highest Resource"]
[6037621301,"Los Angeles","Highest Resource"]
[6037621324,"Los Angeles","Highest Resource"]
[6037621326,"Los Angeles","Highest Resource"]
[6037621400,"Los Angeles","Highest Resource"]
[6037650001,"Los Angeles","Highest Resource"]
[6037650004,"Los Angeles","Highest Resource"]
[6037650102,"Los Angeles","Highest Resource"]
[6037650401,"Los Angeles","Highest Resource"]
[6037650501,"Los Angeles","Highest Resource"]
[6037650502,"Los Angeles","Highest Resource"]
[6037650602,"Los Angeles","Highest Resource"]
[6037650603,"Los Angeles","Highest Resource"]
[6037650604,"Los Angeles","Highest Resource"]
[6037650605,"Los Angeles","Highest Resource"]
[6037650701,"Los Angeles","Highest Resource"]
[6037650702,"Los Angeles","Highest Resource"]
[6037650800,"Los Angeles","Highest Resource"]
[6037651001,"Los Angeles","Highest Resource"]
[6037651002,"Los Angeles","Highest Resource"]
[6037651101,"Los Angeles","Highest Resource"]
[6037651102,"Los Angeles","Highest Resource"]
[6037651201,"Los Angeles","Highest Resource"]
[6037651221,"Los Angeles","Highest Resource"]
[6037651222,"Los Angeles","Highest Resource"]
[6037651302,"Los Angeles","Highest Resource"]
[6037651304,"Los Angeles","Highest Resource"]
[6037651401,"Los Angeles","Highest Resource"]
[6037651402,"Los Angeles","Highest Resource"]
[6037670201,"Los Angeles","Highest Resource"]
[6037670202,"Los Angeles","Highest Resource"]
[6037670324,"Los Angeles","Highest Resource"]
[6037670326,"Los Angeles","Highest Resource"]
[6037670328,"Los Angeles","Highest Resource"]
[6037670403,"Los Angeles","Highest Resource"]
[6037670405,"Los Angeles","Highest Resource"]
[6037670406,"Los Angeles","Highest Resource"]
[6037670407,"Los Angeles","Highest Resource"]
[6037670411,"Los Angeles","Highest Resource"]
[6037670413,"Los Angeles","Highest Resource"]
[6037670416,"Los Angeles","Highest Resource"]
[6037670500,"Los Angeles","Highest Resource"]
[6037670602,"Los Angeles","Highest Resource"]
[6037670701,"Los Angeles","Highest Resource"]
[6037670702,"Los Angeles","Highest Resource"]
[6037700101,"Los Angeles","Highest Resource"]
[6037700200,"Los Angeles","Highest Resource"]
[6037700300,"Los Angeles","Highest Resource"]
[6037700400,"Los Angeles","Highest Resource"]
[6037700501,"Los Angeles","Highest Resource"]
[6037700502,"Los Angeles","Highest Resource"]
[6037700600,"Los Angeles","Highest Resource"]
[6037700700,"Los Angeles","Highest Resource"]
[6037700801,"Los Angeles","Highest Resource"]
[6037700802,"Los Angeles","Highest Resource"]
[6037700901,"Los Angeles","Highest Resource"]
[6037700902,"Los Angeles","Highest Resource"]
[6037701000,"Los Angeles","Highest Resource"]
[6037701201,"Los Angeles","Highest Resource"]
[6037701202,"Los Angeles","Highest Resource"]
[6037701302,"Los Angeles","Highest Resource"]
[6037701304,"Los Angeles","Highest Resource"]
[6037701402,"Los Angeles","Highest Resource"]
[6037701501,"Los Angeles","Highest Resource"]
[6037701502,"Los Angeles","Highest Resource"]
[6037701601,"Los Angeles","Highest Resource"]
[6037701602,"Los Angeles","Highest Resource"]
[6037701701,"Los Angeles","Highest Resource"]
[6037701702,"Los Angeles","Highest Resource"]
[6037701802,"Los Angeles","Highest Resource"]
[6037701902,"Los Angeles","Highest Resource"]
[6037702002,"Los Angeles","Highest Resource"]
[6037702102,"Los Angeles","Highest Resource"]
[6037702201,"Los Angeles","Highest Resource"]
[6037702202,"Los Angeles","Highest Resource"]
[6037702300,"Los Angeles","Highest Resource"]
[6037702400,"Los Angeles","Highest Resource"]
[6037702501,"Los Angeles","Highest Resource"]
[6037702502,"Los Angeles","Highest Resource"]
[6037702600,"Los Angeles","Highest Resource"]
[6037702700,"Los Angeles","Highest Resource"]
[6037702801,"Los Angeles","Highest Resource"]
[6037800101,"Los Angeles","Highest Resource"]
[6037800102,"Los Angeles","Highest Resource"]
[6037800202,"Los Angeles","Highest Resource"]
[6037800203,"Los Angeles","Highest Resource"]
[6037800324,"Los Angeles","Highest Resource"]
[6037800325,"Los Angeles","Highest Resource"]
[6037800326,"Los Angeles","Highest Resource"]
[6037800327,"Los Angeles","Highest Resource"]
[6037800328,"Los Angeles","Highest Resource"]
[6037800329,"Los Angeles","Highest Resource"]
[6037800330,"Los Angeles","Highest Resource"]
[6037800331,"Los Angeles","Highest Resource"]
[6037800332,"Los Angeles","Highest Resource"]
[6037800406,"Los Angeles","Highest Resource"]
[6037800408,"Los Angeles","Highest Resource"]
[6037800410,"Los Angeles","Highest Resource"]
[6037800504,"Los Angeles","Highest Resource"]
[6037800506,"Los Angeles","Highest Resource"]
[6037910804,"Los Angeles","Highest Resource"]
[6037910808,"Los Angeles","Highest Resource"]
[6037910809,"Los Angeles","Highest Resource"]
[6037920015,"Los Angeles","Highest Resource"]
[6037920016,"Los Angeles","Highest Resource"]
[6037920018,"Los Angeles","Highest Resource"]
[6037920020,"Los Angeles","Highest Resource"]
[6037920032,"Los Angeles","Highest Resource"]
[6037920043,"Los Angeles","Highest Resource"]
[6037920044,"Los Angeles","Highest Resource"]
[6037920045,"Los Angeles","Highest Resource"]
[6037920104,"Los Angeles","Highest Resource"]
[6037920107,"Los Angeles","Highest Resource"]
[6037920108,"Los Angeles","Highest Resource"]
[6037920109,"Los Angeles","Highest Resource"]
[6037920110,"Los Angeles","Highest Resource"]
[6037920111,"Los Angeles","Highest Resource"]
[6037920112,"Los Angeles","Highest Resource"]
[6037920114,"Los Angeles","Highest Resource"]
[6037920115,"Los Angeles","Highest Resource"]
[6037920116,"Los Angeles","Highest Resource"]
[6037920118,"Los Angeles","Highest Resource"]
[6037920119,"Los Angeles","Highest Resource"]
[6037920303,"Los Angeles","Highest Resource"]
[6037920322,"Los Angeles","Highest Resource"]
[6037920326,"Los Angeles","Highest Resource"]
[6037920328,"Los Angeles","Highest Resource"]
[6037920329,"Los Angeles","Highest Resource"]
[6037920330,"Los Angeles","Highest Resource"]
[6037920331,"Los Angeles","Highest Resource"]
[6037920334,"Los Angeles","Highest Resource"]
[6037920338,"Los Angeles","Highest Resource"]
[6037920339,"Los Angeles","Highest Resource"]
[6037980024,"Los Angeles","Highest Resource"]
[6039000103,"Madera","Highest Resource"]
[6039000106,"Madera","Highest Resource"]
[6039000509,"Madera","Highest Resource"]
[6041107000,"Marin","Highest Resource"]
[6041108100,"Marin","Highest Resource"]
[6041114100,"Marin","Highest Resource"]
[6041114200,"Marin","Highest Resource"]
[6041115000,"Marin","Highest Resource"]
[6041116000,"Marin","Highest Resource"]
[6041117000,"Marin","Highest Resource"]
[6041118100,"Marin","Highest Resource"]
[6041119100,"Marin","Highest Resource"]
[6041120000,"Marin","Highest Resource"]
[6041121100,"Marin","Highest Resource"]
[6041123000,"Marin","Highest Resource"]
[6041124100,"Marin","Highest Resource"]
[6041124200,"Marin","Highest Resource"]
[6041125000,"Marin","Highest Resource"]
[6041126100,"Marin","Highest Resource"]
[6041126200,"Marin","Highest Resource"]
[6041127000,"Marin","Highest Resource"]
[6041128100,"Marin","Highest Resource"]
[6041128200,"Marin","Highest Resource"]
[6041130201,"Marin","Highest Resource"]
[6041130202,"Marin","Highest Resource"]
[6041132100,"Marin","Highest Resource"]
[6043000302,"Mariposa","Highest Resource"]
[6043000400,"Mariposa","Highest Resource"]
[6045010801,"Mendocino","Highest Resource"]
[6045010802,"Mendocino","Highest Resource"]
[6045011001,"Mendocino","Highest Resource"]
[6045011002,"Mendocino","Highest Resource"]
[6045011400,"Mendocino","Highest Resource"]
[6047000402,"Merced","Highest Resource"]
[6047000603,"Merced","Highest Resource"]
[6047000702,"Merced","Highest Resource"]
[6047000801,"Merced","Highest Resource"]
[6047000802,"Merced","Highest Resource"]
[6047001801,"Merced","Highest Resource"]
[6047002100,"Merced","Highest Resource"]
[6049000400,"Modoc","Highest Resource"]
[6051000200,"Mono","Highest Resource"]
[6053010701,"Monterey","Highest Resource"]
[6053010702,"Monterey","Highest Resource"]
[6053011000,"Monterey","Highest Resource"]
[6053011502,"Monterey","Highest Resource"]
[6053011602,"Monterey","Highest Resource"]
[6053011604,"Monterey","Highest Resource"]
[6053011700,"Monterey","Highest Resource"]
[6053011801,"Monterey","Highest Resource"]
[6053011802,"Monterey","Highest Resource"]
[6053011900,"Monterey","Highest Resource"]
[6053012000,"Monterey","Highest Resource"]
[6053012100,"Monterey","Highest Resource"]
[6053012200,"Monterey","Highest Resource"]
[6053012302,"Monterey","Highest Resource"]
[6053012401,"Monterey","Highest Resource"]
[6053012402,"Monterey","Highest Resource"]
[6053012502,"Monterey","Highest Resource"]
[6053012600,"Monterey","Highest Resource"]
[6053012700,"Monterey","Highest Resource"]
[6053012800,"Monterey","Highest Resource"]
[6053013100,"Monterey","Highest Resource"]
[6055201401,"Napa","Highest Resource"]
[6055201402,"Napa","Highest Resource"]
[6055201500,"Napa","Highest Resource"]
[6057001203,"Nevada","Highest Resource"]
[6057001204,"Nevada","Highest Resource"]
[6057001205,"Nevada","Highest Resource"]
[6057001206,"Nevada","Highest Resource"]
[6059001602,"Orange","Highest Resource"]
[6059001706,"Orange","Highest Resource"]
[6059011709,"Orange","Highest Resource"]
[6059011717,"Orange","Highest Resource"]
[6059021814,"Orange","Highest Resource"]
[6059021823,"Orange","Highest Resource"]
[6059021824,"Orange","Highest Resource"]
[6059021829,"Orange","Highest Resource"]
[6059021915,"Orange","Highest Resource"]
[6059021916,"Orange","Highest Resource"]
[6059021920,"Orange","Highest Resource"]
[6059021923,"Orange","Highest Resource"]
[6059032020,"Orange","Highest Resource"]
[6059032033,"Orange","Highest Resource"]
[6059032034,"Orange","Highest Resource"]
[6059032035,"Orange","Highest Resource"]
[6059032037,"Orange","Highest Resource"]
[6059032038,"Orange","Highest Resource"]
[6059032044,"Orange","Highest Resource"]
[6059032045,"Orange","Highest Resource"]
[6059032046,"Orange","Highest Resource"]
[6059032049,"Orange","Highest Resource"]
[6059032053,"Orange","Highest Resource"]
[6059032056,"Orange","Highest Resource"]
[6059032057,"Orange","Highest Resource"]
[6059032058,"Orange","Highest Resource"]
[6059032059,"Orange","Highest Resource"]
[6059042317,"Orange","Highest Resource"]
[6059042319,"Orange","Highest Resource"]
[6059042324,"Orange","Highest Resource"]
[6059042325,"Orange","Highest Resource"]
[6059042326,"Orange","Highest Resource"]
[6059042332,"Orange","Highest Resource"]
[6059042334,"Orange","Highest Resource"]
[6059042336,"Orange","Highest Resource"]
[6059052419,"Orange","Highest Resource"]
[6059052420,"Orange","Highest Resource"]
[6059052421,"Orange","Highest Resource"]
[6059052426,"Orange","Highest Resource"]
[6059052428,"Orange","Highest Resource"]
[6059052506,"Orange","Highest Resource"]
[6059052511,"Orange","Highest Resource"]
[6059052513,"Orange","Highest Resource"]
[6059052514,"Orange","Highest Resource"]
[6059052522,"Orange","Highest Resource"]
[6059052525,"Orange","Highest Resource"]
[6059052526,"Orange","Highest Resource"]
[6059052527,"Orange","Highest Resource"]
[6059052528,"Orange","Highest Resource"]
[6059062604,"Orange","Highest Resource"]
[6059062605,"Orange","Highest Resource"]
[6059062619,"Orange","Highest Resource"]
[6059062620,"Orange","Highest Resource"]
[6059062628,"Orange","Highest Resource"]
[6059062629,"Orange","Highest Resource"]
[6059062630,"Orange","Highest Resource"]
[6059062631,"Orange","Highest Resource"]
[6059062632,"Orange","Highest Resource"]
[6059062633,"Orange","Highest Resource"]
[6059062634,"Orange","Highest Resource"]
[6059062635,"Orange","Highest Resource"]
[6059062636,"Orange","Highest Resource"]
[6059062637,"Orange","Highest Resource"]
[6059062638,"Orange","Highest Resource"]
[6059062639,"Orange","Highest Resource"]
[6059062642,"Orange","Highest Resource"]
[6059062643,"Orange","Highest Resource"]
[6059062644,"Orange","Highest Resource"]
[6059062645,"Orange","Highest Resource"]
[6059062701,"Orange","Highest Resource"]
[6059062702,"Orange","Highest Resource"]
[6059062800,"Orange","Highest Resource"]
[6059062900,"Orange","Highest Resource"]
[6059063004,"Orange","Highest Resource"]
[6059063005,"Orange","Highest Resource"]
[6059063006,"Orange","Highest Resource"]
[6059063007,"Orange","Highest Resource"]
[6059063008,"Orange","Highest Resource"]
[6059063009,"Orange","Highest Resource"]
[6059063010,"Orange","Highest Resource"]
[6059063103,"Orange","Highest Resource"]
[6059063202,"Orange","Highest Resource"]
[6059063301,"Orange","Highest Resource"]
[6059063302,"Orange","Highest Resource"]
[6059063400,"Orange","Highest Resource"]
[6059075603,"Orange","Highest Resource"]
[6059075604,"Orange","Highest Resource"]
[6059075605,"Orange","Highest Resource"]
[6059075606,"Orange","Highest Resource"]
[6059075607,"Orange","Highest Resource"]
[6059075809,"Orange","Highest Resource"]
[6059075814,"Orange","Highest Resource"]
[6059099214,"Orange","Highest Resource"]
[6059099215,"Orange","Highest Resource"]
[6059099216,"Orange","Highest Resource"]
[6059099217,"Orange","Highest Resource"]
[6059099220,"Orange","Highest Resource"]
[6059099232,"Orange","Highest Resource"]
[6059099237,"Orange","Highest Resource"]
[6059099238,"Orange","Highest Resource"]
[6059099244,"Orange","Highest Resource"]
[6059099245,"Orange","Highest Resource"]
[6059099250,"Orange","Highest Resource"]
[6059099307,"Orange","Highest Resource"]
[6059099308,"Orange","Highest Resource"]
[6059099311,"Orange","Highest Resource"]
[6059099417,"Orange","Highest Resource"]
[6059099504,"Orange","Highest Resource"]
[6059099506,"Orange","Highest Resource"]
[6059099511,"Orange","Highest Resource"]
[6059099512,"Orange","Highest Resource"]
[6059099513,"Orange","Highest Resource"]
[6059099514,"Orange","Highest Resource"]
[6059110006,"Orange","Highest Resource"]
[6059110007,"Orange","Highest Resource"]
[6059110008,"Orange","Highest Resource"]
[6059110014,"Orange","Highest Resource"]
[6061020105,"Placer","Highest Resource"]
[6061020601,"Placer","Highest Resource"]
[6061020602,"Placer","Highest Resource"]
[6061020604,"Placer","Highest Resource"]
[6061020605,"Placer","Highest Resource"]
[6061020606,"Placer","Highest Resource"]
[6061020710,"Placer","Highest Resource"]
[6061020711,"Placer","Highest Resource"]
[6061020717,"Placer","Highest Resource"]
[6061021034,"Placer","Highest Resource"]
[6061021035,"Placer","Highest Resource"]
[6061021037,"Placer","Highest Resource"]
[6061021038,"Placer","Highest Resource"]
[6061021039,"Placer","Highest Resource"]
[6061021040,"Placer","Highest Resource"]
[6061021043,"Placer","Highest Resource"]
[6061021044,"Placer","Highest Resource"]
[6061021106,"Placer","Highest Resource"]
[6061021109,"Placer","Highest Resource"]
[6061021122,"Placer","Highest Resource"]
[6061021123,"Placer","Highest Resource"]
[6061021128,"Placer","Highest Resource"]
[6061021130,"Placer","Highest Resource"]
[6061021131,"Placer","Highest Resource"]
[6061021309,"Placer","Highest Resource"]
[6061021322,"Placer","Highest Resource"]
[6061022014,"Placer","Highest Resource"]
[6061022100,"Placer","Highest Resource"]
[6061022200,"Placer","Highest Resource"]
[6061022300,"Placer","Highest Resource"]
[6061022400,"Placer","Highest Resource"]
[6061022600,"Placer","Highest Resource"]
[6061022800,"Placer","Highest Resource"]
[6061022900,"Placer","Highest Resource"]
[6061023000,"Placer","Highest Resource"]
[6061023100,"Placer","Highest Resource"]
[6061023500,"Placer","Highest Resource"]
[6061023600,"Placer","Highest Resource"]
[6063000201,"Plumas","Highest Resource"]
[6063000300,"Plumas","Highest Resource"]
[6065030601,"Riverside","Highest Resource"]
[6065040607,"Riverside","Highest Resource"]
[6065040609,"Riverside","Highest Resource"]
[6065040611,"Riverside","Highest Resource"]
[6065040613,"Riverside","Highest Resource"]
[6065040615,"Riverside","Highest Resource"]
[6065040616,"Riverside","Highest Resource"]
[6065040701,"Riverside","Highest Resource"]
[6065040806,"Riverside","Highest Resource"]
[6065040814,"Riverside","Highest Resource"]
[6065040816,"Riverside","Highest Resource"]
[6065040821,"Riverside","Highest Resource"]
[6065041803,"Riverside","Highest Resource"]
[6065041804,"Riverside","Highest Resource"]
[6065041805,"Riverside","Highest Resource"]
[6065041806,"Riverside","Highest Resource"]
[6065041808,"Riverside","Highest Resource"]
[6065041810,"Riverside","Highest Resource"]
[6065041812,"Riverside","Highest Resource"]
[6065041905,"Riverside","Highest Resource"]
[6065041909,"Riverside","Highest Resource"]
[6065041910,"Riverside","Highest Resource"]
[6065041911,"Riverside","Highest Resource"]
[6065041912,"Riverside","Highest Resource"]
[6065041913,"Riverside","Highest Resource"]
[6065042003,"Riverside","Highest Resource"]
[6065042004,"Riverside","Highest Resource"]
[6065042005,"Riverside","Highest Resource"]
[6065042008,"Riverside","Highest Resource"]
[6065042009,"Riverside","Highest Resource"]
[6065042013,"Riverside","Highest Resource"]
[6065042014,"Riverside","Highest Resource"]
[6065042207,"Riverside","Highest Resource"]
[6065042208,"Riverside","Highest Resource"]
[6065042217,"Riverside","Highest Resource"]
[6065042714,"Riverside","Highest Resource"]
[6065042716,"Riverside","Highest Resource"]
[6065042733,"Riverside","Highest Resource"]
[6065042738,"Riverside","Highest Resource"]
[6065042739,"Riverside","Highest Resource"]
[6065043007,"Riverside","Highest Resource"]
[6065043206,"Riverside","Highest Resource"]
[6065043211,"Riverside","Highest Resource"]
[6065043217,"Riverside","Highest Resource"]
[6065043218,"Riverside","Highest Resource"]
[6065043227,"Riverside","Highest Resource"]
[6065043228,"Riverside","Highest Resource"]
[6065043229,"Riverside","Highest Resource"]
[6065043235,"Riverside","Highest Resource"]
[6065043239,"Riverside","Highest Resource"]
[6065043240,"Riverside","Highest Resource"]
[6065043242,"Riverside","Highest Resource"]
[6065043244,"Riverside","Highest Resource"]
[6065043246,"Riverside","Highest Resource"]
[6065043247,"Riverside","Highest Resource"]
[6065043248,"Riverside","Highest Resource"]
[6065043250,"Riverside","Highest Resource"]
[6065043252,"Riverside","Highest Resource"]
[6065043254,"Riverside","Highest Resource"]
[6065043256,"Riverside","Highest Resource"]
[6065043257,"Riverside","Highest Resource"]
[6065043262,"Riverside","Highest Resource"]
[6065043264,"Riverside","Highest Resource"]
[6065043265,"Riverside","Highest Resource"]
[6065043267,"Riverside","Highest Resource"]
[6065043272,"Riverside","Highest Resource"]
[6065043276,"Riverside","Highest Resource"]
[6065043278,"Riverside","Highest Resource"]
[6065043291,"Riverside","Highest Resource"]
[6065043809,"Riverside","Highest Resource"]
[6065043811,"Riverside","Highest Resource"]
[6065043823,"Riverside","Highest Resource"]
[6065044405,"Riverside","Highest Resource"]
[6065044911,"Riverside","Highest Resource"]
[6065044922,"Riverside","Highest Resource"]
[6065044927,"Riverside","Highest Resource"]
[6065044928,"Riverside","Highest Resource"]
[6065044929,"Riverside","Highest Resource"]
[6065044930,"Riverside","Highest Resource"]
[6065045114,"Riverside","Highest Resource"]
[6065045115,"Riverside","Highest Resource"]
[6065045117,"Riverside","Highest Resource"]
[6065045118,"Riverside","Highest Resource"]
[6065045119,"Riverside","Highest Resource"]
[6065045121,"Riverside","Highest Resource"]
[6065045122,"Riverside","Highest Resource"]
[6065045123,"Riverside","Highest Resource"]
[6065045125,"Riverside","Highest Resource"]
[6065045214,"Riverside","Highest Resource"]
[6065045215,"Riverside","Highest Resource"]
[6065045228,"Riverside","Highest Resource"]
[6065045233,"Riverside","Highest Resource"]
[6065046602,"Riverside","Highest Resource"]
[6065047900,"Riverside","Highest Resource"]
[6065048100,"Riverside","Highest Resource"]
[6065049600,"Riverside","Highest Resource"]
[6065049700,"Riverside","Highest Resource"]
[6065050300,"Riverside","Highest Resource"]
[6065050400,"Riverside","Highest Resource"]
[6065050500,"Riverside","Highest Resource"]
[6065050600,"Riverside","Highest Resource"]
[6065050700,"Riverside","Highest Resource"]
[6065051200,"Riverside","Highest Resource"]
[6065051400,"Riverside","Highest Resource"]
[6065940500,"Riverside","Highest Resource"]
[6067000100,"Sacramento","Highest Resource"]
[6067000200,"Sacramento","Highest Resource"]
[6067000300,"Sacramento","Highest Resource"]
[6067001600,"Sacramento","Highest Resource"]
[6067005803,"Sacramento","Highest Resource"]
[6067005804,"Sacramento","Highest Resource"]
[6067007104,"Sacramento","Highest Resource"]
[6067007106,"Sacramento","Highest Resource"]
[6067008210,"Sacramento","Highest Resource"]
[6067008403,"Sacramento","Highest Resource"]
[6067008501,"Sacramento","Highest Resource"]
[6067008504,"Sacramento","Highest Resource"]
[6067008505,"Sacramento","Highest Resource"]
[6067008506,"Sacramento","Highest Resource"]
[6067008507,"Sacramento","Highest Resource"]
[6067008508,"Sacramento","Highest Resource"]
[6067008509,"Sacramento","Highest Resource"]
[6067008510,"Sacramento","Highest Resource"]
[6067008512,"Sacramento","Highest Resource"]
[6067008513,"Sacramento","Highest Resource"]
[6067008600,"Sacramento","Highest Resource"]
[6067008704,"Sacramento","Highest Resource"]
[6067009324,"Sacramento","Highest Resource"]
[6067009325,"Sacramento","Highest Resource"]
[6067009404,"Sacramento","Highest Resource"]
[6067009622,"Sacramento","Highest Resource"]
[6067009630,"Sacramento","Highest Resource"]
[6067009632,"Sacramento","Highest Resource"]
[6067009635,"Sacramento","Highest Resource"]
[6067009636,"Sacramento","Highest Resource"]
[6067009637,"Sacramento","Highest Resource"]
[6067009638,"Sacramento","Highest Resource"]
[6069000801,"San Benito","Highest Resource"]
[6071000103,"San Bernardino","Highest Resource"]
[6071000104,"San Bernardino","Highest Resource"]
[6071000105,"San Bernardino","Highest Resource"]
[6071000107,"San Bernardino","Highest Resource"]
[6071000108,"San Bernardino","Highest Resource"]
[6071000109,"San Bernardino","Highest Resource"]
[6071000111,"San Bernardino","Highest Resource"]
[6071000113,"San Bernardino","Highest Resource"]
[6071000115,"San Bernardino","Highest Resource"]
[6071000116,"San Bernardino","Highest Resource"]
[6071000117,"San Bernardino","Highest Resource"]
[6071000118,"San Bernardino","Highest Resource"]
[6071000804,"San Bernardino","Highest Resource"]
[6071000812,"San Bernardino","Highest Resource"]
[6071000813,"San Bernardino","Highest Resource"]
[6071000814,"San Bernardino","Highest Resource"]
[6071000815,"San Bernardino","Highest Resource"]
[6071000816,"San Bernardino","Highest Resource"]
[6071000817,"San Bernardino","Highest Resource"]
[6071000818,"San Bernardino","Highest Resource"]
[6071000819,"San Bernardino","Highest Resource"]
[6071000820,"San Bernardino","Highest Resource"]
[6071001901,"San Bernardino","Highest Resource"]
[6071002010,"San Bernardino","Highest Resource"]
[6071002011,"San Bernardino","Highest Resource"]
[6071002013,"San Bernardino","Highest Resource"]
[6071002014,"San Bernardino","Highest Resource"]
[6071002015,"San Bernardino","Highest Resource"]
[6071002017,"San Bernardino","Highest Resource"]
[6071002018,"San Bernardino","Highest Resource"]
[6071002019,"San Bernardino","Highest Resource"]
[6071002021,"San Bernardino","Highest Resource"]
[6071002022,"San Bernardino","Highest Resource"]
[6071002023,"San Bernardino","Highest Resource"]
[6071002025,"San Bernardino","Highest Resource"]
[6071002028,"San Bernardino","Highest Resource"]
[6071002029,"San Bernardino","Highest Resource"]
[6071002031,"San Bernardino","Highest Resource"]
[6071002033,"San Bernardino","Highest Resource"]
[6071002034,"San Bernardino","Highest Resource"]
[6071002035,"San Bernardino","Highest Resource"]
[6071002036,"San Bernardino","Highest Resource"]
[6071002037,"San Bernardino","Highest Resource"]
[6071007901,"San Bernardino","Highest Resource"]
[6071007903,"San Bernardino","Highest Resource"]
[6071007904,"San Bernardino","Highest Resource"]
[6071008200,"San Bernardino","Highest Resource"]
[6071008301,"San Bernardino","Highest Resource"]
[6071008302,"San Bernardino","Highest Resource"]
[6071008403,"San Bernardino","Highest Resource"]
[6071008500,"San Bernardino","Highest Resource"]
[6071008703,"San Bernardino","Highest Resource"]
[6071009201,"San Bernardino","Highest Resource"]
[6071009202,"San Bernardino","Highest Resource"]
[6071010402,"San Bernardino","Highest Resource"]
[6071010422,"San Bernardino","Highest Resource"]
[6071010803,"San Bernardino","Highest Resource"]
[6071010901,"San Bernardino","Highest Resource"]
[6071010902,"San Bernardino","Highest Resource"]
[6071011101,"San Bernardino","Highest Resource"]
[6071011102,"San Bernardino","Highest Resource"]
[6071011204,"San Bernardino","Highest Resource"]
[6071011500,"San Bernardino","Highest Resource"]
[6071025000,"San Bernardino","Highest Resource"]
[6073006300,"San Diego","Highest Resource"]
[6073007002,"San Diego","Highest Resource"]
[6073007100,"San Diego","Highest Resource"]
[6073007200,"San Diego","Highest Resource"]
[6073007301,"San Diego","Highest Resource"]
[6073007302,"San Diego","Highest Resource"]
[6073007400,"San Diego","Highest Resource"]
[6073007501,"San Diego","Highest Resource"]
[6073007502,"San Diego","Highest Resource"]
[6073007701,"San Diego","Highest Resource"]
[6073007702,"San Diego","Highest Resource"]
[6073007800,"San Diego","Highest Resource"]
[6073007907,"San Diego","Highest Resource"]
[6073007908,"San Diego","Highest Resource"]
[6073007910,"San Diego","Highest Resource"]
[6073008002,"San Diego","Highest Resource"]
[6073008003,"San Diego","Highest Resource"]
[6073008006,"San Diego","Highest Resource"]
[6073008101,"San Diego","Highest Resource"]
[6073008102,"San Diego","Highest Resource"]
[6073008200,"San Diego","Highest Resource"]
[6073008301,"San Diego","Highest Resource"]
[6073008303,"San Diego","Highest Resource"]
[6073008306,"San Diego","Highest Resource"]
[6073008307,"San Diego","Highest Resource"]
[6073008310,"San Diego","Highest Resource"]
[6073008311,"San Diego","Highest Resource"]
[6073008312,"San Diego","Highest Resource"]
[6073008313,"San Diego","Highest Resource"]
[6073008324,"San Diego","Highest Resource"]
[6073008327,"San Diego","Highest Resource"]
[6073008328,"San Diego","Highest Resource"]
[6073008329,"San Diego","Highest Resource"]
[6073008330,"San Diego","Highest Resource"]
[6073008331,"San Diego","Highest Resource"]
[6073008333,"San Diego","Highest Resource"]
[6073008335,"San Diego","Highest Resource"]
[6073008336,"San Diego","Highest Resource"]
[6073008337,"San Diego","Highest Resource"]
[6073008340,"San Diego","Highest Resource"]
[6073008346,"San Diego","Highest Resource"]
[6073008347,"San Diego","Highest Resource"]
[6073008348,"San Diego","Highest Resource"]
[6073008349,"San Diego","Highest Resource"]
[6073008354,"San Diego","Highest Resource"]
[6073008356,"San Diego","Highest Resource"]
[6073008361,"San Diego","Highest Resource"]
[6073008362,"San Diego","Highest Resource"]
[6073008364,"San Diego","Highest Resource"]
[6073008365,"San Diego","Highest Resource"]
[6073008366,"San Diego","Highest Resource"]
[6073009101,"San Diego","Highest Resource"]
[6073009504,"San Diego","Highest Resource"]
[6073009505,"San Diego","Highest Resource"]
[6073009506,"San Diego","Highest Resource"]
[6073009507,"San Diego","Highest Resource"]
[6073009704,"San Diego","Highest Resource"]
[6073009705,"San Diego","Highest Resource"]
[6073009706,"San Diego","Highest Resource"]
[6073009801,"San Diego","Highest Resource"]
[6073009805,"San Diego","Highest Resource"]
[6073009901,"San Diego","Highest Resource"]
[6073010900,"San Diego","Highest Resource"]
[6073011000,"San Diego","Highest Resource"]
[6073011100,"San Diego","Highest Resource"]
[6073017006,"San Diego","Highest Resource"]
[6073017015,"San Diego","Highest Resource"]
[6073017020,"San Diego","Highest Resource"]
[6073017022,"San Diego","Highest Resource"]
[6073017029,"San Diego","Highest Resource"]
[6073017030,"San Diego","Highest Resource"]
[6073017032,"San Diego","Highest Resource"]
[6073017033,"San Diego","Highest Resource"]
[6073017034,"San Diego","Highest Resource"]
[6073017036,"San Diego","Highest Resource"]
[6073017037,"San Diego","Highest Resource"]
[6073017039,"San Diego","Highest Resource"]
[6073017042,"San Diego","Highest Resource"]
[6073017043,"San Diego","Highest Resource"]
[6073017044,"San Diego","Highest Resource"]
[6073017045,"San Diego","Highest Resource"]
[6073017046,"San Diego","Highest Resource"]
[6073017047,"San Diego","Highest Resource"]
[6073017052,"San Diego","Highest Resource"]
[6073017053,"San Diego","Highest Resource"]
[6073017055,"San Diego","Highest Resource"]
[6073017056,"San Diego","Highest Resource"]
[6073017104,"San Diego","Highest Resource"]
[6073017106,"San Diego","Highest Resource"]
[6073017107,"San Diego","Highest Resource"]
[6073017108,"San Diego","Highest Resource"]
[6073017109,"San Diego","Highest Resource"]
[6073017110,"San Diego","Highest Resource"]
[6073017200,"San Diego","Highest Resource"]
[6073017303,"San Diego","Highest Resource"]
[6073017304,"San Diego","Highest Resource"]
[6073017305,"San Diego","Highest Resource"]
[6073017306,"San Diego","Highest Resource"]
[6073017401,"San Diego","Highest Resource"]
[6073017403,"San Diego","Highest Resource"]
[6073017501,"San Diego","Highest Resource"]
[6073017601,"San Diego","Highest Resource"]
[6073017603,"San Diego","Highest Resource"]
[6073017604,"San Diego","Highest Resource"]
[6073017701,"San Diego","Highest Resource"]
[6073017702,"San Diego","Highest Resource"]
[6073017801,"San Diego","Highest Resource"]
[6073017808,"San Diego","Highest Resource"]
[6073017809,"San Diego","Highest Resource"]
[6073017810,"San Diego","Highest Resource"]
[6073017811,"San Diego","Highest Resource"]
[6073018000,"San Diego","Highest Resource"]
[6073018802,"San Diego","Highest Resource"]
[6073018803,"San Diego","Highest Resource"]
[6073019105,"San Diego","Highest Resource"]
[6073019804,"San Diego","Highest Resource"]
[6073020013,"San Diego","Highest Resource"]
[6073020014,"San Diego","Highest Resource"]
[6073020015,"San Diego","Highest Resource"]
[6073020016,"San Diego","Highest Resource"]
[6073020027,"San Diego","Highest Resource"]
[6073020810,"San Diego","Highest Resource"]
[6073020811,"San Diego","Highest Resource"]
[6073021204,"San Diego","Highest Resource"]
[6073021206,"San Diego","Highest Resource"]
[6073021500,"San Diego","Highest Resource"]
[6073022100,"San Diego","Highest Resource"]
[6075012601,"San Francisco","Highest Resource"]
[6075012602,"San Francisco","Highest Resource"]
[6075012700,"San Francisco","Highest Resource"]
[6075012901,"San Francisco","Highest Resource"]
[6075012902,"San Francisco","Highest Resource"]
[6075013000,"San Francisco","Highest Resource"]
[6075013102,"San Francisco","Highest Resource"]
[6075013300,"San Francisco","Highest Resource"]
[6075013400,"San Francisco","Highest Resource"]
[6075015400,"San Francisco","Highest Resource"]
[6075015600,"San Francisco","Highest Resource"]
[6075015700,"San Francisco","Highest Resource"]
[6075016500,"San Francisco","Highest Resource"]
[6075016600,"San Francisco","Highest Resource"]
[6075016700,"San Francisco","Highest Resource"]
[6075017000,"San Francisco","Highest Resource"]
[6075017101,"San Francisco","Highest Resource"]
[6075017102,"San Francisco","Highest Resource"]
[6075020401,"San Francisco","Highest Resource"]
[6075021100,"San Francisco","Highest Resource"]
[6075021200,"San Francisco","Highest Resource"]
[6075021300,"San Francisco","Highest Resource"]
[6075021400,"San Francisco","Highest Resource"]
[6075021600,"San Francisco","Highest Resource"]
[6075030101,"San Francisco","Highest Resource"]
[6075030102,"San Francisco","Highest Resource"]
[6075030201,"San Francisco","Highest Resource"]
[6075030202,"San Francisco","Highest Resource"]
[6075030301,"San Francisco","Highest Resource"]
[6075030302,"San Francisco","Highest Resource"]
[6075030400,"San Francisco","Highest Resource"]
[6075030500,"San Francisco","Highest Resource"]
[6075030600,"San Francisco","Highest Resource"]
[6075030700,"San Francisco","Highest Resource"]
[6075030800,"San Francisco","Highest Resource"]
[6075030900,"San Francisco","Highest Resource"]
[6075031000,"San Francisco","Highest Resource"]
[6075032601,"San Francisco","Highest Resource"]
[6075032700,"San Francisco","Highest Resource"]
[6075035100,"San Francisco","Highest Resource"]
[6075040100,"San Francisco","Highest Resource"]
[6075040200,"San Francisco","Highest Resource"]
[6075042602,"San Francisco","Highest Resource"]
[6075042800,"San Francisco","Highest Resource"]
[6075045100,"San Francisco","Highest Resource"]
[6075047600,"San Francisco","Highest Resource"]
[6075047701,"San Francisco","Highest Resource"]
[6075047702,"San Francisco","Highest Resource"]
[6075047801,"San Francisco","Highest Resource"]
[6075060100,"San Francisco","Highest Resource"]
[6075980300,"San Francisco","Highest Resource"]
[6077003106,"San Joaquin","Highest Resource"]
[6077003114,"San Joaquin","Highest Resource"]
[6077003208,"San Joaquin","Highest Resource"]
[6077004102,"San Joaquin","Highest Resource"]
[6077004104,"San Joaquin","Highest Resource"]
[6077004105,"San Joaquin","Highest Resource"]
[6077004201,"San Joaquin","Highest Resource"]
[6077004303,"San Joaquin","Highest Resource"]
[6077004703,"San Joaquin","Highest Resource"]
[6077005003,"San Joaquin","Highest Resource"]
[6077005004,"San Joaquin","Highest Resource"]
[6077005206,"San Joaquin","Highest Resource"]
[6077005207,"San Joaquin","Highest Resource"]
[6077005208,"San Joaquin","Highest Resource"]
[6077005209,"San Joaquin","Highest Resource"]
[6077005210,"San Joaquin","Highest Resource"]
[6077005403,"San Joaquin","Highest Resource"]
[6079010504,"San Luis Obispo","Highest Resource"]
[6079010602,"San Luis Obispo","Highest Resource"]
[6079010707,"San Luis Obispo","Highest Resource"]
[6079010902,"San Luis Obispo","Highest Resource"]
[6079011001,"San Luis Obispo","Highest Resource"]
[6079011002,"San Luis Obispo","Highest Resource"]
[6079011102,"San Luis Obispo","Highest Resource"]
[6079011503,"San Luis Obispo","Highest Resource"]
[6079011504,"San Luis Obispo","Highest Resource"]
[6079011600,"San Luis Obispo","Highest Resource"]
[6079011704,"San Luis Obispo","Highest Resource"]
[6079012302,"San Luis Obispo","Highest Resource"]
[6079012704,"San Luis Obispo","Highest Resource"]
[6081603300,"San Mateo","Highest Resource"]
[6081604700,"San Mateo","Highest Resource"]
[6081604900,"San Mateo","Highest Resource"]
[6081605000,"San Mateo","Highest Resource"]
[6081605100,"San Mateo","Highest Resource"]
[6081605200,"San Mateo","Highest Resource"]
[6081605300,"San Mateo","Highest Resource"]
[6081605600,"San Mateo","Highest Resource"]
[6081605700,"San Mateo","Highest Resource"]
[6081605800,"San Mateo","Highest Resource"]
[6081606500,"San Mateo","Highest Resource"]
[6081606800,"San Mateo","Highest Resource"]
[6081608001,"San Mateo","Highest Resource"]
[6081608002,"San Mateo","Highest Resource"]
[6081608004,"San Mateo","Highest Resource"]
[6081608013,"San Mateo","Highest Resource"]
[6081608023,"San Mateo","Highest Resource"]
[6081608100,"San Mateo","Highest Resource"]
[6081608200,"San Mateo","Highest Resource"]
[6081608300,"San Mateo","Highest Resource"]
[6081608700,"San Mateo","Highest Resource"]
[6081608800,"San Mateo","Highest Resource"]
[6081608900,"San Mateo","Highest Resource"]
[6081609000,"San Mateo","Highest Resource"]
[6081609201,"San Mateo","Highest Resource"]
[6081609300,"San Mateo","Highest Resource"]
[6081609400,"San Mateo","Highest Resource"]
[6081609500,"San Mateo","Highest Resource"]
[6081609601,"San Mateo","Highest Resource"]
[6081609602,"San Mateo","Highest Resource"]
[6081609603,"San Mateo","Highest Resource"]
[6081609900,"San Mateo","Highest Resource"]
[6081610000,"San Mateo","Highest Resource"]
[6081610303,"San Mateo","Highest Resource"]
[6081610304,"San Mateo","Highest Resource"]
[6081611500,"San Mateo","Highest Resource"]
[6081612500,"San Mateo","Highest Resource"]
[6081612600,"San Mateo","Highest Resource"]
[6081612700,"San Mateo","Highest Resource"]
[6081612800,"San Mateo","Highest Resource"]
[6081612900,"San Mateo","Highest Resource"]
[6081613200,"San Mateo","Highest Resource"]
[6081613300,"San Mateo","Highest Resource"]
[6081613400,"San Mateo","Highest Resource"]
[6081613600,"San Mateo","Highest Resource"]
[6081614000,"San Mateo","Highest Resource"]
[6083000103,"Santa Barbara","Highest Resource"]
[6083000501,"Santa Barbara","Highest Resource"]
[6083000502,"Santa Barbara","Highest Resource"]
[6083000700,"Santa Barbara","Highest Resource"]
[6083001402,"Santa Barbara","Highest Resource"]
[6083001500,"Santa Barbara","Highest Resource"]
[6083001903,"Santa Barbara","Highest Resource"]
[6083001905,"Santa Barbara","Highest Resource"]
[6083001906,"Santa Barbara","Highest Resource"]
[6083002907,"Santa Barbara","Highest Resource"]
[6083002913,"Santa Barbara","Highest Resource"]
[6083002914,"Santa Barbara","Highest Resource"]
[6083003004,"Santa Barbara","Highest Resource"]
[6083003007,"Santa Barbara","Highest Resource"]
[6085503326,"Santa Clara","Highest Resource"]
[6085503330,"Santa Clara","Highest Resource"]
[6085506101,"Santa Clara","Highest Resource"]
[6085506102,"Santa Clara","Highest Resource"]
[6085506103,"Santa Clara","Highest Resource"]
[6085506202,"Santa Clara","Highest Resource"]
[6085506604,"Santa Clara","Highest Resource"]
[6085506701,"Santa Clara","Highest Resource"]
[6085506801,"Santa Clara","Highest Resource"]
[6085506804,"Santa Clara","Highest Resource"]
[6085506900,"Santa Clara","Highest Resource"]
[6085507001,"Santa Clara","Highest Resource"]
[6085507002,"Santa Clara","Highest Resource"]
[6085507100,"Santa Clara","Highest Resource"]
[6085507203,"Santa Clara","Highest Resource"]
[6085507206,"Santa Clara","Highest Resource"]
[6085507301,"Santa Clara","Highest Resource"]
[6085507302,"Santa Clara","Highest Resource"]
[6085507401,"Santa Clara","Highest Resource"]
[6085507402,"Santa Clara","Highest Resource"]
[6085507500,"Santa Clara","Highest Resource"]
[6085507600,"Santa Clara","Highest Resource"]
[6085507701,"Santa Clara","Highest Resource"]
[6085507702,"Santa Clara","Highest Resource"]
[6085507703,"Santa Clara","Highest Resource"]
[6085507805,"Santa Clara","Highest Resource"]
[6085507806,"Santa Clara","Highest Resource"]
[6085507807,"Santa Clara","Highest Resource"]
[6085507808,"Santa Clara","Highest Resource"]
[6085507903,"Santa Clara","Highest Resource"]
[6085507904,"Santa Clara","Highest Resource"]
[6085507905,"Santa Clara","Highest Resource"]
[6085507906,"Santa Clara","Highest Resource"]
[6085508001,"Santa Clara","Highest Resource"]
[6085508003,"Santa Clara","Highest Resource"]
[6085508004,"Santa Clara","Highest Resource"]
[6085508101,"Santa Clara","Highest Resource"]
[6085508102,"Santa Clara","Highest Resource"]
[6085508203,"Santa Clara","Highest Resource"]
[6085508204,"Santa Clara","Highest Resource"]
[6085508301,"Santa Clara","Highest Resource"]
[6085508303,"Santa Clara","Highest Resource"]
[6085508304,"Santa Clara","Highest Resource"]
[6085508401,"Santa Clara","Highest Resource"]
[6085508403,"Santa Clara","Highest Resource"]
[6085508404,"Santa Clara","Highest Resource"]
[6085508503,"Santa Clara","Highest Resource"]
[6085509106,"Santa Clara","Highest Resource"]
[6085509109,"Santa Clara","Highest Resource"]
[6085509401,"Santa Clara","Highest Resource"]
[6085509600,"Santa Clara","Highest Resource"]
[6085509700,"Santa Clara","Highest Resource"]
[6085509801,"Santa Clara","Highest Resource"]
[6085509802,"Santa Clara","Highest Resource"]
[6085509901,"Santa Clara","Highest Resource"]
[6085509902,"Santa Clara","Highest Resource"]
[6085510001,"Santa Clara","Highest Resource"]
[6085510002,"Santa Clara","Highest Resource"]
[6085510100,"Santa Clara","Highest Resource"]
[6085510200,"Santa Clara","Highest Resource"]
[6085510300,"Santa Clara","Highest Resource"]
[6085510400,"Santa Clara","Highest Resource"]
[6085510500,"Santa Clara","Highest Resource"]
[6085510600,"Santa Clara","Highest Resource"]
[6085510700,"Santa Clara","Highest Resource"]
[6085510801,"Santa Clara","Highest Resource"]
[6085510802,"Santa Clara","Highest Resource"]
[6085510803,"Santa Clara","Highest Resource"]
[6085510900,"Santa Clara","Highest Resource"]
[6085511000,"Santa Clara","Highest Resource"]
[6085511100,"Santa Clara","Highest Resource"]
[6085511200,"Santa Clara","Highest Resource"]
[6085511301,"Santa Clara","Highest Resource"]
[6085511302,"Santa Clara","Highest Resource"]
[6085511400,"Santa Clara","Highest Resource"]
[6085511500,"Santa Clara","Highest Resource"]
[6085511609,"Santa Clara","Highest Resource"]
[6085511701,"Santa Clara","Highest Resource"]
[6085511702,"Santa Clara","Highest Resource"]
[6085511704,"Santa Clara","Highest Resource"]
[6085511707,"Santa Clara","Highest Resource"]
[6085511800,"Santa Clara","Highest Resource"]
[6085511905,"Santa Clara","Highest Resource"]
[6085511907,"Santa Clara","Highest Resource"]
[6085511909,"Santa Clara","Highest Resource"]
[6085511910,"Santa Clara","Highest Resource"]
[6085511912,"Santa Clara","Highest Resource"]
[6085511913,"Santa Clara","Highest Resource"]
[6085511914,"Santa Clara","Highest Resource"]
[6085512200,"Santa Clara","Highest Resource"]
[6087120800,"Santa Cruz","Highest Resource"]
[6087121000,"Santa Cruz","Highest Resource"]
[6087121100,"Santa Cruz","Highest Resource"]
[6087121200,"Santa Cruz","Highest Resource"]
[6087121300,"Santa Cruz","Highest Resource"]
[6087121800,"Santa Cruz","Highest Resource"]
[6087122001,"Santa Cruz","Highest Resource"]
[6087122201,"Santa Cruz","Highest Resource"]
[6087122202,"Santa Cruz","Highest Resource"]
[6087122203,"Santa Cruz","Highest Resource"]
[6089010601,"Shasta","Highest Resource"]
[6089010602,"Shasta","Highest Resource"]
[6089010603,"Shasta","Highest Resource"]
[6089010702,"Shasta","Highest Resource"]
[6089010804,"Shasta","Highest Resource"]
[6089010807,"Shasta","Highest Resource"]
[6089011001,"Shasta","Highest Resource"]
[6089011801,"Shasta","Highest Resource"]
[6089011900,"Shasta","Highest Resource"]
[6089012400,"Shasta","Highest Resource"]
[6093000600,"Siskiyou","Highest Resource"]
[6093000800,"Siskiyou","Highest Resource"]
[6093001000,"Siskiyou","Highest Resource"]
[6095252903,"Solano","Highest Resource"]
[6095253500,"Solano","Highest Resource"]
[6097151100,"Sonoma","Highest Resource"]
[6097153403,"Sonoma","Highest Resource"]
[6097153404,"Sonoma","Highest Resource"]
[6097153501,"Sonoma","Highest Resource"]
[6097153502,"Sonoma","Highest Resource"]
[6097153600,"Sonoma","Highest Resource"]
[6097153807,"Sonoma","Highest Resource"]
[6097154302,"Sonoma","Highest Resource"]
[6099000101,"Stanislaus","Highest Resource"]
[6099000102,"Stanislaus","Highest Resource"]
[6099000201,"Stanislaus","Highest Resource"]
[6099000504,"Stanislaus","Highest Resource"]
[6099000905,"Stanislaus","Highest Resource"]
[6099000906,"Stanislaus","Highest Resource"]
[6099000907,"Stanislaus","Highest Resource"]
[6099000911,"Stanislaus","Highest Resource"]
[6099000912,"Stanislaus","Highest Resource"]
[6099002901,"Stanislaus","Highest Resource"]
[6099002902,"Stanislaus","Highest Resource"]
[6099003605,"Stanislaus","Highest Resource"]
[6099003606,"Stanislaus","Highest Resource"]
[6099003905,"Stanislaus","Highest Resource"]
[6101050402,"Sutter","Highest Resource"]
[6101050601,"Sutter","Highest Resource"]
[6101050702,"Sutter","Highest Resource"]
[6101050800,"Sutter","Highest Resource"]
[6101051100,"Sutter","Highest Resource"]
[6103000200,"Tehama","Highest Resource"]
[6103000400,"Tehama","Highest Resource"]
[6103000500,"Tehama","Highest Resource"]
[6105000102,"Trinity","Highest Resource"]
[6107000100,"Tulare","Highest Resource"]
[6107000502,"Tulare","Highest Resource"]
[6107000800,"Tulare","Highest Resource"]
[6107001003,"Tulare","Highest Resource"]
[6107001005,"Tulare","Highest Resource"]
[6107001400,"Tulare","Highest Resource"]
[6107001501,"Tulare","Highest Resource"]
[6107001502,"Tulare","Highest Resource"]
[6107002004,"Tulare","Highest Resource"]
[6107002006,"Tulare","Highest Resource"]
[6107002700,"Tulare","Highest Resource"]
[6109002200,"Tuolumne","Highest Resource"]
[6109003100,"Tuolumne","Highest Resource"]
[6109004100,"Tuolumne","Highest Resource"]
[6111000901,"Ventura","Highest Resource"]
[6111001001,"Ventura","Highest Resource"]
[6111001101,"Ventura","Highest Resource"]
[6111001202,"Ventura","Highest Resource"]
[6111001700,"Ventura","Highest Resource"]
[6111001800,"Ventura","Highest Resource"]
[6111005204,"Ventura","Highest Resource"]
[6111005801,"Ventura","Highest Resource"]
[6111005802,"Ventura","Highest Resource"]
[6111005901,"Ventura","Highest Resource"]
[6111005906,"Ventura","Highest Resource"]
[6111005907,"Ventura","Highest Resource"]
[6111005908,"Ventura","Highest Resource"]
[6111005909,"Ventura","Highest Resource"]
[6111005910,"Ventura","Highest Resource"]
[6111006200,"Ventura","Highest Resource"]
[6111006301,"Ventura","Highest Resource"]
[6111006302,"Ventura","Highest Resource"]
[6111006400,"Ventura","Highest Resource"]
[6111006600,"Ventura","Highest Resource"]
[6111006700,"Ventura","Highest Resource"]
[6111007201,"Ventura","Highest Resource"]
[6111007202,"Ventura","Highest Resource"]
[6111007300,"Ventura","Highest Resource"]
[6111007402,"Ventura","Highest Resource"]
[6111007403,"Ventura","Highest Resource"]
[6111007405,"Ventura","Highest Resource"]
[6111007406,"Ventura","Highest Resource"]
[6111007507,"Ventura","Highest Resource"]
[6111007508,"Ventura","Highest Resource"]
[6111007509,"Ventura","Highest Resource"]
[6111007510,"Ventura","Highest Resource"]
[6111007511,"Ventura","Highest Resource"]
[6111007606,"Ventura","Highest Resource"]
[6111007607,"Ventura","Highest Resource"]
[6111007609,"Ventura","Highest Resource"]
[6111007610,"Ventura","Highest Resource"]
[6111008305,"Ventura","Highest Resource"]
[6113010401,"Yolo","Highest Resource"]
[6113010402,"Yolo","Highest Resource"]
[6113010508,"Yolo","Highest Resource"]
[6113010509,"Yolo","Highest Resource"]
[6113010510,"Yolo","Highest Resource"]
[6113010511,"Yolo","Highest Resource"]
[6113010512,"Yolo","Highest Resource"]
[6113010513,"Yolo","Highest Resource"]
[6113010602,"Yolo","Highest Resource"]
[6113010605,"Yolo","Highest Resource"]
[6113010606,"Yolo","Highest Resource"]
[6113010607,"Yolo","Highest Resource"]
[6113010701,"Yolo","Highest Resource"]
[6113010703,"Yolo","Highest Resource"]
[6113010704,"Yolo","Highest Resource"]
[6113011300,"Yolo","Highest Resource"]
[6115040800,"Yuba","Highest Resource"]
[6115040902,"Yuba","Highest Resource"]
[6115041000,"Yuba","Highest Resource"]
[6001400700,"Alameda","Low Resource"]
[6001400800,"Alameda","Low Resource"]
[6001400900,"Alameda","Low Resource"]
[6001401000,"Alameda","Low Resource"]
[6001401200,"Alameda","Low Resource"]
[6001401500,"Alameda","Low Resource"]
[6001401600,"Alameda","Low Resource"]
[6001401700,"Alameda","Low Resource"]
[6001402200,"Alameda","Low Resource"]
[6001402400,"Alameda","Low Resource"]
[6001402700,"Alameda","Low Resource"]
[6001403000,"Alameda","Low Resource"]
[6001403300,"Alameda","Low Resource"]
[6001403501,"Alameda","Low Resource"]
[6001405302,"Alameda","Low Resource"]
[6001405401,"Alameda","Low Resource"]
[6001405402,"Alameda","Low Resource"]
[6001405500,"Alameda","Low Resource"]
[6001405600,"Alameda","Low Resource"]
[6001405700,"Alameda","Low Resource"]
[6001406100,"Alameda","Low Resource"]
[6001406201,"Alameda","Low Resource"]
[6001406300,"Alameda","Low Resource"]
[6001406400,"Alameda","Low Resource"]
[6001406500,"Alameda","Low Resource"]
[6001406601,"Alameda","Low Resource"]
[6001406602,"Alameda","Low Resource"]
[6001406700,"Alameda","Low Resource"]
[6001406900,"Alameda","Low Resource"]
[6001407000,"Alameda","Low Resource"]
[6001407101,"Alameda","Low Resource"]
[6001407102,"Alameda","Low Resource"]
[6001407300,"Alameda","Low Resource"]
[6001407400,"Alameda","Low Resource"]
[6001407600,"Alameda","Low Resource"]
[6001407700,"Alameda","Low Resource"]
[6001407800,"Alameda","Low Resource"]
[6001408200,"Alameda","Low Resource"]
[6001408300,"Alameda","Low Resource"]
[6001408500,"Alameda","Low Resource"]
[6001409000,"Alameda","Low Resource"]
[6001409200,"Alameda","Low Resource"]
[6001409400,"Alameda","Low Resource"]
[6001409600,"Alameda","Low Resource"]
[6001409700,"Alameda","Low Resource"]
[6001409800,"Alameda","Low Resource"]
[6001409900,"Alameda","Low Resource"]
[6001410100,"Alameda","Low Resource"]
[6001410200,"Alameda","Low Resource"]
[6001410300,"Alameda","Low Resource"]
[6001410400,"Alameda","Low Resource"]
[6001422800,"Alameda","Low Resource"]
[6001425104,"Alameda","Low Resource"]
[6001428700,"Alameda","Low Resource"]
[6001432300,"Alameda","Low Resource"]
[6001432400,"Alameda","Low Resource"]
[6001432501,"Alameda","Low Resource"]
[6001432502,"Alameda","Low Resource"]
[6001432600,"Alameda","Low Resource"]
[6001433000,"Alameda","Low Resource"]
[6001433103,"Alameda","Low Resource"]
[6001433104,"Alameda","Low Resource"]
[6001433200,"Alameda","Low Resource"]
[6001433300,"Alameda","Low Resource"]
[6001433600,"Alameda","Low Resource"]
[6001433700,"Alameda","Low Resource"]
[6001433800,"Alameda","Low Resource"]
[6001433900,"Alameda","Low Resource"]
[6001434000,"Alameda","Low Resource"]
[6001435104,"Alameda","Low Resource"]
[6001435400,"Alameda","Low Resource"]
[6001435500,"Alameda","Low Resource"]
[6001435601,"Alameda","Low Resource"]
[6001435602,"Alameda","Low Resource"]
[6001435700,"Alameda","Low Resource"]
[6001435800,"Alameda","Low Resource"]
[6001435900,"Alameda","Low Resource"]
[6001436100,"Alameda","Low Resource"]
[6001436200,"Alameda","Low Resource"]
[6001436300,"Alameda","Low Resource"]
[6001436401,"Alameda","Low Resource"]
[6001436500,"Alameda","Low Resource"]
[6001436601,"Alameda","Low Resource"]
[6001436602,"Alameda","Low Resource"]
[6001436700,"Alameda","Low Resource"]
[6001436800,"Alameda","Low Resource"]
[6001436900,"Alameda","Low Resource"]
[6001437000,"Alameda","Low Resource"]
[6001437101,"Alameda","Low Resource"]
[6001437102,"Alameda","Low Resource"]
[6001437200,"Alameda","Low Resource"]
[6001437300,"Alameda","Low Resource"]
[6001437400,"Alameda","Low Resource"]
[6001437500,"Alameda","Low Resource"]
[6001437600,"Alameda","Low Resource"]
[6001437701,"Alameda","Low Resource"]
[6001437702,"Alameda","Low Resource"]
[6001437800,"Alameda","Low Resource"]
[6001437900,"Alameda","Low Resource"]
[6001438000,"Alameda","Low Resource"]
[6001438100,"Alameda","Low Resource"]
[6001438201,"Alameda","Low Resource"]
[6001438203,"Alameda","Low Resource"]
[6001438204,"Alameda","Low Resource"]
[6001438300,"Alameda","Low Resource"]
[6001438400,"Alameda","Low Resource"]
[6001440200,"Alameda","Low Resource"]
[6001440301,"Alameda","Low Resource"]
[6001444302,"Alameda","Low Resource"]
[6001451101,"Alameda","Low Resource"]
[6001982000,"Alameda","Low Resource"]
[6005000101,"Amador","Low Resource"]
[6005000102,"Amador","Low Resource"]
[6005000301,"Amador","Low Resource"]
[6007001702,"Butte","Low Resource"]
[6007001703,"Butte","Low Resource"]
[6007001704,"Butte","Low Resource"]
[6007001800,"Butte","Low Resource"]
[6007001900,"Butte","Low Resource"]
[6007002400,"Butte","Low Resource"]
[6007002500,"Butte","Low Resource"]
[6007002602,"Butte","Low Resource"]
[6007002700,"Butte","Low Resource"]
[6007002900,"Butte","Low Resource"]
[6007003200,"Butte","Low Resource"]
[6007003300,"Butte","Low Resource"]
[6007003700,"Butte","Low Resource"]
[6009000210,"Calaveras","Low Resource"]
[6009000220,"Calaveras","Low Resource"]
[6009000400,"Calaveras","Low Resource"]
[6011000200,"Colusa","Low Resource"]
[6011000500,"Colusa","Low Resource"]
[6013301000,"Contra Costa","Low Resource"]
[6013302005,"Contra Costa","Low Resource"]
[6013302006,"Contra Costa","Low Resource"]
[6013302007,"Contra Costa","Low Resource"]
[6013302008,"Contra Costa","Low Resource"]
[6013302009,"Contra Costa","Low Resource"]
[6013303103,"Contra Costa","Low Resource"]
[6013304002,"Contra Costa","Low Resource"]
[6013305000,"Contra Costa","Low Resource"]
[6013306002,"Contra Costa","Low Resource"]
[6013306003,"Contra Costa","Low Resource"]
[6013306004,"Contra Costa","Low Resource"]
[6013307101,"Contra Costa","Low Resource"]
[6013307102,"Contra Costa","Low Resource"]
[6013307201,"Contra Costa","Low Resource"]
[6013307204,"Contra Costa","Low Resource"]
[6013307205,"Contra Costa","Low Resource"]
[6013308001,"Contra Costa","Low Resource"]
[6013308002,"Contra Costa","Low Resource"]
[6013309000,"Contra Costa","Low Resource"]
[6013310000,"Contra Costa","Low Resource"]
[6013311000,"Contra Costa","Low Resource"]
[6013312000,"Contra Costa","Low Resource"]
[6013313101,"Contra Costa","Low Resource"]
[6013313102,"Contra Costa","Low Resource"]
[6013313103,"Contra Costa","Low Resource"]
[6013313203,"Contra Costa","Low Resource"]
[6013313204,"Contra Costa","Low Resource"]
[6013313205,"Contra Costa","Low Resource"]
[6013313206,"Contra Costa","Low Resource"]
[6013314102,"Contra Costa","Low Resource"]
[6013314103,"Contra Costa","Low Resource"]
[6013314104,"Contra Costa","Low Resource"]
[6013314200,"Contra Costa","Low Resource"]
[6013315000,"Contra Costa","Low Resource"]
[6013316000,"Contra Costa","Low Resource"]
[6013317000,"Contra Costa","Low Resource"]
[6013320001,"Contra Costa","Low Resource"]
[6013327000,"Contra Costa","Low Resource"]
[6013328000,"Contra Costa","Low Resource"]
[6013329000,"Contra Costa","Low Resource"]
[6013330000,"Contra Costa","Low Resource"]
[6013331000,"Contra Costa","Low Resource"]
[6013335000,"Contra Costa","Low Resource"]
[6013336101,"Contra Costa","Low Resource"]
[6013336102,"Contra Costa","Low Resource"]
[6013336201,"Contra Costa","Low Resource"]
[6013336202,"Contra Costa","Low Resource"]
[6013337200,"Contra Costa","Low Resource"]
[6013338101,"Contra Costa","Low Resource"]
[6013355107,"Contra Costa","Low Resource"]
[6013355108,"Contra Costa","Low Resource"]
[6013355109,"Contra Costa","Low Resource"]
[6013355110,"Contra Costa","Low Resource"]
[6013355111,"Contra Costa","Low Resource"]
[6013355200,"Contra Costa","Low Resource"]
[6013356001,"Contra Costa","Low Resource"]
[6013358000,"Contra Costa","Low Resource"]
[6013359102,"Contra Costa","Low Resource"]
[6013359103,"Contra Costa","Low Resource"]
[6013360101,"Contra Costa","Low Resource"]
[6013360200,"Contra Costa","Low Resource"]
[6013363000,"Contra Costa","Low Resource"]
[6013364002,"Contra Costa","Low Resource"]
[6013365003,"Contra Costa","Low Resource"]
[6013366001,"Contra Costa","Low Resource"]
[6013366002,"Contra Costa","Low Resource"]
[6013367100,"Contra Costa","Low Resource"]
[6013367200,"Contra Costa","Low Resource"]
[6013368001,"Contra Costa","Low Resource"]
[6013368002,"Contra Costa","Low Resource"]
[6013369002,"Contra Costa","Low Resource"]
[6013371000,"Contra Costa","Low Resource"]
[6013372000,"Contra Costa","Low Resource"]
[6013373000,"Contra Costa","Low Resource"]
[6013374000,"Contra Costa","Low Resource"]
[6013375000,"Contra Costa","Low Resource"]
[6013376000,"Contra Costa","Low Resource"]
[6013377000,"Contra Costa","Low Resource"]
[6013378000,"Contra Costa","Low Resource"]
[6013379000,"Contra Costa","Low Resource"]
[6013380000,"Contra Costa","Low Resource"]
[6013381000,"Contra Costa","Low Resource"]
[6013382000,"Contra Costa","Low Resource"]
[6013383000,"Contra Costa","Low Resource"]
[6013386000,"Contra Costa","Low Resource"]
[6013389200,"Contra Costa","Low Resource"]
[6013392200,"Contra Costa","Low Resource"]
[6015000203,"Del Norte","Low Resource"]
[6017030402,"El Dorado","Low Resource"]
[6017030602,"El Dorado","Low Resource"]
[6017030603,"El Dorado","Low Resource"]
[6017031100,"El Dorado","Low Resource"]
[6017031200,"El Dorado","Low Resource"]
[6017031302,"El Dorado","Low Resource"]
[6017031402,"El Dorado","Low Resource"]
[6017031502,"El Dorado","Low Resource"]
[6017031504,"El Dorado","Low Resource"]
[6019001500,"Fresno","Low Resource"]
[6019001800,"Fresno","Low Resource"]
[6019001900,"Fresno","Low Resource"]
[6019002100,"Fresno","Low Resource"]
[6019002200,"Fresno","Low Resource"]
[6019002602,"Fresno","Low Resource"]
[6019002904,"Fresno","Low Resource"]
[6019003001,"Fresno","Low Resource"]
[6019003004,"Fresno","Low Resource"]
[6019003301,"Fresno","Low Resource"]
[6019003500,"Fresno","Low Resource"]
[6019003701,"Fresno","Low Resource"]
[6019003809,"Fresno","Low Resource"]
[6019005301,"Fresno","Low Resource"]
[6019005305,"Fresno","Low Resource"]
[6019007801,"Fresno","Low Resource"]
[6019007902,"Fresno","Low Resource"]
[6019008100,"Fresno","Low Resource"]
[6019008402,"Fresno","Low Resource"]
[6021010300,"Glenn","Low Resource"]
[6021010400,"Glenn","Low Resource"]
[6023000400,"Humboldt","Low Resource"]
[6023000500,"Humboldt","Low Resource"]
[6023010102,"Humboldt","Low Resource"]
[6023010800,"Humboldt","Low Resource"]
[6023011100,"Humboldt","Low Resource"]
[6023011500,"Humboldt","Low Resource"]
[6023011600,"Humboldt","Low Resource"]
[6023940000,"Humboldt","Low Resource"]
[6025010102,"Imperial","Low Resource"]
[6025010400,"Imperial","Low Resource"]
[6025010700,"Imperial","Low Resource"]
[6025011202,"Imperial","Low Resource"]
[6025011500,"Imperial","Low Resource"]
[6025011600,"Imperial","Low Resource"]
[6025011900,"Imperial","Low Resource"]
[6025012001,"Imperial","Low Resource"]
[6025012002,"Imperial","Low Resource"]
[6025012100,"Imperial","Low Resource"]
[6025012200,"Imperial","Low Resource"]
[6025012302,"Imperial","Low Resource"]
[6027000500,"Inyo","Low Resource"]
[6027000800,"Inyo","Low Resource"]
[6029000101,"Kern","Low Resource"]
[6029000102,"Kern","Low Resource"]
[6029000200,"Kern","Low Resource"]
[6029000300,"Kern","Low Resource"]
[6029000400,"Kern","Low Resource"]
[6029001000,"Kern","Low Resource"]
[6029001101,"Kern","Low Resource"]
[6029001901,"Kern","Low Resource"]
[6029002400,"Kern","Low Resource"]
[6029002700,"Kern","Low Resource"]
[6029002814,"Kern","Low Resource"]
[6029002815,"Kern","Low Resource"]
[6029002816,"Kern","Low Resource"]
[6029003103,"Kern","Low Resource"]
[6029003112,"Kern","Low Resource"]
[6029003202,"Kern","Low Resource"]
[6029003303,"Kern","Low Resource"]
[6029003304,"Kern","Low Resource"]
[6029004604,"Kern","Low Resource"]
[6029005103,"Kern","Low Resource"]
[6029005204,"Kern","Low Resource"]
[6029005802,"Kern","Low Resource"]
[6029006202,"Kern","Low Resource"]
[6029006301,"Kern","Low Resource"]
[6029006500,"Kern","Low Resource"]
[6031000800,"Kings","Low Resource"]
[6031001002,"Kings","Low Resource"]
[6031001003,"Kings","Low Resource"]
[6031001200,"Kings","Low Resource"]
[6031001500,"Kings","Low Resource"]
[6033000501,"Lake","Low Resource"]
[6033000600,"Lake","Low Resource"]
[6035040100,"Lassen","Low Resource"]
[6035040600,"Lassen","Low Resource"]
[6037102105,"Los Angeles","Low Resource"]
[6037104103,"Los Angeles","Low Resource"]
[6037104105,"Los Angeles","Low Resource"]
[6037104108,"Los Angeles","Low Resource"]
[6037104201,"Los Angeles","Low Resource"]
[6037104203,"Los Angeles","Low Resource"]
[6037104204,"Los Angeles","Low Resource"]
[6037104310,"Los Angeles","Low Resource"]
[6037104320,"Los Angeles","Low Resource"]
[6037104401,"Los Angeles","Low Resource"]
[6037104403,"Los Angeles","Low Resource"]
[6037104404,"Los Angeles","Low Resource"]
[6037104500,"Los Angeles","Low Resource"]
[6037104610,"Los Angeles","Low Resource"]
[6037104620,"Los Angeles","Low Resource"]
[6037104704,"Los Angeles","Low Resource"]
[6037104810,"Los Angeles","Low Resource"]
[6037104822,"Los Angeles","Low Resource"]
[6037106403,"Los Angeles","Low Resource"]
[6037106407,"Los Angeles","Low Resource"]
[6037106408,"Los Angeles","Low Resource"]
[6037106520,"Los Angeles","Low Resource"]
[6037106604,"Los Angeles","Low Resource"]
[6037106648,"Los Angeles","Low Resource"]
[6037106649,"Los Angeles","Low Resource"]
[6037107010,"Los Angeles","Low Resource"]
[6037107020,"Los Angeles","Low Resource"]
[6037109100,"Los Angeles","Low Resource"]
[6037109500,"Los Angeles","Low Resource"]
[6037113234,"Los Angeles","Low Resource"]
[6037113421,"Los Angeles","Low Resource"]
[6037115103,"Los Angeles","Low Resource"]
[6037115403,"Los Angeles","Low Resource"]
[6037115404,"Los Angeles","Low Resource"]
[6037117102,"Los Angeles","Low Resource"]
[6037119202,"Los Angeles","Low Resource"]
[6037119310,"Los Angeles","Low Resource"]
[6037119341,"Los Angeles","Low Resource"]
[6037119342,"Los Angeles","Low Resource"]
[6037120010,"Los Angeles","Low Resource"]
[6037120020,"Los Angeles","Low Resource"]
[6037120300,"Los Angeles","Low Resource"]
[6037120400,"Los Angeles","Low Resource"]
[6037121010,"Los Angeles","Low Resource"]
[6037121020,"Los Angeles","Low Resource"]
[6037121101,"Los Angeles","Low Resource"]
[6037121102,"Los Angeles","Low Resource"]
[6037121210,"Los Angeles","Low Resource"]
[6037121221,"Los Angeles","Low Resource"]
[6037121222,"Los Angeles","Low Resource"]
[6037121801,"Los Angeles","Low Resource"]
[6037121802,"Los Angeles","Low Resource"]
[6037121900,"Los Angeles","Low Resource"]
[6037122000,"Los Angeles","Low Resource"]
[6037122120,"Los Angeles","Low Resource"]
[6037122121,"Los Angeles","Low Resource"]
[6037122122,"Los Angeles","Low Resource"]
[6037122200,"Los Angeles","Low Resource"]
[6037122420,"Los Angeles","Low Resource"]
[6037123020,"Los Angeles","Low Resource"]
[6037123103,"Los Angeles","Low Resource"]
[6037123205,"Los Angeles","Low Resource"]
[6037123301,"Los Angeles","Low Resource"]
[6037123303,"Los Angeles","Low Resource"]
[6037123304,"Los Angeles","Low Resource"]
[6037123410,"Los Angeles","Low Resource"]
[6037123420,"Los Angeles","Low Resource"]
[6037124103,"Los Angeles","Low Resource"]
[6037127104,"Los Angeles","Low Resource"]
[6037127300,"Los Angeles","Low Resource"]
[6037127400,"Los Angeles","Low Resource"]
[6037127604,"Los Angeles","Low Resource"]
[6037127605,"Los Angeles","Low Resource"]
[6037127606,"Los Angeles","Low Resource"]
[6037127711,"Los Angeles","Low Resource"]
[6037127712,"Los Angeles","Low Resource"]
[6037127803,"Los Angeles","Low Resource"]
[6037127805,"Los Angeles","Low Resource"]
[6037127806,"Los Angeles","Low Resource"]
[6037127910,"Los Angeles","Low Resource"]
[6037127920,"Los Angeles","Low Resource"]
[6037131010,"Los Angeles","Low Resource"]
[6037131600,"Los Angeles","Low Resource"]
[6037132101,"Los Angeles","Low Resource"]
[6037132502,"Los Angeles","Low Resource"]
[6037134002,"Los Angeles","Low Resource"]
[6037134520,"Los Angeles","Low Resource"]
[6037134522,"Los Angeles","Low Resource"]
[6037134903,"Los Angeles","Low Resource"]
[6037185203,"Los Angeles","Low Resource"]
[6037185310,"Los Angeles","Low Resource"]
[6037185320,"Los Angeles","Low Resource"]
[6037188100,"Los Angeles","Low Resource"]
[6037192610,"Los Angeles","Low Resource"]
[6037192620,"Los Angeles","Low Resource"]
[6037199400,"Los Angeles","Low Resource"]
[6037199800,"Los Angeles","Low Resource"]
[6037201700,"Los Angeles","Low Resource"]
[6037203600,"Los Angeles","Low Resource"]
[6037203800,"Los Angeles","Low Resource"]
[6037203900,"Los Angeles","Low Resource"]
[6037204110,"Los Angeles","Low Resource"]
[6037204120,"Los Angeles","Low Resource"]
[6037204700,"Los Angeles","Low Resource"]
[6037204810,"Los Angeles","Low Resource"]
[6037204820,"Los Angeles","Low Resource"]
[6037204910,"Los Angeles","Low Resource"]
[6037206031,"Los Angeles","Low Resource"]
[6037207301,"Los Angeles","Low Resource"]
[6037207302,"Los Angeles","Low Resource"]
[6037207710,"Los Angeles","Low Resource"]
[6037208401,"Los Angeles","Low Resource"]
[6037208402,"Los Angeles","Low Resource"]
[6037208502,"Los Angeles","Low Resource"]
[6037208620,"Los Angeles","Low Resource"]
[6037212202,"Los Angeles","Low Resource"]
[6037212306,"Los Angeles","Low Resource"]
[6037213320,"Los Angeles","Low Resource"]
[6037213401,"Los Angeles","Low Resource"]
[6037213402,"Los Angeles","Low Resource"]
[6037218400,"Los Angeles","Low Resource"]
[6037218500,"Los Angeles","Low Resource"]
[6037218600,"Los Angeles","Low Resource"]
[6037218702,"Los Angeles","Low Resource"]
[6037218900,"Los Angeles","Low Resource"]
[6037221220,"Los Angeles","Low Resource"]
[6037221810,"Los Angeles","Low Resource"]
[6037221820,"Los Angeles","Low Resource"]
[6037222600,"Los Angeles","Low Resource"]
[6037222700,"Los Angeles","Low Resource"]
[6037224410,"Los Angeles","Low Resource"]
[6037224700,"Los Angeles","Low Resource"]
[6037232400,"Los Angeles","Low Resource"]
[6037234501,"Los Angeles","Low Resource"]
[6037234502,"Los Angeles","Low Resource"]
[6037234600,"Los Angeles","Low Resource"]
[6037234700,"Los Angeles","Low Resource"]
[6037234800,"Los Angeles","Low Resource"]
[6037234902,"Los Angeles","Low Resource"]
[6037235201,"Los Angeles","Low Resource"]
[6037235202,"Los Angeles","Low Resource"]
[6037236100,"Los Angeles","Low Resource"]
[6037236203,"Los Angeles","Low Resource"]
[6037237201,"Los Angeles","Low Resource"]
[6037237202,"Los Angeles","Low Resource"]
[6037237300,"Los Angeles","Low Resource"]
[6037237402,"Los Angeles","Low Resource"]
[6037237600,"Los Angeles","Low Resource"]
[6037237800,"Los Angeles","Low Resource"]
[6037237900,"Los Angeles","Low Resource"]
[6037238000,"Los Angeles","Low Resource"]
[6037238100,"Los Angeles","Low Resource"]
[6037238200,"Los Angeles","Low Resource"]
[6037238400,"Los Angeles","Low Resource"]
[6037239501,"Los Angeles","Low Resource"]
[6037240300,"Los Angeles","Low Resource"]
[6037240600,"Los Angeles","Low Resource"]
[6037240700,"Los Angeles","Low Resource"]
[6037241002,"Los Angeles","Low Resource"]
[6037241201,"Los Angeles","Low Resource"]
[6037241300,"Los Angeles","Low Resource"]
[6037265301,"Los Angeles","Low Resource"]
[6037277400,"Los Angeles","Low Resource"]
[6037291120,"Los Angeles","Low Resource"]
[6037291130,"Los Angeles","Low Resource"]
[6037291210,"Los Angeles","Low Resource"]
[6037291220,"Los Angeles","Low Resource"]
[6037293307,"Los Angeles","Low Resource"]
[6037294110,"Los Angeles","Low Resource"]
[6037294120,"Los Angeles","Low Resource"]
[6037294200,"Los Angeles","Low Resource"]
[6037294301,"Los Angeles","Low Resource"]
[6037294302,"Los Angeles","Low Resource"]
[6037294421,"Los Angeles","Low Resource"]
[6037294510,"Los Angeles","Low Resource"]
[6037294620,"Los Angeles","Low Resource"]
[6037294900,"Los Angeles","Low Resource"]
[6037296500,"Los Angeles","Low Resource"]
[6037296600,"Los Angeles","Low Resource"]
[6037296902,"Los Angeles","Low Resource"]
[6037297120,"Los Angeles","Low Resource"]
[6037320201,"Los Angeles","Low Resource"]
[6037320300,"Los Angeles","Low Resource"]
[6037401704,"Los Angeles","Low Resource"]
[6037402101,"Los Angeles","Low Resource"]
[6037402102,"Los Angeles","Low Resource"]
[6037402200,"Los Angeles","Low Resource"]
[6037402301,"Los Angeles","Low Resource"]
[6037402402,"Los Angeles","Low Resource"]
[6037402403,"Los Angeles","Low Resource"]
[6037402404,"Los Angeles","Low Resource"]
[6037402405,"Los Angeles","Low Resource"]
[6037402406,"Los Angeles","Low Resource"]
[6037402501,"Los Angeles","Low Resource"]
[6037402502,"Los Angeles","Low Resource"]
[6037402600,"Los Angeles","Low Resource"]
[6037402703,"Los Angeles","Low Resource"]
[6037402705,"Los Angeles","Low Resource"]
[6037402706,"Los Angeles","Low Resource"]
[6037402803,"Los Angeles","Low Resource"]
[6037402804,"Los Angeles","Low Resource"]
[6037402903,"Los Angeles","Low Resource"]
[6037402904,"Los Angeles","Low Resource"]
[6037403000,"Los Angeles","Low Resource"]
[6037403200,"Los Angeles","Low Resource"]
[6037403317,"Los Angeles","Low Resource"]
[6037404301,"Los Angeles","Low Resource"]
[6037404401,"Los Angeles","Low Resource"]
[6037404402,"Los Angeles","Low Resource"]
[6037404501,"Los Angeles","Low Resource"]
[6037404600,"Los Angeles","Low Resource"]
[6037404701,"Los Angeles","Low Resource"]
[6037404702,"Los Angeles","Low Resource"]
[6037404703,"Los Angeles","Low Resource"]
[6037404802,"Los Angeles","Low Resource"]
[6037405001,"Los Angeles","Low Resource"]
[6037405002,"Los Angeles","Low Resource"]
[6037405101,"Los Angeles","Low Resource"]
[6037405102,"Los Angeles","Low Resource"]
[6037405201,"Los Angeles","Low Resource"]
[6037407002,"Los Angeles","Low Resource"]
[6037407200,"Los Angeles","Low Resource"]
[6037407302,"Los Angeles","Low Resource"]
[6037407602,"Los Angeles","Low Resource"]
[6037407701,"Los Angeles","Low Resource"]
[6037407801,"Los Angeles","Low Resource"]
[6037408133,"Los Angeles","Low Resource"]
[6037408138,"Los Angeles","Low Resource"]
[6037408139,"Los Angeles","Low Resource"]
[6037408140,"Los Angeles","Low Resource"]
[6037408141,"Los Angeles","Low Resource"]
[6037408202,"Los Angeles","Low Resource"]
[6037408401,"Los Angeles","Low Resource"]
[6037408501,"Los Angeles","Low Resource"]
[6037430102,"Los Angeles","Low Resource"]
[6037432300,"Los Angeles","Low Resource"]
[6037432401,"Los Angeles","Low Resource"]
[6037432402,"Los Angeles","Low Resource"]
[6037432500,"Los Angeles","Low Resource"]
[6037432601,"Los Angeles","Low Resource"]
[6037432700,"Los Angeles","Low Resource"]
[6037432801,"Los Angeles","Low Resource"]
[6037432902,"Los Angeles","Low Resource"]
[6037433101,"Los Angeles","Low Resource"]
[6037433102,"Los Angeles","Low Resource"]
[6037433200,"Los Angeles","Low Resource"]
[6037433302,"Los Angeles","Low Resource"]
[6037433304,"Los Angeles","Low Resource"]
[6037433306,"Los Angeles","Low Resource"]
[6037433307,"Los Angeles","Low Resource"]
[6037433401,"Los Angeles","Low Resource"]
[6037433402,"Los Angeles","Low Resource"]
[6037433503,"Los Angeles","Low Resource"]
[6037433504,"Los Angeles","Low Resource"]
[6037433700,"Los Angeles","Low Resource"]
[6037433802,"Los Angeles","Low Resource"]
[6037433902,"Los Angeles","Low Resource"]
[6037434001,"Los Angeles","Low Resource"]
[6037434003,"Los Angeles","Low Resource"]
[6037434004,"Los Angeles","Low Resource"]
[6037461000,"Los Angeles","Low Resource"]
[6037461600,"Los Angeles","Low Resource"]
[6037461901,"Los Angeles","Low Resource"]
[6037462001,"Los Angeles","Low Resource"]
[6037462002,"Los Angeles","Low Resource"]
[6037462301,"Los Angeles","Low Resource"]
[6037500500,"Los Angeles","Low Resource"]
[6037500600,"Los Angeles","Low Resource"]
[6037501001,"Los Angeles","Low Resource"]
[6037501803,"Los Angeles","Low Resource"]
[6037502004,"Los Angeles","Low Resource"]
[6037502100,"Los Angeles","Low Resource"]
[6037502301,"Los Angeles","Low Resource"]
[6037502302,"Los Angeles","Low Resource"]
[6037502700,"Los Angeles","Low Resource"]
[6037502902,"Los Angeles","Low Resource"]
[6037503000,"Los Angeles","Low Resource"]
[6037503103,"Los Angeles","Low Resource"]
[6037503104,"Los Angeles","Low Resource"]
[6037503105,"Los Angeles","Low Resource"]
[6037530004,"Los Angeles","Low Resource"]
[6037530101,"Los Angeles","Low Resource"]
[6037530601,"Los Angeles","Low Resource"]
[6037530700,"Los Angeles","Low Resource"]
[6037530801,"Los Angeles","Low Resource"]
[6037530802,"Los Angeles","Low Resource"]
[6037530901,"Los Angeles","Low Resource"]
[6037531000,"Los Angeles","Low Resource"]
[6037531101,"Los Angeles","Low Resource"]
[6037531102,"Los Angeles","Low Resource"]
[6037531201,"Los Angeles","Low Resource"]
[6037531202,"Los Angeles","Low Resource"]
[6037531302,"Los Angeles","Low Resource"]
[6037531502,"Los Angeles","Low Resource"]
[6037531503,"Los Angeles","Low Resource"]
[6037531504,"Los Angeles","Low Resource"]
[6037531602,"Los Angeles","Low Resource"]
[6037531901,"Los Angeles","Low Resource"]
[6037531902,"Los Angeles","Low Resource"]
[6037532001,"Los Angeles","Low Resource"]
[6037532002,"Los Angeles","Low Resource"]
[6037532101,"Los Angeles","Low Resource"]
[6037532200,"Los Angeles","Low Resource"]
[6037532302,"Los Angeles","Low Resource"]
[6037532303,"Los Angeles","Low Resource"]
[6037532304,"Los Angeles","Low Resource"]
[6037532500,"Los Angeles","Low Resource"]
[6037532603,"Los Angeles","Low Resource"]
[6037532700,"Los Angeles","Low Resource"]
[6037533002,"Los Angeles","Low Resource"]
[6037533401,"Los Angeles","Low Resource"]
[6037533402,"Los Angeles","Low Resource"]
[6037533501,"Los Angeles","Low Resource"]
[6037533601,"Los Angeles","Low Resource"]
[6037533602,"Los Angeles","Low Resource"]
[6037533603,"Los Angeles","Low Resource"]
[6037533703,"Los Angeles","Low Resource"]
[6037533803,"Los Angeles","Low Resource"]
[6037533804,"Los Angeles","Low Resource"]
[6037533805,"Los Angeles","Low Resource"]
[6037533902,"Los Angeles","Low Resource"]
[6037534002,"Los Angeles","Low Resource"]
[6037534203,"Los Angeles","Low Resource"]
[6037534405,"Los Angeles","Low Resource"]
[6037534406,"Los Angeles","Low Resource"]
[6037534501,"Los Angeles","Low Resource"]
[6037534502,"Los Angeles","Low Resource"]
[6037534804,"Los Angeles","Low Resource"]
[6037534900,"Los Angeles","Low Resource"]
[6037535001,"Los Angeles","Low Resource"]
[6037535200,"Los Angeles","Low Resource"]
[6037535501,"Los Angeles","Low Resource"]
[6037535502,"Los Angeles","Low Resource"]
[6037535603,"Los Angeles","Low Resource"]
[6037535604,"Los Angeles","Low Resource"]
[6037535702,"Los Angeles","Low Resource"]
[6037535803,"Los Angeles","Low Resource"]
[6037536000,"Los Angeles","Low Resource"]
[6037536102,"Los Angeles","Low Resource"]
[6037536103,"Los Angeles","Low Resource"]
[6037536104,"Los Angeles","Low Resource"]
[6037540000,"Los Angeles","Low Resource"]
[6037540101,"Los Angeles","Low Resource"]
[6037540102,"Los Angeles","Low Resource"]
[6037540203,"Los Angeles","Low Resource"]
[6037540300,"Los Angeles","Low Resource"]
[6037540501,"Los Angeles","Low Resource"]
[6037540700,"Los Angeles","Low Resource"]
[6037540800,"Los Angeles","Low Resource"]
[6037540902,"Los Angeles","Low Resource"]
[6037541001,"Los Angeles","Low Resource"]
[6037541002,"Los Angeles","Low Resource"]
[6037541100,"Los Angeles","Low Resource"]
[6037541200,"Los Angeles","Low Resource"]
[6037541300,"Los Angeles","Low Resource"]
[6037541500,"Los Angeles","Low Resource"]
[6037541605,"Los Angeles","Low Resource"]
[6037541606,"Los Angeles","Low Resource"]
[6037541700,"Los Angeles","Low Resource"]
[6037541802,"Los Angeles","Low Resource"]
[6037542000,"Los Angeles","Low Resource"]
[6037542103,"Los Angeles","Low Resource"]
[6037542104,"Los Angeles","Low Resource"]
[6037542106,"Los Angeles","Low Resource"]
[6037542200,"Los Angeles","Low Resource"]
[6037542401,"Los Angeles","Low Resource"]
[6037542402,"Los Angeles","Low Resource"]
[6037542602,"Los Angeles","Low Resource"]
[6037542700,"Los Angeles","Low Resource"]
[6037542800,"Los Angeles","Low Resource"]
[6037542900,"Los Angeles","Low Resource"]
[6037543000,"Los Angeles","Low Resource"]
[6037543100,"Los Angeles","Low Resource"]
[6037543201,"Los Angeles","Low Resource"]
[6037543202,"Los Angeles","Low Resource"]
[6037543305,"Los Angeles","Low Resource"]
[6037543306,"Los Angeles","Low Resource"]
[6037543400,"Los Angeles","Low Resource"]
[6037543801,"Los Angeles","Low Resource"]
[6037543903,"Los Angeles","Low Resource"]
[6037553503,"Los Angeles","Low Resource"]
[6037553504,"Los Angeles","Low Resource"]
[6037553601,"Los Angeles","Low Resource"]
[6037553602,"Los Angeles","Low Resource"]
[6037553701,"Los Angeles","Low Resource"]
[6037553702,"Los Angeles","Low Resource"]
[6037553801,"Los Angeles","Low Resource"]
[6037553802,"Los Angeles","Low Resource"]
[6037553902,"Los Angeles","Low Resource"]
[6037554101,"Los Angeles","Low Resource"]
[6037554204,"Los Angeles","Low Resource"]
[6037554301,"Los Angeles","Low Resource"]
[6037554302,"Los Angeles","Low Resource"]
[6037554404,"Los Angeles","Low Resource"]
[6037554600,"Los Angeles","Low Resource"]
[6037554801,"Los Angeles","Low Resource"]
[6037570202,"Los Angeles","Low Resource"]
[6037570203,"Los Angeles","Low Resource"]
[6037570204,"Los Angeles","Low Resource"]
[6037570301,"Los Angeles","Low Resource"]
[6037570303,"Los Angeles","Low Resource"]
[6037570304,"Los Angeles","Low Resource"]
[6037570402,"Los Angeles","Low Resource"]
[6037570404,"Los Angeles","Low Resource"]
[6037570502,"Los Angeles","Low Resource"]
[6037570601,"Los Angeles","Low Resource"]
[6037571701,"Los Angeles","Low Resource"]
[6037571703,"Los Angeles","Low Resource"]
[6037572301,"Los Angeles","Low Resource"]
[6037572302,"Los Angeles","Low Resource"]
[6037572600,"Los Angeles","Low Resource"]
[6037572700,"Los Angeles","Low Resource"]
[6037572900,"Los Angeles","Low Resource"]
[6037573100,"Los Angeles","Low Resource"]
[6037573201,"Los Angeles","Low Resource"]
[6037573202,"Los Angeles","Low Resource"]
[6037574601,"Los Angeles","Low Resource"]
[6037575103,"Los Angeles","Low Resource"]
[6037575201,"Los Angeles","Low Resource"]
[6037575300,"Los Angeles","Low Resource"]
[6037576001,"Los Angeles","Low Resource"]
[6037576301,"Los Angeles","Low Resource"]
[6037576302,"Los Angeles","Low Resource"]
[6037576402,"Los Angeles","Low Resource"]
[6037576501,"Los Angeles","Low Resource"]
[6037576601,"Los Angeles","Low Resource"]
[6037576903,"Los Angeles","Low Resource"]
[6037576904,"Los Angeles","Low Resource"]
[6037600202,"Los Angeles","Low Resource"]
[6037600400,"Los Angeles","Low Resource"]
[6037600501,"Los Angeles","Low Resource"]
[6037600502,"Los Angeles","Low Resource"]
[6037600601,"Los Angeles","Low Resource"]
[6037600704,"Los Angeles","Low Resource"]
[6037600912,"Los Angeles","Low Resource"]
[6037601001,"Los Angeles","Low Resource"]
[6037601002,"Los Angeles","Low Resource"]
[6037601100,"Los Angeles","Low Resource"]
[6037601202,"Los Angeles","Low Resource"]
[6037601211,"Los Angeles","Low Resource"]
[6037601212,"Los Angeles","Low Resource"]
[6037601401,"Los Angeles","Low Resource"]
[6037601402,"Los Angeles","Low Resource"]
[6037601502,"Los Angeles","Low Resource"]
[6037601600,"Los Angeles","Low Resource"]
[6037601802,"Los Angeles","Low Resource"]
[6037601900,"Los Angeles","Low Resource"]
[6037602002,"Los Angeles","Low Resource"]
[6037602003,"Los Angeles","Low Resource"]
[6037602004,"Los Angeles","Low Resource"]
[6037602103,"Los Angeles","Low Resource"]
[6037602104,"Los Angeles","Low Resource"]
[6037602105,"Los Angeles","Low Resource"]
[6037602106,"Los Angeles","Low Resource"]
[6037602504,"Los Angeles","Low Resource"]
[6037602506,"Los Angeles","Low Resource"]
[6037602507,"Los Angeles","Low Resource"]
[6037602508,"Los Angeles","Low Resource"]
[6037602509,"Los Angeles","Low Resource"]
[6037602600,"Los Angeles","Low Resource"]
[6037602700,"Los Angeles","Low Resource"]
[6037602802,"Los Angeles","Low Resource"]
[6037602900,"Los Angeles","Low Resource"]
[6037603001,"Los Angeles","Low Resource"]
[6037603102,"Los Angeles","Low Resource"]
[6037603704,"Los Angeles","Low Resource"]
[6037900102,"Los Angeles","Low Resource"]
[6037900103,"Los Angeles","Low Resource"]
[6037900104,"Los Angeles","Low Resource"]
[6037900201,"Los Angeles","Low Resource"]
[6037900300,"Los Angeles","Low Resource"]
[6037900501,"Los Angeles","Low Resource"]
[6037900504,"Los Angeles","Low Resource"]
[6037900505,"Los Angeles","Low Resource"]
[6037900507,"Los Angeles","Low Resource"]
[6037900508,"Los Angeles","Low Resource"]
[6037900704,"Los Angeles","Low Resource"]
[6037900705,"Los Angeles","Low Resource"]
[6037900803,"Los Angeles","Low Resource"]
[6037900804,"Los Angeles","Low Resource"]
[6037900805,"Los Angeles","Low Resource"]
[6037901008,"Los Angeles","Low Resource"]
[6037901102,"Los Angeles","Low Resource"]
[6037910001,"Los Angeles","Low Resource"]
[6037910002,"Los Angeles","Low Resource"]
[6037910201,"Los Angeles","Low Resource"]
[6037910208,"Los Angeles","Low Resource"]
[6037910401,"Los Angeles","Low Resource"]
[6037910404,"Los Angeles","Low Resource"]
[6037910502,"Los Angeles","Low Resource"]
[6037910505,"Los Angeles","Low Resource"]
[6037910603,"Los Angeles","Low Resource"]
[6037910605,"Los Angeles","Low Resource"]
[6037910606,"Los Angeles","Low Resource"]
[6037910705,"Los Angeles","Low Resource"]
[6037910706,"Los Angeles","Low Resource"]
[6037910707,"Los Angeles","Low Resource"]
[6037910709,"Los Angeles","Low Resource"]
[6037910711,"Los Angeles","Low Resource"]
[6037910712,"Los Angeles","Low Resource"]
[6037910713,"Los Angeles","Low Resource"]
[6037910714,"Los Angeles","Low Resource"]
[6037910715,"Los Angeles","Low Resource"]
[6037910716,"Los Angeles","Low Resource"]
[6037980015,"Los Angeles","Low Resource"]
[6039000300,"Madera","Low Resource"]
[6039000502,"Madera","Low Resource"]
[6039000506,"Madera","Low Resource"]
[6039000508,"Madera","Low Resource"]
[6039001000,"Madera","Low Resource"]
[6041110100,"Marin","Low Resource"]
[6041112100,"Marin","Low Resource"]
[6041112202,"Marin","Low Resource"]
[6041132200,"Marin","Low Resource"]
[6041133000,"Marin","Low Resource"]
[6043000101,"Mariposa","Low Resource"]
[6043000102,"Mariposa","Low Resource"]
[6045010100,"Mendocino","Low Resource"]
[6045010200,"Mendocino","Low Resource"]
[6045010600,"Mendocino","Low Resource"]
[6045010700,"Mendocino","Low Resource"]
[6045011300,"Mendocino","Low Resource"]
[6045011600,"Mendocino","Low Resource"]
[6047000201,"Merced","Low Resource"]
[6047000504,"Merced","Low Resource"]
[6047000505,"Merced","Low Resource"]
[6047000701,"Merced","Low Resource"]
[6047001501,"Merced","Low Resource"]
[6047001602,"Merced","Low Resource"]
[6047001902,"Merced","Low Resource"]
[6047002000,"Merced","Low Resource"]
[6047002402,"Merced","Low Resource"]
[6049000100,"Modoc","Low Resource"]
[6051000101,"Mono","Low Resource"]
[6053000101,"Monterey","Low Resource"]
[6053000102,"Monterey","Low Resource"]
[6053000103,"Monterey","Low Resource"]
[6053000104,"Monterey","Low Resource"]
[6053000200,"Monterey","Low Resource"]
[6053000300,"Monterey","Low Resource"]
[6053000400,"Monterey","Low Resource"]
[6053000502,"Monterey","Low Resource"]
[6053000600,"Monterey","Low Resource"]
[6053000800,"Monterey","Low Resource"]
[6053001200,"Monterey","Low Resource"]
[6053001400,"Monterey","Low Resource"]
[6053001600,"Monterey","Low Resource"]
[6053001700,"Monterey","Low Resource"]
[6053001801,"Monterey","Low Resource"]
[6053001802,"Monterey","Low Resource"]
[6053010101,"Monterey","Low Resource"]
[6053010306,"Monterey","Low Resource"]
[6053010504,"Monterey","Low Resource"]
[6053010505,"Monterey","Low Resource"]
[6053010506,"Monterey","Low Resource"]
[6053010604,"Monterey","Low Resource"]
[6053010605,"Monterey","Low Resource"]
[6053010606,"Monterey","Low Resource"]
[6053010608,"Monterey","Low Resource"]
[6053011202,"Monterey","Low Resource"]
[6053011203,"Monterey","Low Resource"]
[6053011302,"Monterey","Low Resource"]
[6053011304,"Monterey","Low Resource"]
[6053011400,"Monterey","Low Resource"]
[6053013500,"Monterey","Low Resource"]
[6053014000,"Monterey","Low Resource"]
[6053014104,"Monterey","Low Resource"]
[6053014302,"Monterey","Low Resource"]
[6053014500,"Monterey","Low Resource"]
[6053014601,"Monterey","Low Resource"]
[6055200201,"Napa","Low Resource"]
[6055200202,"Napa","Low Resource"]
[6055200203,"Napa","Low Resource"]
[6055200301,"Napa","Low Resource"]
[6055200501,"Napa","Low Resource"]
[6055200503,"Napa","Low Resource"]
[6055200505,"Napa","Low Resource"]
[6055200704,"Napa","Low Resource"]
[6055200804,"Napa","Low Resource"]
[6055201102,"Napa","Low Resource"]
[6055201300,"Napa","Low Resource"]
[6055201403,"Napa","Low Resource"]
[6055201800,"Napa","Low Resource"]
[6057000402,"Nevada","Low Resource"]
[6057000501,"Nevada","Low Resource"]
[6057000502,"Nevada","Low Resource"]
[6057000600,"Nevada","Low Resource"]
[6057000701,"Nevada","Low Resource"]
[6057000900,"Nevada","Low Resource"]
[6059001101,"Orange","Low Resource"]
[6059001102,"Orange","Low Resource"]
[6059001103,"Orange","Low Resource"]
[6059001201,"Orange","Low Resource"]
[6059001202,"Orange","Low Resource"]
[6059001301,"Orange","Low Resource"]
[6059001303,"Orange","Low Resource"]
[6059001304,"Orange","Low Resource"]
[6059001401,"Orange","Low Resource"]
[6059001402,"Orange","Low Resource"]
[6059001403,"Orange","Low Resource"]
[6059001404,"Orange","Low Resource"]
[6059001802,"Orange","Low Resource"]
[6059001902,"Orange","Low Resource"]
[6059001903,"Orange","Low Resource"]
[6059011101,"Orange","Low Resource"]
[6059011102,"Orange","Low Resource"]
[6059011403,"Orange","Low Resource"]
[6059011504,"Orange","Low Resource"]
[6059011601,"Orange","Low Resource"]
[6059011602,"Orange","Low Resource"]
[6059011712,"Orange","Low Resource"]
[6059011714,"Orange","Low Resource"]
[6059011721,"Orange","Low Resource"]
[6059011722,"Orange","Low Resource"]
[6059032014,"Orange","Low Resource"]
[6059042310,"Orange","Low Resource"]
[6059042312,"Orange","Low Resource"]
[6059052408,"Orange","Low Resource"]
[6059052410,"Orange","Low Resource"]
[6059052411,"Orange","Low Resource"]
[6059062622,"Orange","Low Resource"]
[6059062646,"Orange","Low Resource"]
[6059062648,"Orange","Low Resource"]
[6059063603,"Orange","Low Resource"]
[6059063604,"Orange","Low Resource"]
[6059063701,"Orange","Low Resource"]
[6059063808,"Orange","Low Resource"]
[6059074003,"Orange","Low Resource"]
[6059074004,"Orange","Low Resource"]
[6059074005,"Orange","Low Resource"]
[6059074006,"Orange","Low Resource"]
[6059074102,"Orange","Low Resource"]
[6059074103,"Orange","Low Resource"]
[6059074106,"Orange","Low Resource"]
[6059074108,"Orange","Low Resource"]
[6059074109,"Orange","Low Resource"]
[6059074200,"Orange","Low Resource"]
[6059074300,"Orange","Low Resource"]
[6059074403,"Orange","Low Resource"]
[6059074406,"Orange","Low Resource"]
[6059074408,"Orange","Low Resource"]
[6059074502,"Orange","Low Resource"]
[6059074601,"Orange","Low Resource"]
[6059074602,"Orange","Low Resource"]
[6059074701,"Orange","Low Resource"]
[6059074702,"Orange","Low Resource"]
[6059074801,"Orange","Low Resource"]
[6059074802,"Orange","Low Resource"]
[6059074803,"Orange","Low Resource"]
[6059074901,"Orange","Low Resource"]
[6059075100,"Orange","Low Resource"]
[6059075201,"Orange","Low Resource"]
[6059075202,"Orange","Low Resource"]
[6059075301,"Orange","Low Resource"]
[6059075302,"Orange","Low Resource"]
[6059075401,"Orange","Low Resource"]
[6059075403,"Orange","Low Resource"]
[6059075512,"Orange","Low Resource"]
[6059075514,"Orange","Low Resource"]
[6059075515,"Orange","Low Resource"]
[6059075805,"Orange","Low Resource"]
[6059075806,"Orange","Low Resource"]
[6059075811,"Orange","Low Resource"]
[6059075815,"Orange","Low Resource"]
[6059075901,"Orange","Low Resource"]
[6059076000,"Orange","Low Resource"]
[6059076101,"Orange","Low Resource"]
[6059076102,"Orange","Low Resource"]
[6059076103,"Orange","Low Resource"]
[6059076204,"Orange","Low Resource"]
[6059076205,"Orange","Low Resource"]
[6059076206,"Orange","Low Resource"]
[6059076208,"Orange","Low Resource"]
[6059086301,"Orange","Low Resource"]
[6059086303,"Orange","Low Resource"]
[6059086304,"Orange","Low Resource"]
[6059086305,"Orange","Low Resource"]
[6059086306,"Orange","Low Resource"]
[6059086402,"Orange","Low Resource"]
[6059086404,"Orange","Low Resource"]
[6059086405,"Orange","Low Resource"]
[6059086406,"Orange","Low Resource"]
[6059086407,"Orange","Low Resource"]
[6059086501,"Orange","Low Resource"]
[6059086502,"Orange","Low Resource"]
[6059086601,"Orange","Low Resource"]
[6059086602,"Orange","Low Resource"]
[6059086701,"Orange","Low Resource"]
[6059086702,"Orange","Low Resource"]
[6059086801,"Orange","Low Resource"]
[6059086802,"Orange","Low Resource"]
[6059086803,"Orange","Low Resource"]
[6059086901,"Orange","Low Resource"]
[6059086902,"Orange","Low Resource"]
[6059086903,"Orange","Low Resource"]
[6059087001,"Orange","Low Resource"]
[6059087002,"Orange","Low Resource"]
[6059087102,"Orange","Low Resource"]
[6059087103,"Orange","Low Resource"]
[6059087105,"Orange","Low Resource"]
[6059087106,"Orange","Low Resource"]
[6059087200,"Orange","Low Resource"]
[6059087300,"Orange","Low Resource"]
[6059087401,"Orange","Low Resource"]
[6059087404,"Orange","Low Resource"]
[6059087503,"Orange","Low Resource"]
[6059087505,"Orange","Low Resource"]
[6059087601,"Orange","Low Resource"]
[6059087602,"Orange","Low Resource"]
[6059087701,"Orange","Low Resource"]
[6059087703,"Orange","Low Resource"]
[6059087704,"Orange","Low Resource"]
[6059087801,"Orange","Low Resource"]
[6059087802,"Orange","Low Resource"]
[6059087805,"Orange","Low Resource"]
[6059087806,"Orange","Low Resource"]
[6059087901,"Orange","Low Resource"]
[6059087902,"Orange","Low Resource"]
[6059088001,"Orange","Low Resource"]
[6059088101,"Orange","Low Resource"]
[6059088104,"Orange","Low Resource"]
[6059088106,"Orange","Low Resource"]
[6059088107,"Orange","Low Resource"]
[6059088201,"Orange","Low Resource"]
[6059088401,"Orange","Low Resource"]
[6059088402,"Orange","Low Resource"]
[6059088403,"Orange","Low Resource"]
[6059088501,"Orange","Low Resource"]
[6059088502,"Orange","Low Resource"]
[6059088901,"Orange","Low Resource"]
[6059088902,"Orange","Low Resource"]
[6059089001,"Orange","Low Resource"]
[6059089003,"Orange","Low Resource"]
[6059089004,"Orange","Low Resource"]
[6059089102,"Orange","Low Resource"]
[6059089104,"Orange","Low Resource"]
[6059089105,"Orange","Low Resource"]
[6059089106,"Orange","Low Resource"]
[6059089107,"Orange","Low Resource"]
[6059099202,"Orange","Low Resource"]
[6059099227,"Orange","Low Resource"]
[6059099247,"Orange","Low Resource"]
[6059099248,"Orange","Low Resource"]
[6059099249,"Orange","Low Resource"]
[6059099411,"Orange","Low Resource"]
[6059099601,"Orange","Low Resource"]
[6059099801,"Orange","Low Resource"]
[6059099903,"Orange","Low Resource"]
[6059099904,"Orange","Low Resource"]
[6059110202,"Orange","Low Resource"]
[6059110401,"Orange","Low Resource"]
[6059110500,"Orange","Low Resource"]
[6059110606,"Orange","Low Resource"]
[6061020200,"Placer","Low Resource"]
[6061020300,"Placer","Low Resource"]
[6061020401,"Placer","Low Resource"]
[6061020901,"Placer","Low Resource"]
[6061021304,"Placer","Low Resource"]
[6061021501,"Placer","Low Resource"]
[6061021603,"Placer","Low Resource"]
[6061021604,"Placer","Low Resource"]
[6061021802,"Placer","Low Resource"]
[6061022013,"Placer","Low Resource"]
[6063000100,"Plumas","Low Resource"]
[6063000400,"Plumas","Low Resource"]
[6065030101,"Riverside","Low Resource"]
[6065030104,"Riverside","Low Resource"]
[6065031401,"Riverside","Low Resource"]
[6065031502,"Riverside","Low Resource"]
[6065031601,"Riverside","Low Resource"]
[6065040101,"Riverside","Low Resource"]
[6065040204,"Riverside","Low Resource"]
[6065041002,"Riverside","Low Resource"]
[6065041004,"Riverside","Low Resource"]
[6065041201,"Riverside","Low Resource"]
[6065041202,"Riverside","Low Resource"]
[6065041203,"Riverside","Low Resource"]
[6065042209,"Riverside","Low Resource"]
[6065042212,"Riverside","Low Resource"]
[6065042300,"Riverside","Low Resource"]
[6065042405,"Riverside","Low Resource"]
[6065042406,"Riverside","Low Resource"]
[6065042506,"Riverside","Low Resource"]
[6065042508,"Riverside","Low Resource"]
[6065042509,"Riverside","Low Resource"]
[6065042510,"Riverside","Low Resource"]
[6065042511,"Riverside","Low Resource"]
[6065042512,"Riverside","Low Resource"]
[6065042513,"Riverside","Low Resource"]
[6065042514,"Riverside","Low Resource"]
[6065042516,"Riverside","Low Resource"]
[6065042517,"Riverside","Low Resource"]
[6065042518,"Riverside","Low Resource"]
[6065042519,"Riverside","Low Resource"]
[6065042521,"Riverside","Low Resource"]
[6065042617,"Riverside","Low Resource"]
[6065042618,"Riverside","Low Resource"]
[6065042723,"Riverside","Low Resource"]
[6065042741,"Riverside","Low Resource"]
[6065042901,"Riverside","Low Resource"]
[6065042902,"Riverside","Low Resource"]
[6065043001,"Riverside","Low Resource"]
[6065043003,"Riverside","Low Resource"]
[6065043005,"Riverside","Low Resource"]
[6065043006,"Riverside","Low Resource"]
[6065043306,"Riverside","Low Resource"]
[6065043307,"Riverside","Low Resource"]
[6065043308,"Riverside","Low Resource"]
[6065043309,"Riverside","Low Resource"]
[6065043310,"Riverside","Low Resource"]
[6065043311,"Riverside","Low Resource"]
[6065043312,"Riverside","Low Resource"]
[6065043313,"Riverside","Low Resource"]
[6065043316,"Riverside","Low Resource"]
[6065043317,"Riverside","Low Resource"]
[6065043401,"Riverside","Low Resource"]
[6065043404,"Riverside","Low Resource"]
[6065043405,"Riverside","Low Resource"]
[6065043503,"Riverside","Low Resource"]
[6065043504,"Riverside","Low Resource"]
[6065043505,"Riverside","Low Resource"]
[6065043506,"Riverside","Low Resource"]
[6065043507,"Riverside","Low Resource"]
[6065043508,"Riverside","Low Resource"]
[6065043513,"Riverside","Low Resource"]
[6065043517,"Riverside","Low Resource"]
[6065043701,"Riverside","Low Resource"]
[6065043702,"Riverside","Low Resource"]
[6065043703,"Riverside","Low Resource"]
[6065043813,"Riverside","Low Resource"]
[6065044000,"Riverside","Low Resource"]
[6065044102,"Riverside","Low Resource"]
[6065044104,"Riverside","Low Resource"]
[6065044300,"Riverside","Low Resource"]
[6065044521,"Riverside","Low Resource"]
[6065045207,"Riverside","Low Resource"]
[6065045302,"Riverside","Low Resource"]
[6065045707,"Riverside","Low Resource"]
[6065045900,"Riverside","Low Resource"]
[6065046101,"Riverside","Low Resource"]
[6065046401,"Riverside","Low Resource"]
[6065046402,"Riverside","Low Resource"]
[6065046500,"Riverside","Low Resource"]
[6065046700,"Riverside","Low Resource"]
[6065046800,"Riverside","Low Resource"]
[6065046900,"Riverside","Low Resource"]
[6065047000,"Riverside","Low Resource"]
[6065047201,"Riverside","Low Resource"]
[6065048901,"Riverside","Low Resource"]
[6065048902,"Riverside","Low Resource"]
[6065940400,"Riverside","Low Resource"]
[6065941500,"Riverside","Low Resource"]
[6067000500,"Sacramento","Low Resource"]
[6067001101,"Sacramento","Low Resource"]
[6067001800,"Sacramento","Low Resource"]
[6067002700,"Sacramento","Low Resource"]
[6067002900,"Sacramento","Low Resource"]
[6067003000,"Sacramento","Low Resource"]
[6067003101,"Sacramento","Low Resource"]
[6067003102,"Sacramento","Low Resource"]
[6067003501,"Sacramento","Low Resource"]
[6067003600,"Sacramento","Low Resource"]
[6067003800,"Sacramento","Low Resource"]
[6067004201,"Sacramento","Low Resource"]
[6067004202,"Sacramento","Low Resource"]
[6067004300,"Sacramento","Low Resource"]
[6067004401,"Sacramento","Low Resource"]
[6067004801,"Sacramento","Low Resource"]
[6067004904,"Sacramento","Low Resource"]
[6067004905,"Sacramento","Low Resource"]
[6067004906,"Sacramento","Low Resource"]
[6067005102,"Sacramento","Low Resource"]
[6067005205,"Sacramento","Low Resource"]
[6067005509,"Sacramento","Low Resource"]
[6067005510,"Sacramento","Low Resource"]
[6067005601,"Sacramento","Low Resource"]
[6067005901,"Sacramento","Low Resource"]
[6067006003,"Sacramento","Low Resource"]
[6067006101,"Sacramento","Low Resource"]
[6067006102,"Sacramento","Low Resource"]
[6067006400,"Sacramento","Low Resource"]
[6067006701,"Sacramento","Low Resource"]
[6067007004,"Sacramento","Low Resource"]
[6067007007,"Sacramento","Low Resource"]
[6067007011,"Sacramento","Low Resource"]
[6067007012,"Sacramento","Low Resource"]
[6067007014,"Sacramento","Low Resource"]
[6067007202,"Sacramento","Low Resource"]
[6067007204,"Sacramento","Low Resource"]
[6067007207,"Sacramento","Low Resource"]
[6067007208,"Sacramento","Low Resource"]
[6067007209,"Sacramento","Low Resource"]
[6067007402,"Sacramento","Low Resource"]
[6067007403,"Sacramento","Low Resource"]
[6067007406,"Sacramento","Low Resource"]
[6067007413,"Sacramento","Low Resource"]
[6067007414,"Sacramento","Low Resource"]
[6067007415,"Sacramento","Low Resource"]
[6067007416,"Sacramento","Low Resource"]
[6067007422,"Sacramento","Low Resource"]
[6067007428,"Sacramento","Low Resource"]
[6067007429,"Sacramento","Low Resource"]
[6067007501,"Sacramento","Low Resource"]
[6067007503,"Sacramento","Low Resource"]
[6067007504,"Sacramento","Low Resource"]
[6067007602,"Sacramento","Low Resource"]
[6067007903,"Sacramento","Low Resource"]
[6067008111,"Sacramento","Low Resource"]
[6067008113,"Sacramento","Low Resource"]
[6067008117,"Sacramento","Low Resource"]
[6067008127,"Sacramento","Low Resource"]
[6067008128,"Sacramento","Low Resource"]
[6067008129,"Sacramento","Low Resource"]
[6067008130,"Sacramento","Low Resource"]
[6067008131,"Sacramento","Low Resource"]
[6067008132,"Sacramento","Low Resource"]
[6067008133,"Sacramento","Low Resource"]
[6067008134,"Sacramento","Low Resource"]
[6067008138,"Sacramento","Low Resource"]
[6067008139,"Sacramento","Low Resource"]
[6067008141,"Sacramento","Low Resource"]
[6067008142,"Sacramento","Low Resource"]
[6067008143,"Sacramento","Low Resource"]
[6067008703,"Sacramento","Low Resource"]
[6067008907,"Sacramento","Low Resource"]
[6067008910,"Sacramento","Low Resource"]
[6067009004,"Sacramento","Low Resource"]
[6067009005,"Sacramento","Low Resource"]
[6067009006,"Sacramento","Low Resource"]
[6067009007,"Sacramento","Low Resource"]
[6067009008,"Sacramento","Low Resource"]
[6067009103,"Sacramento","Low Resource"]
[6067009105,"Sacramento","Low Resource"]
[6067009106,"Sacramento","Low Resource"]
[6067009107,"Sacramento","Low Resource"]
[6067009201,"Sacramento","Low Resource"]
[6067009316,"Sacramento","Low Resource"]
[6067009318,"Sacramento","Low Resource"]
[6067009319,"Sacramento","Low Resource"]
[6067009320,"Sacramento","Low Resource"]
[6067009503,"Sacramento","Low Resource"]
[6067009601,"Sacramento","Low Resource"]
[6067009610,"Sacramento","Low Resource"]
[6067009633,"Sacramento","Low Resource"]
[6067009800,"Sacramento","Low Resource"]
[6067009900,"Sacramento","Low Resource"]
[6069000200,"San Benito","Low Resource"]
[6069000502,"San Benito","Low Resource"]
[6071000303,"San Bernardino","Low Resource"]
[6071000825,"San Bernardino","Low Resource"]
[6071001305,"San Bernardino","Low Resource"]
[6071001309,"San Bernardino","Low Resource"]
[6071001400,"San Bernardino","Low Resource"]
[6071001501,"San Bernardino","Low Resource"]
[6071001803,"San Bernardino","Low Resource"]
[6071001812,"San Bernardino","Low Resource"]
[6071002204,"San Bernardino","Low Resource"]
[6071002207,"San Bernardino","Low Resource"]
[6071002306,"San Bernardino","Low Resource"]
[6071002401,"San Bernardino","Low Resource"]
[6071002402,"San Bernardino","Low Resource"]
[6071002501,"San Bernardino","Low Resource"]
[6071002502,"San Bernardino","Low Resource"]
[6071002706,"San Bernardino","Low Resource"]
[6071002803,"San Bernardino","Low Resource"]
[6071002901,"San Bernardino","Low Resource"]
[6071002902,"San Bernardino","Low Resource"]
[6071003000,"San Bernardino","Low Resource"]
[6071003101,"San Bernardino","Low Resource"]
[6071003200,"San Bernardino","Low Resource"]
[6071003301,"San Bernardino","Low Resource"]
[6071003302,"San Bernardino","Low Resource"]
[6071003506,"San Bernardino","Low Resource"]
[6071003507,"San Bernardino","Low Resource"]
[6071003509,"San Bernardino","Low Resource"]
[6071003607,"San Bernardino","Low Resource"]
[6071003609,"San Bernardino","Low Resource"]
[6071003612,"San Bernardino","Low Resource"]
[6071003700,"San Bernardino","Low Resource"]
[6071003801,"San Bernardino","Low Resource"]
[6071003803,"San Bernardino","Low Resource"]
[6071003804,"San Bernardino","Low Resource"]
[6071003900,"San Bernardino","Low Resource"]
[6071004001,"San Bernardino","Low Resource"]
[6071004003,"San Bernardino","Low Resource"]
[6071004004,"San Bernardino","Low Resource"]
[6071004301,"San Bernardino","Low Resource"]
[6071004401,"San Bernardino","Low Resource"]
[6071004403,"San Bernardino","Low Resource"]
[6071004510,"San Bernardino","Low Resource"]
[6071004601,"San Bernardino","Low Resource"]
[6071004603,"San Bernardino","Low Resource"]
[6071004604,"San Bernardino","Low Resource"]
[6071004700,"San Bernardino","Low Resource"]
[6071005100,"San Bernardino","Low Resource"]
[6071005200,"San Bernardino","Low Resource"]
[6071006100,"San Bernardino","Low Resource"]
[6071006201,"San Bernardino","Low Resource"]
[6071006601,"San Bernardino","Low Resource"]
[6071006603,"San Bernardino","Low Resource"]
[6071006604,"San Bernardino","Low Resource"]
[6071006700,"San Bernardino","Low Resource"]
[6071007108,"San Bernardino","Low Resource"]
[6071007403,"San Bernardino","Low Resource"]
[6071007409,"San Bernardino","Low Resource"]
[6071007410,"San Bernardino","Low Resource"]
[6071007603,"San Bernardino","Low Resource"]
[6071007604,"San Bernardino","Low Resource"]
[6071008901,"San Bernardino","Low Resource"]
[6071009110,"San Bernardino","Low Resource"]
[6071009118,"San Bernardino","Low Resource"]
[6071009300,"San Bernardino","Low Resource"]
[6071009709,"San Bernardino","Low Resource"]
[6071009710,"San Bernardino","Low Resource"]
[6071009712,"San Bernardino","Low Resource"]
[6071009713,"San Bernardino","Low Resource"]
[6071009714,"San Bernardino","Low Resource"]
[6071009906,"San Bernardino","Low Resource"]
[6071009908,"San Bernardino","Low Resource"]
[6071009910,"San Bernardino","Low Resource"]
[6071009911,"San Bernardino","Low Resource"]
[6071010009,"San Bernardino","Low Resource"]
[6071010010,"San Bernardino","Low Resource"]
[6071010011,"San Bernardino","Low Resource"]
[6071010013,"San Bernardino","Low Resource"]
[6071010015,"San Bernardino","Low Resource"]
[6071010016,"San Bernardino","Low Resource"]
[6071010019,"San Bernardino","Low Resource"]
[6071010020,"San Bernardino","Low Resource"]
[6071010025,"San Bernardino","Low Resource"]
[6071010026,"San Bernardino","Low Resource"]
[6071010300,"San Bernardino","Low Resource"]
[6071010409,"San Bernardino","Low Resource"]
[6071010411,"San Bernardino","Low Resource"]
[6071010413,"San Bernardino","Low Resource"]
[6071010421,"San Bernardino","Low Resource"]
[6071010424,"San Bernardino","Low Resource"]
[6071010700,"San Bernardino","Low Resource"]
[6071010802,"San Bernardino","Low Resource"]
[6071011401,"San Bernardino","Low Resource"]
[6071011700,"San Bernardino","Low Resource"]
[6071011800,"San Bernardino","Low Resource"]
[6071011900,"San Bernardino","Low Resource"]
[6071012001,"San Bernardino","Low Resource"]
[6071012002,"San Bernardino","Low Resource"]
[6071012103,"San Bernardino","Low Resource"]
[6071012400,"San Bernardino","Low Resource"]
[6071025100,"San Bernardino","Low Resource"]
[6073002501,"San Diego","Low Resource"]
[6073002712,"San Diego","Low Resource"]
[6073003001,"San Diego","Low Resource"]
[6073003004,"San Diego","Low Resource"]
[6073003103,"San Diego","Low Resource"]
[6073003105,"San Diego","Low Resource"]
[6073003107,"San Diego","Low Resource"]
[6073003108,"San Diego","Low Resource"]
[6073003115,"San Diego","Low Resource"]
[6073003401,"San Diego","Low Resource"]
[6073003403,"San Diego","Low Resource"]
[6073003501,"San Diego","Low Resource"]
[6073003602,"San Diego","Low Resource"]
[6073003800,"San Diego","Low Resource"]
[6073004000,"San Diego","Low Resource"]
[6073005300,"San Diego","Low Resource"]
[6073005500,"San Diego","Low Resource"]
[6073008511,"San Diego","Low Resource"]
[6073010001,"San Diego","Low Resource"]
[6073010003,"San Diego","Low Resource"]
[6073010004,"San Diego","Low Resource"]
[6073010009,"San Diego","Low Resource"]
[6073010010,"San Diego","Low Resource"]
[6073010011,"San Diego","Low Resource"]
[6073010012,"San Diego","Low Resource"]
[6073010014,"San Diego","Low Resource"]
[6073010015,"San Diego","Low Resource"]
[6073010103,"San Diego","Low Resource"]
[6073010104,"San Diego","Low Resource"]
[6073010106,"San Diego","Low Resource"]
[6073010107,"San Diego","Low Resource"]
[6073010109,"San Diego","Low Resource"]
[6073010110,"San Diego","Low Resource"]
[6073010111,"San Diego","Low Resource"]
[6073010200,"San Diego","Low Resource"]
[6073010300,"San Diego","Low Resource"]
[6073010401,"San Diego","Low Resource"]
[6073010402,"San Diego","Low Resource"]
[6073010501,"San Diego","Low Resource"]
[6073010502,"San Diego","Low Resource"]
[6073011601,"San Diego","Low Resource"]
[6073011602,"San Diego","Low Resource"]
[6073011700,"San Diego","Low Resource"]
[6073011801,"San Diego","Low Resource"]
[6073011902,"San Diego","Low Resource"]
[6073012002,"San Diego","Low Resource"]
[6073012101,"San Diego","Low Resource"]
[6073012102,"San Diego","Low Resource"]
[6073012200,"San Diego","Low Resource"]
[6073012303,"San Diego","Low Resource"]
[6073012402,"San Diego","Low Resource"]
[6073012502,"San Diego","Low Resource"]
[6073012600,"San Diego","Low Resource"]
[6073012700,"San Diego","Low Resource"]
[6073012800,"San Diego","Low Resource"]
[6073013000,"San Diego","Low Resource"]
[6073013102,"San Diego","Low Resource"]
[6073013103,"San Diego","Low Resource"]
[6073013104,"San Diego","Low Resource"]
[6073013204,"San Diego","Low Resource"]
[6073013205,"San Diego","Low Resource"]
[6073013206,"San Diego","Low Resource"]
[6073013301,"San Diego","Low Resource"]
[6073013302,"San Diego","Low Resource"]
[6073013306,"San Diego","Low Resource"]
[6073013307,"San Diego","Low Resource"]
[6073013308,"San Diego","Low Resource"]
[6073013312,"San Diego","Low Resource"]
[6073013503,"San Diego","Low Resource"]
[6073013505,"San Diego","Low Resource"]
[6073013506,"San Diego","Low Resource"]
[6073013702,"San Diego","Low Resource"]
[6073013801,"San Diego","Low Resource"]
[6073013802,"San Diego","Low Resource"]
[6073013903,"San Diego","Low Resource"]
[6073013905,"San Diego","Low Resource"]
[6073013906,"San Diego","Low Resource"]
[6073013907,"San Diego","Low Resource"]
[6073013908,"San Diego","Low Resource"]
[6073013909,"San Diego","Low Resource"]
[6073014001,"San Diego","Low Resource"]
[6073014002,"San Diego","Low Resource"]
[6073014102,"San Diego","Low Resource"]
[6073014300,"San Diego","Low Resource"]
[6073014400,"San Diego","Low Resource"]
[6073015301,"San Diego","Low Resource"]
[6073015404,"San Diego","Low Resource"]
[6073015601,"San Diego","Low Resource"]
[6073015704,"San Diego","Low Resource"]
[6073016202,"San Diego","Low Resource"]
[6073016302,"San Diego","Low Resource"]
[6073016401,"San Diego","Low Resource"]
[6073016402,"San Diego","Low Resource"]
[6073016502,"San Diego","Low Resource"]
[6073016503,"San Diego","Low Resource"]
[6073016504,"San Diego","Low Resource"]
[6073016615,"San Diego","Low Resource"]
[6073016802,"San Diego","Low Resource"]
[6073016804,"San Diego","Low Resource"]
[6073016806,"San Diego","Low Resource"]
[6073016811,"San Diego","Low Resource"]
[6073016901,"San Diego","Low Resource"]
[6073016902,"San Diego","Low Resource"]
[6073018200,"San Diego","Low Resource"]
[6073018300,"San Diego","Low Resource"]
[6073018400,"San Diego","Low Resource"]
[6073018507,"San Diego","Low Resource"]
[6073018509,"San Diego","Low Resource"]
[6073018510,"San Diego","Low Resource"]
[6073018511,"San Diego","Low Resource"]
[6073018512,"San Diego","Low Resource"]
[6073018519,"San Diego","Low Resource"]
[6073018609,"San Diego","Low Resource"]
[6073018610,"San Diego","Low Resource"]
[6073018611,"San Diego","Low Resource"]
[6073018612,"San Diego","Low Resource"]
[6073018613,"San Diego","Low Resource"]
[6073018614,"San Diego","Low Resource"]
[6073018700,"San Diego","Low Resource"]
[6073018903,"San Diego","Low Resource"]
[6073018904,"San Diego","Low Resource"]
[6073018905,"San Diego","Low Resource"]
[6073018906,"San Diego","Low Resource"]
[6073019002,"San Diego","Low Resource"]
[6073019101,"San Diego","Low Resource"]
[6073019203,"San Diego","Low Resource"]
[6073019205,"San Diego","Low Resource"]
[6073019206,"San Diego","Low Resource"]
[6073019207,"San Diego","Low Resource"]
[6073019302,"San Diego","Low Resource"]
[6073019303,"San Diego","Low Resource"]
[6073019403,"San Diego","Low Resource"]
[6073019404,"San Diego","Low Resource"]
[6073019406,"San Diego","Low Resource"]
[6073019501,"San Diego","Low Resource"]
[6073019502,"San Diego","Low Resource"]
[6073019503,"San Diego","Low Resource"]
[6073019601,"San Diego","Low Resource"]
[6073019701,"San Diego","Low Resource"]
[6073020018,"San Diego","Low Resource"]
[6073020029,"San Diego","Low Resource"]
[6073020106,"San Diego","Low Resource"]
[6073020107,"San Diego","Low Resource"]
[6073020108,"San Diego","Low Resource"]
[6073020109,"San Diego","Low Resource"]
[6073020206,"San Diego","Low Resource"]
[6073020207,"San Diego","Low Resource"]
[6073020208,"San Diego","Low Resource"]
[6073020209,"San Diego","Low Resource"]
[6073020210,"San Diego","Low Resource"]
[6073020211,"San Diego","Low Resource"]
[6073020307,"San Diego","Low Resource"]
[6073020308,"San Diego","Low Resource"]
[6073020309,"San Diego","Low Resource"]
[6073020403,"San Diego","Low Resource"]
[6073020500,"San Diego","Low Resource"]
[6073020601,"San Diego","Low Resource"]
[6073020602,"San Diego","Low Resource"]
[6073020707,"San Diego","Low Resource"]
[6073020903,"San Diego","Low Resource"]
[6073021000,"San Diego","Low Resource"]
[6073021100,"San Diego","Low Resource"]
[6073021900,"San Diego","Low Resource"]
[6073022000,"San Diego","Low Resource"]
[6075010700,"San Francisco","Low Resource"]
[6075012000,"San Francisco","Low Resource"]
[6075012201,"San Francisco","Low Resource"]
[6075012401,"San Francisco","Low Resource"]
[6075012402,"San Francisco","Low Resource"]
[6075012501,"San Francisco","Low Resource"]
[6075017601,"San Francisco","Low Resource"]
[6075017700,"San Francisco","Low Resource"]
[6075017802,"San Francisco","Low Resource"]
[6075018000,"San Francisco","Low Resource"]
[6075020100,"San Francisco","Low Resource"]
[6075023001,"San Francisco","Low Resource"]
[6075023003,"San Francisco","Low Resource"]
[6075023200,"San Francisco","Low Resource"]
[6075023300,"San Francisco","Low Resource"]
[6075023400,"San Francisco","Low Resource"]
[6075025701,"San Francisco","Low Resource"]
[6075025702,"San Francisco","Low Resource"]
[6075025800,"San Francisco","Low Resource"]
[6075026401,"San Francisco","Low Resource"]
[6075026403,"San Francisco","Low Resource"]
[6075026404,"San Francisco","Low Resource"]
[6075061000,"San Francisco","Low Resource"]
[6075061200,"San Francisco","Low Resource"]
[6077000801,"San Joaquin","Low Resource"]
[6077001101,"San Joaquin","Low Resource"]
[6077001102,"San Joaquin","Low Resource"]
[6077001300,"San Joaquin","Low Resource"]
[6077001400,"San Joaquin","Low Resource"]
[6077001500,"San Joaquin","Low Resource"]
[6077001800,"San Joaquin","Low Resource"]
[6077002100,"San Joaquin","Low Resource"]
[6077002402,"San Joaquin","Low Resource"]
[6077002504,"San Joaquin","Low Resource"]
[6077002701,"San Joaquin","Low Resource"]
[6077002702,"San Joaquin","Low Resource"]
[6077002800,"San Joaquin","Low Resource"]
[6077003305,"San Joaquin","Low Resource"]
[6077003306,"San Joaquin","Low Resource"]
[6077003311,"San Joaquin","Low Resource"]
[6077003802,"San Joaquin","Low Resource"]
[6077003803,"San Joaquin","Low Resource"]
[6077003900,"San Joaquin","Low Resource"]
[6077004001,"San Joaquin","Low Resource"]
[6077004501,"San Joaquin","Low Resource"]
[6077004600,"San Joaquin","Low Resource"]
[6077005129,"San Joaquin","Low Resource"]
[6077005130,"San Joaquin","Low Resource"]
[6077005131,"San Joaquin","Low Resource"]
[6077005501,"San Joaquin","Low Resource"]
[6079010016,"San Luis Obispo","Low Resource"]
[6079010101,"San Luis Obispo","Low Resource"]
[6079010102,"San Luis Obispo","Low Resource"]
[6079010202,"San Luis Obispo","Low Resource"]
[6079010204,"San Luis Obispo","Low Resource"]
[6079010205,"San Luis Obispo","Low Resource"]
[6079010300,"San Luis Obispo","Low Resource"]
[6079012401,"San Luis Obispo","Low Resource"]
[6079012702,"San Luis Obispo","Low Resource"]
[6081602100,"San Mateo","Low Resource"]
[6081602200,"San Mateo","Low Resource"]
[6081602300,"San Mateo","Low Resource"]
[6081604200,"San Mateo","Low Resource"]
[6081610201,"San Mateo","Low Resource"]
[6081610202,"San Mateo","Low Resource"]
[6081610203,"San Mateo","Low Resource"]
[6081610302,"San Mateo","Low Resource"]
[6081610400,"San Mateo","Low Resource"]
[6081610500,"San Mateo","Low Resource"]
[6081610601,"San Mateo","Low Resource"]
[6081610602,"San Mateo","Low Resource"]
[6081611700,"San Mateo","Low Resource"]
[6081611800,"San Mateo","Low Resource"]
[6081611900,"San Mateo","Low Resource"]
[6081612000,"San Mateo","Low Resource"]
[6081612100,"San Mateo","Low Resource"]
[6081613501,"San Mateo","Low Resource"]
[6081613800,"San Mateo","Low Resource"]
[6083000801,"Santa Barbara","Low Resource"]
[6083000804,"Santa Barbara","Low Resource"]
[6083000900,"Santa Barbara","Low Resource"]
[6083001102,"Santa Barbara","Low Resource"]
[6083001800,"Santa Barbara","Low Resource"]
[6083002011,"Santa Barbara","Low Resource"]
[6083002103,"Santa Barbara","Low Resource"]
[6083002205,"Santa Barbara","Low Resource"]
[6083002206,"Santa Barbara","Low Resource"]
[6083002209,"Santa Barbara","Low Resource"]
[6083002210,"Santa Barbara","Low Resource"]
[6083002211,"Santa Barbara","Low Resource"]
[6083002303,"Santa Barbara","Low Resource"]
[6083002304,"Santa Barbara","Low Resource"]
[6083002305,"Santa Barbara","Low Resource"]
[6083002306,"Santa Barbara","Low Resource"]
[6083002402,"Santa Barbara","Low Resource"]
[6083002502,"Santa Barbara","Low Resource"]
[6083002606,"Santa Barbara","Low Resource"]
[6083002703,"Santa Barbara","Low Resource"]
[6083002706,"Santa Barbara","Low Resource"]
[6083002707,"Santa Barbara","Low Resource"]
[6083002802,"Santa Barbara","Low Resource"]
[6083002806,"Santa Barbara","Low Resource"]
[6083003102,"Santa Barbara","Low Resource"]
[6085500100,"Santa Clara","Low Resource"]
[6085500200,"Santa Clara","Low Resource"]
[6085500800,"Santa Clara","Low Resource"]
[6085500901,"Santa Clara","Low Resource"]
[6085500902,"Santa Clara","Low Resource"]
[6085501000,"Santa Clara","Low Resource"]
[6085501101,"Santa Clara","Low Resource"]
[6085501102,"Santa Clara","Low Resource"]
[6085501200,"Santa Clara","Low Resource"]
[6085501300,"Santa Clara","Low Resource"]
[6085501401,"Santa Clara","Low Resource"]
[6085501402,"Santa Clara","Low Resource"]
[6085501501,"Santa Clara","Low Resource"]
[6085501502,"Santa Clara","Low Resource"]
[6085501600,"Santa Clara","Low Resource"]
[6085501700,"Santa Clara","Low Resource"]
[6085502002,"Santa Clara","Low Resource"]
[6085503110,"Santa Clara","Low Resource"]
[6085503111,"Santa Clara","Low Resource"]
[6085503112,"Santa Clara","Low Resource"]
[6085503113,"Santa Clara","Low Resource"]
[6085503115,"Santa Clara","Low Resource"]
[6085503117,"Santa Clara","Low Resource"]
[6085503118,"Santa Clara","Low Resource"]
[6085503121,"Santa Clara","Low Resource"]
[6085503122,"Santa Clara","Low Resource"]
[6085503123,"Santa Clara","Low Resource"]
[6085503204,"Santa Clara","Low Resource"]
[6085503207,"Santa Clara","Low Resource"]
[6085503208,"Santa Clara","Low Resource"]
[6085503210,"Santa Clara","Low Resource"]
[6085503211,"Santa Clara","Low Resource"]
[6085503212,"Santa Clara","Low Resource"]
[6085503213,"Santa Clara","Low Resource"]
[6085503214,"Santa Clara","Low Resource"]
[6085503217,"Santa Clara","Low Resource"]
[6085503218,"Santa Clara","Low Resource"]
[6085503304,"Santa Clara","Low Resource"]
[6085503305,"Santa Clara","Low Resource"]
[6085503306,"Santa Clara","Low Resource"]
[6085503315,"Santa Clara","Low Resource"]
[6085503322,"Santa Clara","Low Resource"]
[6085503336,"Santa Clara","Low Resource"]
[6085503337,"Santa Clara","Low Resource"]
[6085503401,"Santa Clara","Low Resource"]
[6085503402,"Santa Clara","Low Resource"]
[6085503504,"Santa Clara","Low Resource"]
[6085503506,"Santa Clara","Low Resource"]
[6085503507,"Santa Clara","Low Resource"]
[6085503508,"Santa Clara","Low Resource"]
[6085503509,"Santa Clara","Low Resource"]
[6085503510,"Santa Clara","Low Resource"]
[6085503511,"Santa Clara","Low Resource"]
[6085503601,"Santa Clara","Low Resource"]
[6085503602,"Santa Clara","Low Resource"]
[6085503703,"Santa Clara","Low Resource"]
[6085503707,"Santa Clara","Low Resource"]
[6085503708,"Santa Clara","Low Resource"]
[6085503709,"Santa Clara","Low Resource"]
[6085503710,"Santa Clara","Low Resource"]
[6085503711,"Santa Clara","Low Resource"]
[6085503712,"Santa Clara","Low Resource"]
[6085503713,"Santa Clara","Low Resource"]
[6085503802,"Santa Clara","Low Resource"]
[6085503803,"Santa Clara","Low Resource"]
[6085503804,"Santa Clara","Low Resource"]
[6085503902,"Santa Clara","Low Resource"]
[6085503903,"Santa Clara","Low Resource"]
[6085504001,"Santa Clara","Low Resource"]
[6085504002,"Santa Clara","Low Resource"]
[6085504101,"Santa Clara","Low Resource"]
[6085504102,"Santa Clara","Low Resource"]
[6085504318,"Santa Clara","Low Resource"]
[6085504319,"Santa Clara","Low Resource"]
[6085504601,"Santa Clara","Low Resource"]
[6085504602,"Santa Clara","Low Resource"]
[6085505007,"Santa Clara","Low Resource"]
[6085505100,"Santa Clara","Low Resource"]
[6085505202,"Santa Clara","Low Resource"]
[6085512017,"Santa Clara","Low Resource"]
[6085512022,"Santa Clara","Low Resource"]
[6085512023,"Santa Clara","Low Resource"]
[6085512042,"Santa Clara","Low Resource"]
[6085512043,"Santa Clara","Low Resource"]
[6085512307,"Santa Clara","Low Resource"]
[6085512310,"Santa Clara","Low Resource"]
[6085512314,"Santa Clara","Low Resource"]
[6085512401,"Santa Clara","Low Resource"]
[6085512402,"Santa Clara","Low Resource"]
[6085512508,"Santa Clara","Low Resource"]
[6085512509,"Santa Clara","Low Resource"]
[6085512602,"Santa Clara","Low Resource"]
[6085512603,"Santa Clara","Low Resource"]
[6085512604,"Santa Clara","Low Resource"]
[6087110100,"Santa Cruz","Low Resource"]
[6087110200,"Santa Cruz","Low Resource"]
[6087110300,"Santa Cruz","Low Resource"]
[6087110400,"Santa Cruz","Low Resource"]
[6087110501,"Santa Cruz","Low Resource"]
[6087110502,"Santa Cruz","Low Resource"]
[6087110600,"Santa Cruz","Low Resource"]
[6087110700,"Santa Cruz","Low Resource"]
[6087120200,"Santa Cruz","Low Resource"]
[6087120302,"Santa Cruz","Low Resource"]
[6087122300,"Santa Cruz","Low Resource"]
[6087122400,"Santa Cruz","Low Resource"]
[6087122500,"Santa Cruz","Low Resource"]
[6087123100,"Santa Cruz","Low Resource"]
[6087123300,"Santa Cruz","Low Resource"]
[6089011002,"Shasta","Low Resource"]
[6089011209,"Shasta","Low Resource"]
[6089011803,"Shasta","Low Resource"]
[6089012000,"Shasta","Low Resource"]
[6089012101,"Shasta","Low Resource"]
[6089012102,"Shasta","Low Resource"]
[6089012200,"Shasta","Low Resource"]
[6089012301,"Shasta","Low Resource"]
[6089012302,"Shasta","Low Resource"]
[6089012500,"Shasta","Low Resource"]
[6089012603,"Shasta","Low Resource"]
[6089012701,"Shasta","Low Resource"]
[6089012702,"Shasta","Low Resource"]
[6093000200,"Siskiyou","Low Resource"]
[6093000400,"Siskiyou","Low Resource"]
[6093000500,"Siskiyou","Low Resource"]
[6093000702,"Siskiyou","Low Resource"]
[6095250103,"Solano","Low Resource"]
[6095250104,"Solano","Low Resource"]
[6095250200,"Solano","Low Resource"]
[6095250300,"Solano","Low Resource"]
[6095250400,"Solano","Low Resource"]
[6095250501,"Solano","Low Resource"]
[6095250502,"Solano","Low Resource"]
[6095250601,"Solano","Low Resource"]
[6095250604,"Solano","Low Resource"]
[6095250605,"Solano","Low Resource"]
[6095250701,"Solano","Low Resource"]
[6095250801,"Solano","Low Resource"]
[6095251000,"Solano","Low Resource"]
[6095251200,"Solano","Low Resource"]
[6095251300,"Solano","Low Resource"]
[6095251400,"Solano","Low Resource"]
[6095251500,"Solano","Low Resource"]
[6095251701,"Solano","Low Resource"]
[6095251702,"Solano","Low Resource"]
[6095251803,"Solano","Low Resource"]
[6095251804,"Solano","Low Resource"]
[6095251901,"Solano","Low Resource"]
[6095251902,"Solano","Low Resource"]
[6095251903,"Solano","Low Resource"]
[6095252103,"Solano","Low Resource"]
[6095252305,"Solano","Low Resource"]
[6095252312,"Solano","Low Resource"]
[6095252313,"Solano","Low Resource"]
[6095252314,"Solano","Low Resource"]
[6095252315,"Solano","Low Resource"]
[6095252316,"Solano","Low Resource"]
[6095252317,"Solano","Low Resource"]
[6095252401,"Solano","Low Resource"]
[6095252402,"Solano","Low Resource"]
[6095252501,"Solano","Low Resource"]
[6095252502,"Solano","Low Resource"]
[6095252604,"Solano","Low Resource"]
[6095252606,"Solano","Low Resource"]
[6095252607,"Solano","Low Resource"]
[6095252608,"Solano","Low Resource"]
[6095252610,"Solano","Low Resource"]
[6095252611,"Solano","Low Resource"]
[6095252702,"Solano","Low Resource"]
[6095252703,"Solano","Low Resource"]
[6095252704,"Solano","Low Resource"]
[6095252705,"Solano","Low Resource"]
[6095252706,"Solano","Low Resource"]
[6095252707,"Solano","Low Resource"]
[6095252904,"Solano","Low Resource"]
[6095252908,"Solano","Low Resource"]
[6095253101,"Solano","Low Resource"]
[6095253105,"Solano","Low Resource"]
[6095253107,"Solano","Low Resource"]
[6095253108,"Solano","Low Resource"]
[6095253205,"Solano","Low Resource"]
[6095253300,"Solano","Low Resource"]
[6095253402,"Solano","Low Resource"]
[6097150203,"Sonoma","Low Resource"]
[6097150303,"Sonoma","Low Resource"]
[6097150304,"Sonoma","Low Resource"]
[6097150305,"Sonoma","Low Resource"]
[6097150306,"Sonoma","Low Resource"]
[6097150601,"Sonoma","Low Resource"]
[6097150602,"Sonoma","Low Resource"]
[6097150603,"Sonoma","Low Resource"]
[6097150611,"Sonoma","Low Resource"]
[6097150612,"Sonoma","Low Resource"]
[6097151201,"Sonoma","Low Resource"]
[6097151301,"Sonoma","Low Resource"]
[6097151305,"Sonoma","Low Resource"]
[6097151401,"Sonoma","Low Resource"]
[6097151402,"Sonoma","Low Resource"]
[6097151900,"Sonoma","Low Resource"]
[6097152000,"Sonoma","Low Resource"]
[6097152100,"Sonoma","Low Resource"]
[6097152201,"Sonoma","Low Resource"]
[6097152702,"Sonoma","Low Resource"]
[6097152802,"Sonoma","Low Resource"]
[6097152903,"Sonoma","Low Resource"]
[6097152904,"Sonoma","Low Resource"]
[6097153001,"Sonoma","Low Resource"]
[6097153002,"Sonoma","Low Resource"]
[6097153003,"Sonoma","Low Resource"]
[6097153005,"Sonoma","Low Resource"]
[6097153006,"Sonoma","Low Resource"]
[6097153102,"Sonoma","Low Resource"]
[6097153103,"Sonoma","Low Resource"]
[6097153104,"Sonoma","Low Resource"]
[6097153200,"Sonoma","Low Resource"]
[6097153300,"Sonoma","Low Resource"]
[6097153703,"Sonoma","Low Resource"]
[6097153801,"Sonoma","Low Resource"]
[6097153808,"Sonoma","Low Resource"]
[6097153902,"Sonoma","Low Resource"]
[6097154201,"Sonoma","Low Resource"]
[6097154202,"Sonoma","Low Resource"]
[6099000301,"Stanislaus","Low Resource"]
[6099000304,"Stanislaus","Low Resource"]
[6099000510,"Stanislaus","Low Resource"]
[6099001400,"Stanislaus","Low Resource"]
[6099001500,"Stanislaus","Low Resource"]
[6099002002,"Stanislaus","Low Resource"]
[6099002301,"Stanislaus","Low Resource"]
[6099002401,"Stanislaus","Low Resource"]
[6099002501,"Stanislaus","Low Resource"]
[6099002503,"Stanislaus","Low Resource"]
[6099002504,"Stanislaus","Low Resource"]
[6099002702,"Stanislaus","Low Resource"]
[6099002802,"Stanislaus","Low Resource"]
[6099003100,"Stanislaus","Low Resource"]
[6099003201,"Stanislaus","Low Resource"]
[6099003300,"Stanislaus","Low Resource"]
[6099003400,"Stanislaus","Low Resource"]
[6099003700,"Stanislaus","Low Resource"]
[6099003804,"Stanislaus","Low Resource"]
[6101050101,"Sutter","Low Resource"]
[6101050102,"Sutter","Low Resource"]
[6101050302,"Sutter","Low Resource"]
[6101050501,"Sutter","Low Resource"]
[6101050900,"Sutter","Low Resource"]
[6103000300,"Tehama","Low Resource"]
[6103000700,"Tehama","Low Resource"]
[6103001000,"Tehama","Low Resource"]
[6105000200,"Trinity","Low Resource"]
[6105000400,"Trinity","Low Resource"]
[6107001200,"Tulare","Low Resource"]
[6107001301,"Tulare","Low Resource"]
[6107002203,"Tulare","Low Resource"]
[6107002304,"Tulare","Low Resource"]
[6107002904,"Tulare","Low Resource"]
[6107003100,"Tulare","Low Resource"]
[6107003700,"Tulare","Low Resource"]
[6107003801,"Tulare","Low Resource"]
[6107003802,"Tulare","Low Resource"]
[6107003901,"Tulare","Low Resource"]
[6107003902,"Tulare","Low Resource"]
[6107004102,"Tulare","Low Resource"]
[6107004500,"Tulare","Low Resource"]
[6109005100,"Tuolumne","Low Resource"]
[6109005201,"Tuolumne","Low Resource"]
[6111000200,"Ventura","Low Resource"]
[6111000302,"Ventura","Low Resource"]
[6111000303,"Ventura","Low Resource"]
[6111000304,"Ventura","Low Resource"]
[6111000701,"Ventura","Low Resource"]
[6111002200,"Ventura","Low Resource"]
[6111002300,"Ventura","Low Resource"]
[6111002400,"Ventura","Low Resource"]
[6111002905,"Ventura","Low Resource"]
[6111003010,"Ventura","Low Resource"]
[6111003011,"Ventura","Low Resource"]
[6111003100,"Ventura","Low Resource"]
[6111003300,"Ventura","Low Resource"]
[6111003700,"Ventura","Low Resource"]
[6111003801,"Ventura","Low Resource"]
[6111003802,"Ventura","Low Resource"]
[6111003900,"Ventura","Low Resource"]
[6111004000,"Ventura","Low Resource"]
[6111004101,"Ventura","Low Resource"]
[6111004200,"Ventura","Low Resource"]
[6111004304,"Ventura","Low Resource"]
[6111004305,"Ventura","Low Resource"]
[6111004400,"Ventura","Low Resource"]
[6111004503,"Ventura","Low Resource"]
[6111004504,"Ventura","Low Resource"]
[6111004505,"Ventura","Low Resource"]
[6111004600,"Ventura","Low Resource"]
[6111004704,"Ventura","Low Resource"]
[6111004710,"Ventura","Low Resource"]
[6111004711,"Ventura","Low Resource"]
[6111004715,"Ventura","Low Resource"]
[6111004716,"Ventura","Low Resource"]
[6111004717,"Ventura","Low Resource"]
[6111005003,"Ventura","Low Resource"]
[6111005004,"Ventura","Low Resource"]
[6111007512,"Ventura","Low Resource"]
[6111008600,"Ventura","Low Resource"]
[6111008700,"Ventura","Low Resource"]
[6111008800,"Ventura","Low Resource"]
[6111008900,"Ventura","Low Resource"]
[6111009100,"Ventura","Low Resource"]
[6113010101,"Yolo","Low Resource"]
[6113010102,"Yolo","Low Resource"]
[6113010201,"Yolo","Low Resource"]
[6113010204,"Yolo","Low Resource"]
[6113010800,"Yolo","Low Resource"]
[6113010902,"Yolo","Low Resource"]
[6113011102,"Yolo","Low Resource"]
[6113011400,"Yolo","Low Resource"]
[6115040100,"Yuba","Low Resource"]
[6115040500,"Yuba","Low Resource"]
[6115040600,"Yuba","Low Resource"]

{"sheet":"Dropdowns","index":17,"n_rows":78,"n_cols":3,"rows_kept":78,"cut":false,"hidden":true,"merged":[]}
["Individual","For-profit","Alameda"]
["Joint Venture","Nonprofit","Alpine"]
["Partnership",null,"Amador"]
["Limited Partnership",null,"Butte"]
["Trust",null,"Calaveras"]
["Corporation",null,"Colusa"]
["Limited Liability Corporation",null,"Contra Costa"]
["Local Public Entity",null,"Del Norte"]
["Other legal entity",null,"El Dorado"]
[null,null,"Fresno"]
[null,null,"Glenn"]
[null,null,"Humboldt"]
[null,null,"Imperial"]
[null,null,"Inyo"]
[null,null,"Kern"]
[null,null,"Kings"]
[null,null,"Lake"]
[null,null,"Lassen"]
[null,null,"Los Angeles"]
[null,null,"Madera"]
[null,null,"Marin"]
[null,null,"Mariposa"]
[null,null,"Mendocino"]
[null,null,"Merced"]
[null,null,"Modoc"]
[null,null,"Mono"]
[null,null,"Monterey"]
[null,null,"Napa"]
[null,null,"Nevada"]
[null,null,"Orange"]
[null,null,"Placer"]
[null,null,"Plumas"]
[null,null,"Riverside"]
[null,null,"Sacramento"]
[null,null,"San Benito"]
[null,null,"San Bernardino"]
[null,null,"San Diego"]
[null,null,"San Francisco"]
[null,null,"San Joaquin"]
[null,null,"San Luis Obispo"]
[null,null,"San Mateo"]
[null,null,"Santa Barbara"]
[null,null,"Santa Clara"]
[null,null,"Santa Cruz"]
[null,null,"Shasta"]
[null,null,"Sierra"]
[null,null,"Siskiyou"]
[null,null,"Solano"]
[null,null,"Sonoma"]
[null,null,"Stanislaus"]
[null,null,"Sutter"]
[null,null,"Tehama"]
[null,null,"Trinity"]
[null,null,"Tulare"]
[null,null,"Tuolumne"]
[null,null,"Ventura"]
[null,null,"Yolo"]
[null,null,"Yuba"]
[]
[]
[]
[]
[]
["<=1 Point for Full 5% point increments above 100%",null,{"$f":"'E - Project Selection'!AW76","v":0}]
["<=1 Point for Full 5% point increments above 50%",null,{"$f":"IF(AND(OR('B - Project Requirements'!#REF!=\"Not Applicable\",'B - Project Requirements'!#REF!=\"High Segregation & Poverty\", 'B - Project Requirements'!#REF!=\"Low Resource\"), 'D - Max Loan & Unit Mix'!#REF!=0,'D - Max Loan & Unit Mix'!#REF!=\"No 9% Tax Credits\"),#REF!,0)","v":{"$error":"#REF!"}}]
["<=2 Points for Full 5% point increments above 100%",null,{"$f":"IF(AND(OR('B - Project Requirements'!#REF!=\"High Resource\",'B - Project Requirements'!#REF!=\"Highest Resource\"), 'D - Max Loan & Unit Mix'!#REF!=\"No 9% Tax Credits\"),#REF!,0)","v":{"$error":"#REF!"}}]
["<=1 Point for Full 5% point increments above 50% X (% of Restricted SH Units X 2 + % of Restricted Non SH Units)",null,{"$f":"IF(AND(OR('B - Project Requirements'!#REF!=\"Not Applicable\",'B - Project Requirements'!#REF!=\"High Segregation & Poverty\", 'B - Project Requirements'!#REF!=\"Low Resource\"),'D - Max Loan & Unit Mix'!#REF!>0,'D - Max Loan & Unit Mix'!#REF!=\"No 9% Tax Credits\"),'E - Project Selection'!#REF!,0)","v":{"$error":"#REF!"}}]
[]
[]
["Leadership in Energy & Environmental Design (LEED) "]
["GreenPoint Program"]
["Passive House Institute US (PHIUS)"]
["Passive House"]
["Living Building Challenge"]
["National Green Building Standard ICC / ASRAE – 700 silver or higher rating"]
["2011 Enterprise Green Communities"]
["WELL (when not combined with the programs listed)"]
["N/A"]

{"sheet":"Loan Limits","index":18,"n_rows":583,"n_cols":11,"rows_kept":583,"cut":false,"hidden":true,"merged":[[1,6,1,10],[1,1,1,5]]}
[1,2,3,4,5,6,7,8,9,10,11]
[null,"Oher restricted. ",null,null,null,null,"Supportive Housing Units and Restricted Units in a Large Family new construction project located in a “High Resource” or “Highest Resource” area on the TCAC/HCD Opportunity Map"]
["County","Efficiency","1 BR","2 BR","3 BR","4+ BR","Efficiency","1 BR","2 BR","3 BR","4+ BR"]
["ALAMEDA60%",150000,150000,150000,150000,150000,175000,175000,175000,175000,175000]
["ALAMEDA55%",165701,166854,170167,173192,175929,190701,191854,195167,198192,200929]
["ALAMEDA50%",181258,183563,190189,196383,201857,206258,208563,215189,221383,226857]
["ALAMEDA45%",196959,200273,210356,219575,227786,221959,225273,235356,244575,252786]
["ALAMEDA40%",212517,216982,230378,242766,253570,237517,241982,255378,267766,278570]
["ALAMEDA35%",228218,233836,250545,266102,279499,253218,258836,275545,291102,304499]
["ALAMEDA30%",243775,250545,270568,289294,305427,268775,275545,295568,314294,330427]
["ALAMEDA25%",259476,267255,290734,312485,331356,284476,292255,315734,337485,356356]
["ALAMEDA20%",275033,283964,310757,335677,357140,300033,308964,335757,360677,382140]
["ALAMEDA15%",290734,300818,330923,358869,383069,315734,325818,355923,383869,408069]
["ALPINE60%",150000,150000,150000,150000,150000,175000,175000,175000,175000,175000]
["ALPINE55%",160083,160804,162964,164981,166854,185083,185804,187964,189981,191854]
["ALPINE50%",170167,171607,175929,180106,183563,195167,196607,200929,205106,208563]
["ALPINE45%",180250,182411,188893,195087,200273,205250,207411,213893,220087,225273]
["ALPINE40%",190333,193214,201857,210068,216982,215333,218214,226857,235068,241982]
["ALPINE35%",200561,204162,214965,225049,233836,225561,229162,239965,250049,258836]
["ALPINE30%",210644,214965,227930,240030,250545,235644,239965,252930,265030,275545]
["ALPINE25%",220727,225769,240894,255155,267255,245727,250769,265894,280155,292255]
["ALPINE20%",230811,236572,253858,270135,283964,255811,261572,278858,295135,308964]
["ALPINE15%",240894,247376,266822,285116,300818,265894,272376,291822,310116,325818]
["AMADOR60%",150000,150000,150000,150000,150000,175000,175000,175000,175000,175000]
["AMADOR55%",159219,159939,161812,163684,165269,184219,184939,186812,188684,190269]
["AMADOR50%",168438,169734,173624,177369,180538,193438,194734,198624,202369,205538]
["AMADOR45%",177657,179674,185436,191053,195807,202657,204674,210436,216053,220807]
["AMADOR40%",186732,189469,197248,204738,210932,211732,214469,222248,229738,235932]
["AMADOR35%",195951,199264,209203,218422,226201,220951,224264,234203,243422,251201]
["AMADOR30%",205170,209203,221015,232107,241470,230170,234203,246015,257107,266470]
["AMADOR25%",214389,218999,232827,245791,256739,239389,243999,257827,270791,281739]
["AMADOR20%",223608,228938,244639,259476,272008,248608,253938,269639,284476,297008]
["AMADOR15%",232827,238733,256451,273160,287277,257827,263733,281451,298160,312277]
["BUTTE60%",150000,150000,150000,150000,150000,175000,175000,175000,175000,175000]
["BUTTE55%",158499,158931,160804,162532,163973,183499,183931,185804,187532,188973]
["BUTTE50%",166854,168006,171607,174920,177801,191854,193006,196607,199920,202801]
["BUTTE45%",175208,176937,182411,187452,191774,200208,201937,207411,212452,216774]
["BUTTE40%",183563,185868,193070,199840,205602,208563,210868,218070,224840,230602]
["BUTTE35%",192062,194943,203874,212372,219575,217062,219943,228874,237372,244575]
["BUTTE30%",200417,203874,214677,224761,233403,225417,228874,239677,249761,258403]
["BUTTE25%",208771,212949,225481,237293,247376,233771,237949,250481,262293,272376]
["BUTTE20%",217126,221880,236284,249681,261205,242126,246880,261284,274681,286205]
["BUTTE15%",225625,230811,247088,262213,275177,250625,255811,272088,287213,300177]
["CALAVERAS60%",150000,150000,150000,150000,150000,175000,175000,175000,175000,175000]
["CALAVERAS55%",159507,160227,162244,164117,165845,184507,185227,187244,189117,190845]
["CALAVERAS50%",169014,170455,174488,178233,181546,194014,195455,199488,203233,206546]
["CALAVERAS45%",178521,180538,186732,192350,197248,203521,205538,211732,217350,222248]
["CALAVERAS40%",188028,190765,198832,206467,212949,213028,215765,223832,231467,237949]
["CALAVERAS35%",197536,200993,211076,220583,228794,222536,225993,236076,245583,253794]
["CALAVERAS30%",207043,211076,223320,234700,244495,232043,236076,248320,259700,269495]
["CALAVERAS25%",216550,221303,235564,248816,260196,241550,246303,260564,273816,285196]
["CALAVERAS20%",226057,231531,247664,262933,275897,251057,256531,272664,287933,300897]
["CALAVERAS15%",235564,241614,259908,277050,291743,260564,266614,284908,302050,316743]
["COLUSA60%",150000,150000,150000,150000,150000,175000,175000,175000,175000,175000]
["COLUSA55%",158211,158787,160515,162244,163540,183211,183787,185515,187244,188540]
["COLUSA50%",166421,167430,171031,174344,177081,191421,192430,196031,199344,202081]
["COLUSA45%",174632,176217,181546,186444,190621,199632,201217,206546,211444,215621]
["COLUSA40%",182699,185003,192062,198544,204162,207699,210003,217062,223544,229162]
["COLUSA35%",190909,193790,202577,210788,217702,215909,218790,227577,235788,242702]
["COLUSA30%",199120,202577,213093,222888,231243,224120,227577,238093,247888,256243]
["COLUSA25%",207331,211220,223608,234988,244783,232331,236220,248608,259988,269783]
["COLUSA20%",215397,220007,234124,247088,258324,240397,245007,259124,272088,283324]
["COLUSA15%",223608,228794,244639,259332,271864,248608,253794,269639,284332,296864]
["CONTRA COSTA60%",150000,150000,150000,150000,150000,175000,175000,175000,175000,175000]
["CONTRA COSTA55%",165701,166854,170167,173192,175929,190701,191854,195167,198192,200929]
["CONTRA COSTA50%",181258,183563,190189,196383,201857,206258,208563,215189,221383,226857]
["CONTRA COSTA45%",196959,200273,210356,219575,227786,221959,225273,235356,244575,252786]
["CONTRA COSTA40%",212517,216982,230378,242766,253570,237517,241982,255378,267766,278570]
["CONTRA COSTA35%",228218,233836,250545,266102,279499,253218,258836,275545,291102,304499]
["CONTRA COSTA30%",243775,250545,270568,289294,305427,268775,275545,295568,314294,330427]
["CONTRA COSTA25%",259476,267255,290734,312485,331356,284476,292255,315734,337485,356356]
["CONTRA COSTA20%",275033,283964,310757,335677,357140,300033,308964,335757,360677,382140]
["CONTRA COSTA15%",290734,300818,330923,358869,383069,315734,325818,355923,383869,408069]
["DEL NORTE60%",150000,150000,150000,150000,150000,175000,175000,175000,175000,175000]
["DEL NORTE55%",158211,158787,160515,162244,163540,183211,183787,185515,187244,188540]
["DEL NORTE50%",166421,167430,171031,174344,177081,191421,192430,196031,199344,202081]
["DEL NORTE45%",174632,176217,181546,186444,190621,199632,201217,206546,211444,215621]
["DEL NORTE40%",182699,185003,192062,198544,204162,207699,210003,217062,223544,229162]
["DEL NORTE35%",190909,193790,202577,210788,217702,215909,218790,227577,235788,242702]
["DEL NORTE30%",199120,202577,213093,222888,231243,224120,227577,238093,247888,256243]
["DEL NORTE25%",207331,211220,223608,234988,244783,232331,236220,248608,259988,269783]
["DEL NORTE20%",215397,220007,234124,247088,258324,240397,245007,259124,272088,283324]
["DEL NORTE15%",223608,228794,244639,259332,271864,248608,253794,269639,284332,296864]
["EL DORADO60%",150000,150000,150000,150000,150000,175000,175000,175000,175000,175000]
["EL DORADO55%",160660,161380,163540,165701,167574,185660,186380,188540,190701,192574]
["EL DORADO50%",171175,172615,177081,181402,185003,196175,197615,202081,206402,210003]
["EL DORADO45%",181690,183995,190621,196959,202433,206690,208995,215621,221959,227433]
["EL DORADO40%",192206,195231,204162,212661,219863,217206,220231,229162,237661,244863]
["EL DORADO35%",202865,206467,217846,228362,237437,227865,231467,242846,253362,262437]
["EL DORADO30%",213381,217846,231387,243919,254866,238381,242846,256387,268919,279866]
["EL DORADO25%",223896,229082,244927,259620,272296,248896,254082,269927,284620,297296]
["EL DORADO20%",234412,240462,258468,275321,289726,259412,265462,283468,300321,314726]
["EL DORADO15%",245071,251697,272008,290878,307300,270071,276697,297008,315878,332300]
["FRESNO60%",150000,150000,150000,150000,150000,175000,175000,175000,175000,175000]
["FRESNO55%",158211,158787,160515,162244,163540,183211,183787,185515,187244,188540]
["FRESNO50%",166421,167430,171031,174344,177081,191421,192430,196031,199344,202081]
["FRESNO45%",174632,176217,181546,186444,190621,199632,201217,206546,211444,215621]
["FRESNO40%",182699,185003,192062,198544,204162,207699,210003,217062,223544,229162]
["FRESNO35%",190909,193790,202577,210788,217702,215909,218790,227577,235788,242702]
["FRESNO30%",199120,202577,213093,222888,231243,224120,227577,238093,247888,256243]
["FRESNO25%",207331,211220,223608,234988,244783,232331,236220,248608,259988,269783]
["FRESNO20%",215397,220007,234124,247088,258324,240397,245007,259124,272088,283324]
["FRESNO15%",223608,228794,244639,259332,271864,248608,253794,269639,284332,296864]
["GLENN60%",150000,150000,150000,150000,150000,175000,175000,175000,175000,175000]
["GLENN55%",158211,158787,160515,162244,163540,183211,183787,185515,187244,188540]
["GLENN50%",166421,167430,171031,174344,177081,191421,192430,196031,199344,202081]
["GLENN45%",174632,176217,181546,186444,190621,199632,201217,206546,211444,215621]
["GLENN40%",182699,185003,192062,198544,204162,207699,210003,217062,223544,229162]
["GLENN35%",190909,193790,202577,210788,217702,215909,218790,227577,235788,242702]
["GLENN30%",199120,202577,213093,222888,231243,224120,227577,238093,247888,256243]
["GLENN25%",207331,211220,223608,234988,244783,232331,236220,248608,259988,269783]
["GLENN20%",215397,220007,234124,247088,258324,240397,245007,259124,272088,283324]
["GLENN15%",223608,228794,244639,259332,271864,248608,253794,269639,284332,296864]
["HUMBOLDT60%",150000,150000,150000,150000,150000,175000,175000,175000,175000,175000]
["HUMBOLDT55%",158211,158787,160515,162244,163540,183211,183787,185515,187244,188540]
["HUMBOLDT50%",166421,167430,171031,174344,177081,191421,192430,196031,199344,202081]
["HUMBOLDT45%",174632,176217,181546,186444,190621,199632,201217,206546,211444,215621]
["HUMBOLDT40%",182699,185003,192062,198544,204162,207699,210003,217062,223544,229162]
["HUMBOLDT35%",190909,193790,202577,210788,217702,215909,218790,227577,235788,242702]
["HUMBOLDT30%",199120,202577,213093,222888,231243,224120,227577,238093,247888,256243]
["HUMBOLDT25%",207331,211220,223608,234988,244783,232331,236220,248608,259988,269783]
["HUMBOLDT20%",215397,220007,234124,247088,258324,240397,245007,259124,272088,283324]
["HUMBOLDT15%",223608,228794,244639,259332,271864,248608,253794,269639,284332,296864]
["IMPERIAL60%",150000,150000,150000,150000,150000,175000,175000,175000,175000,175000]
["IMPERIAL55%",158211,158787,160515,162244,163540,183211,183787,185515,187244,188540]
["IMPERIAL50%",166421,167430,171031,174344,177081,191421,192430,196031,199344,202081]
["IMPERIAL45%",174632,176217,181546,186444,190621,199632,201217,206546,211444,215621]
["IMPERIAL40%",182699,185003,192062,198544,204162,207699,210003,217062,223544,229162]
["IMPERIAL35%",190909,193790,202577,210788,217702,215909,218790,227577,235788,242702]
["IMPERIAL30%",199120,202577,213093,222888,231243,224120,227577,238093,247888,256243]
["IMPERIAL25%",207331,211220,223608,234988,244783,232331,236220,248608,259988,269783]
["IMPERIAL20%",215397,220007,234124,247088,258324,240397,245007,259124,272088,283324]
["IMPERIAL15%",223608,228794,244639,259332,271864,248608,253794,269639,284332,296864]
["INYO60%",150000,150000,150000,150000,150000,175000,175000,175000,175000,175000]
["INYO55%",159219,159795,161812,163540,165269,184219,184795,186812,188540,190269]
["INYO50%",168294,169734,173624,177225,180394,193294,194734,198624,202225,205394]
["INYO45%",177513,179530,185436,190765,195663,202513,204530,210436,215765,220663]
["INYO40%",186588,189325,197103,204450,210788,211588,214325,222103,229450,235788]
["INYO35%",195807,199120,208915,218134,226057,220807,224120,233915,243134,251057]
["INYO30%",205026,208915,220727,231675,241182,230026,233915,245727,256675,266182]
["INYO25%",214101,218855,232539,245359,256451,239101,243855,257539,270359,281451]
["INYO20%",223320,228650,244351,258900,271576,248320,253650,269351,283900,296576]
["INYO15%",232539,238445,256163,272584,286845,257539,263445,281163,297584,311845]
["KERN60%",150000,150000,150000,150000,150000,175000,175000,175000,175000,175000]
["KERN55%",158211,158787,160515,162244,163540,183211,183787,185515,187244,188540]
["KERN50%",166421,167430,171031,174344,177081,191421,192430,196031,199344,202081]
["KERN45%",174632,176217,181546,186444,190621,199632,201217,206546,211444,215621]
["KERN40%",182699,185003,192062,198544,204162,207699,210003,217062,223544,229162]
["KERN35%",190909,193790,202577,210788,217702,215909,218790,227577,235788,242702]
["KERN30%",199120,202577,213093,222888,231243,224120,227577,238093,247888,256243]
["KERN25%",207331,211220,223608,234988,244783,232331,236220,248608,259988,269783]
["KERN20%",215397,220007,234124,247088,258324,240397,245007,259124,272088,283324]
["KERN15%",223608,228794,244639,259332,271864,248608,253794,269639,284332,296864]
["KINGS60%",150000,150000,150000,150000,150000,175000,175000,175000,175000,175000]
["KINGS55%",158211,158787,160515,162244,163540,183211,183787,185515,187244,188540]
["KINGS50%",166421,167430,171031,174344,177081,191421,192430,196031,199344,202081]
["KINGS45%",174632,176217,181546,186444,190621,199632,201217,206546,211444,215621]
["KINGS40%",182699,185003,192062,198544,204162,207699,210003,217062,223544,229162]
["KINGS35%",190909,193790,202577,210788,217702,215909,218790,227577,235788,242702]
["KINGS30%",199120,202577,213093,222888,231243,224120,227577,238093,247888,256243]
["KINGS25%",207331,211220,223608,234988,244783,232331,236220,248608,259988,269783]
["KINGS20%",215397,220007,234124,247088,258324,240397,245007,259124,272088,283324]
["KINGS15%",223608,228794,244639,259332,271864,248608,253794,269639,284332,296864]
["LAKE60%",150000,150000,150000,150000,150000,175000,175000,175000,175000,175000]
["LAKE55%",158211,158787,160515,162244,163540,183211,183787,185515,187244,188540]
["LAKE50%",166421,167430,171031,174344,177081,191421,192430,196031,199344,202081]
["LAKE45%",174632,176217,181546,186444,190621,199632,201217,206546,211444,215621]
["LAKE40%",182699,185003,192062,198544,204162,207699,210003,217062,223544,229162]
["LAKE35%",190909,193790,202577,210788,217702,215909,218790,227577,235788,242702]
["LAKE30%",199120,202577,213093,222888,231243,224120,227577,238093,247888,256243]
["LAKE25%",207331,211220,223608,234988,244783,232331,236220,248608,259988,269783]
["LAKE20%",215397,220007,234124,247088,258324,240397,245007,259124,272088,283324]
["LAKE15%",223608,228794,244639,259332,271864,248608,253794,269639,284332,296864]
["LASSEN60%",150000,150000,150000,150000,150000,175000,175000,175000,175000,175000]
["LASSEN55%",158643,159219,161092,162820,164261,183643,184219,186092,187820,189261]
["LASSEN50%",167286,168438,172183,175496,178521,192286,193438,197183,200496,203521]
["LASSEN45%",175929,177657,183275,188317,192782,200929,202657,208275,213317,217782]
["LASSEN40%",184427,186876,194223,201137,207043,209427,211876,219223,226137,232043]
["LASSEN35%",193070,196239,205314,213957,221447,218070,221239,230314,238957,246447]
["LASSEN30%",201713,205458,216406,226777,235708,226713,230458,241406,251777,260708]
["LASSEN25%",210356,214677,227497,239453,249969,235356,239677,252497,264453,274969]
["LASSEN20%",218999,223896,238589,252274,264230,243999,248896,263589,277274,289230]
["LASSEN15%",227641,233115,249681,265094,278490,252641,258115,274681,290094,303490]
["LOS ANGELES60%",150000,150000,150000,150000,150000,175000,175000,175000,175000,175000]
["LOS ANGELES55%",163108,164117,166998,169590,171895,188108,189117,191998,194590,196895]
["LOS ANGELES50%",176361,178233,183851,189181,193646,201361,203233,208851,214181,218646]
["LOS ANGELES45%",189469,192350,200849,208771,215542,214469,217350,225849,233771,240542]
["LOS ANGELES40%",202577,206467,217702,228218,237293,227577,231467,242702,253218,262293]
["LOS ANGELES35%",215830,220583,234700,247808,259188,240830,245583,259700,272808,284188]
["LOS ANGELES30%",228938,234700,251553,267399,280939,253938,259700,276553,292399,305939]
["LOS ANGELES25%",242190,248816,268551,286989,302834,267190,273816,293551,311989,327834]
["LOS ANGELES20%",255299,262933,285404,306435,324585,280299,287933,310404,331435,349585]
["LOS ANGELES15%",268407,277050,302402,326026,346481,293407,302050,327402,351026,371481]
["MADERA60%",150000,150000,150000,150000,150000,175000,175000,175000,175000,175000]
["MADERA55%",158211,158787,160515,162244,163540,183211,183787,185515,187244,188540]
["MADERA50%",166421,167430,171031,174344,177081,191421,192430,196031,199344,202081]
["MADERA45%",174632,176217,181546,186444,190621,199632,201217,206546,211444,215621]
["MADERA40%",182699,185003,192062,198544,204162,207699,210003,217062,223544,229162]
["MADERA35%",190909,193790,202577,210788,217702,215909,218790,227577,235788,242702]
["MADERA30%",199120,202577,213093,222888,231243,224120,227577,238093,247888,256243]
["MADERA25%",207331,211220,223608,234988,244783,232331,236220,248608,259988,269783]
["MADERA20%",215397,220007,234124,247088,258324,240397,245007,259124,272088,283324]
["MADERA15%",223608,228794,244639,259332,271864,248608,253794,269639,284332,296864]
["MARIN60%",150000,150000,150000,150000,150000,175000,175000,175000,175000,175000]
["MARIN55%",170311,171751,176073,180106,183707,195311,196751,201073,205106,208707]
["MARIN50%",190621,193646,202289,210356,217414,215621,218646,227289,235356,242414]
["MARIN45%",210932,215397,228362,240462,251121,235932,240397,253362,265462,276121]
["MARIN40%",231243,237149,254434,270712,284684,256243,262149,279434,295712,309684]
["MARIN35%",251697,258900,280651,300962,318391,276697,283900,305651,325962,343391]
["MARIN30%",272008,280651,306723,331067,352098,297008,305651,331723,356067,377098]
["MARIN25%",292319,302546,332940,361317,385805,317319,327546,357940,386317,410805]
["MARIN20%",312629,324297,359013,391423,419368,337629,349297,384013,416423,444368]
["MARIN15%",332940,346048,385085,421673,453076,357940,371048,410085,446673,478076]
["MARIPOSA60%",150000,150000,150000,150000,150000,175000,175000,175000,175000,175000]
["MARIPOSA55%",158211,158787,160515,162244,163540,183211,183787,185515,187244,188540]
["MARIPOSA50%",166421,167430,171031,174344,177081,191421,192430,196031,199344,202081]
["MARIPOSA45%",174632,176217,181546,186444,190621,199632,201217,206546,211444,215621]
["MARIPOSA40%",182699,185003,192062,198544,204162,207699,210003,217062,223544,229162]
["MARIPOSA35%",190909,193790,202577,210788,217702,215909,218790,227577,235788,242702]
["MARIPOSA30%",199120,202577,213093,222888,231243,224120,227577,238093,247888,256243]
["MARIPOSA25%",207331,211220,223608,234988,244783,232331,236220,248608,259988,269783]
["MARIPOSA20%",215397,220007,234124,247088,258324,240397,245007,259124,272088,283324]
["MARIPOSA15%",223608,228794,244639,259332,271864,248608,253794,269639,284332,296864]
["MENDOCINO60%",150000,150000,150000,150000,150000,175000,175000,175000,175000,175000]
["MENDOCINO55%",158211,158787,160515,162244,163540,183211,183787,185515,187244,188540]
["MENDOCINO50%",166421,167430,171031,174344,177081,191421,192430,196031,199344,202081]
["MENDOCINO45%",174632,176217,181546,186444,190621,199632,201217,206546,211444,215621]
["MENDOCINO40%",182699,185003,192062,198544,204162,207699,210003,217062,223544,229162]
["MENDOCINO35%",190909,193790,202577,210788,217702,215909,218790,227577,235788,242702]
["MENDOCINO30%",199120,202577,213093,222888,231243,224120,227577,238093,247888,256243]
["MENDOCINO25%",207331,211220,223608,234988,244783,232331,236220,248608,259988,269783]
["MENDOCINO20%",215397,220007,234124,247088,258324,240397,245007,259124,272088,283324]
["MENDOCINO15%",223608,228794,244639,259332,271864,248608,253794,269639,284332,296864]
["MERCED60%",150000,150000,150000,150000,150000,175000,175000,175000,175000,175000]
["MERCED55%",158211,158787,160515,162244,163540,183211,183787,185515,187244,188540]
["MERCED50%",166421,167430,171031,174344,177081,191421,192430,196031,199344,202081]
["MERCED45%",174632,176217,181546,186444,190621,199632,201217,206546,211444,215621]
["MERCED40%",182699,185003,192062,198544,204162,207699,210003,217062,223544,229162]
["MERCED35%",190909,193790,202577,210788,217702,215909,218790,227577,235788,242702]
["MERCED30%",199120,202577,213093,222888,231243,224120,227577,238093,247888,256243]
["MERCED25%",207331,211220,223608,234988,244783,232331,236220,248608,259988,269783]
["MERCED20%",215397,220007,234124,247088,258324,240397,245007,259124,272088,283324]
["MERCED15%",223608,228794,244639,259332,271864,248608,253794,269639,284332,296864]
["MODOC60%",150000,150000,150000,150000,150000,175000,175000,175000,175000,175000]
["MODOC55%",158211,158787,160515,162244,163540,183211,183787,185515,187244,188540]
["MODOC50%",166421,167430,171031,174344,177081,191421,192430,196031,199344,202081]
["MODOC45%",174632,176217,181546,186444,190621,199632,201217,206546,211444,215621]
["MODOC40%",182699,185003,192062,198544,204162,207699,210003,217062,223544,229162]
["MODOC35%",190909,193790,202577,210788,217702,215909,218790,227577,235788,242702]
["MODOC30%",199120,202577,213093,222888,231243,224120,227577,238093,247888,256243]
["MODOC25%",207331,211220,223608,234988,244783,232331,236220,248608,259988,269783]
["MODOC20%",215397,220007,234124,247088,258324,240397,245007,259124,272088,283324]
["MODOC15%",223608,228794,244639,259332,271864,248608,253794,269639,284332,296864]
["MONO60%",150000,150000,150000,150000,150000,175000,175000,175000,175000,175000]
["MONO55%",159939,160515,162676,164549,166277,184939,185515,187676,189549,191277]
["MONO50%",169734,171031,175352,179098,182555,194734,196031,200352,204098,207555]
["MONO45%",179530,181546,188028,193790,198832,204530,206546,213028,218790,223832]
["MONO40%",189325,192062,200561,208339,215109,214325,217062,225561,233339,240109]
["MONO35%",199264,202721,213237,222888,231387,224264,227721,238237,247888,256387]
["MONO30%",209059,213237,225913,237581,247664,234059,238237,250913,262581,272664]
["MONO25%",218855,223752,238589,252130,263941,243855,248752,263589,277130,288941]
["MONO20%",228650,234268,251121,266678,280219,253650,259268,276121,291678,305219]
["MONO15%",238589,244783,263797,281371,296496,263589,269783,288797,306371,321496]
["MONTEREY60%",150000,150000,150000,150000,150000,175000,175000,175000,175000,175000]
["MONTEREY55%",161380,162244,164549,166854,168870,186380,187244,189549,191854,193870]
["MONTEREY50%",172615,174344,179098,183707,187596,197615,199344,204098,208707,212596]
["MONTEREY45%",183995,186444,193646,200561,206322,208995,211444,218646,225561,231322]
["MONTEREY40%",195231,198544,208195,217270,225049,220231,223544,233195,242270,250049]
["MONTEREY35%",206611,210788,222888,234124,243919,231611,235788,247888,259124,268919]
["MONTEREY30%",217990,222888,237437,250977,262645,242990,247888,262437,275977,287645]
["MONTEREY25%",229226,234988,251985,267831,281371,254226,259988,276985,292831,306371]
["MONTEREY20%",240606,247088,266534,284540,300097,265606,272088,291534,309540,325097]
["MONTEREY15%",251985,259332,281083,301394,318967,276985,284332,306083,326394,343967]
["NAPA60%",150000,150000,150000,150000,150000,175000,175000,175000,175000,175000]
["NAPA55%",162676,163540,166277,168726,171031,187676,188540,191277,193726,196031]
["NAPA50%",175352,177225,182555,187596,191918,200352,202225,207555,212596,216918]
["NAPA45%",188028,190765,198832,206322,212949,213028,215765,223832,231322,237949]
["NAPA40%",200561,204306,215109,225193,233836,225561,229306,240109,250193,258836]
["NAPA35%",213237,217846,231387,244063,254866,238237,242846,256387,269063,279866]
["NAPA30%",225913,231387,247664,262789,275897,250913,256387,272664,287789,300897]
["NAPA25%",238589,245071,263941,281659,296784,263589,270071,288941,306659,321784]
["NAPA20%",251265,258612,280219,300385,317815,276265,283612,305219,325385,342815]
["NAPA15%",263941,272152,296496,319256,338846,288941,297152,321496,344256,363846]
["NEVADA60%",150000,150000,150000,150000,150000,175000,175000,175000,175000,175000]
["NEVADA55%",160083,160804,162964,164981,166709,185083,185804,187964,189981,191709]
["NEVADA50%",170167,171607,175929,179818,183275,195167,196607,200929,204818,208275]
["NEVADA45%",180250,182411,188893,194799,199984,205250,207411,213893,219799,224984]
["NEVADA40%",190189,193070,201713,209636,216550,215189,218070,226713,234636,241550]
["NEVADA35%",200273,203874,214677,224617,233259,225273,228874,239677,249617,258259]
["NEVADA30%",210356,214677,227641,239597,249969,235356,239677,252641,264597,274969]
["NEVADA25%",220439,225481,240606,254434,266534,245439,250481,265606,279434,291534]
["NEVADA20%",230378,236140,253426,269415,283244,255378,261140,278426,294415,308244]
["NEVADA15%",240462,246944,266390,284396,299953,265462,271944,291390,309396,324953]
["ORANGE60%",150000,150000,150000,150000,150000,175000,175000,175000,175000,175000]
["ORANGE55%",164981,165989,169302,172183,174776,189981,190989,194302,197183,199776]
["ORANGE50%",179962,181979,188461,194367,199552,204962,206979,213461,219367,224552]
["ORANGE45%",194943,198112,207763,216694,224328,219943,223112,232763,241694,249328]
["ORANGE40%",209780,214101,226921,238877,249105,234780,239101,251921,263877,274105]
["ORANGE35%",224761,230090,246224,261060,274025,249761,255090,271224,286060,299025]
["ORANGE30%",239741,246224,265526,283388,298801,264741,271224,290526,308388,323801]
["ORANGE25%",254722,262213,284684,305571,323577,279722,287213,309684,330571,348577]
["ORANGE20%",269703,278202,303987,327754,348353,294703,303202,328987,352754,373353]
["ORANGE15%",284684,294335,323289,350082,373129,309684,319335,348289,375082,398129]
["PLACER60%",150000,150000,150000,150000,150000,175000,175000,175000,175000,175000]
["PLACER55%",160660,161380,163540,165701,167574,185660,186380,188540,190701,192574]
["PLACER50%",171175,172615,177081,181402,185003,196175,197615,202081,206402,210003]
["PLACER45%",181690,183995,190621,196959,202433,206690,208995,215621,221959,227433]
["PLACER40%",192206,195231,204162,212661,219863,217206,220231,229162,237661,244863]
["PLACER35%",202865,206467,217846,228362,237437,227865,231467,242846,253362,262437]
["PLACER30%",213381,217846,231387,243919,254866,238381,242846,256387,268919,279866]
["PLACER25%",223896,229082,244927,259620,272296,248896,254082,269927,284620,297296]
["PLACER20%",234412,240462,258468,275321,289726,259412,265462,283468,300321,314726]
["PLACER15%",245071,251697,272008,290878,307300,270071,276697,297008,315878,332300]
["PLUMAS60%",150000,150000,150000,150000,150000,175000,175000,175000,175000,175000]
["PLUMAS55%",158787,159363,161236,163108,164549,183787,184363,186236,188108,189549]
["PLUMAS50%",167574,168726,172615,176073,179098,192574,193726,197615,201073,204098]
["PLUMAS45%",176361,178233,183851,189181,193646,201361,203233,208851,214181,218646]
["PLUMAS40%",185148,187596,195087,202145,208195,210148,212596,220087,227145,233195]
["PLUMAS35%",193934,196959,206467,215253,222744,218934,221959,231467,240253,247744]
["PLUMAS30%",202721,206467,217702,228218,237293,227721,231467,242702,253218,262293]
["PLUMAS25%",211508,215830,229082,241326,251841,236508,240830,254082,266326,276841]
["PLUMAS20%",220295,225193,240318,254290,266390,245295,250193,265318,279290,291390]
["PLUMAS15%",229082,234700,251553,267399,280939,254082,259700,276553,292399,305939]
["RIVERSIDE60%",150000,150000,150000,150000,150000,175000,175000,175000,175000,175000]
["RIVERSIDE55%",159075,159651,161668,163396,164981,184075,184651,186668,188396,189981]
["RIVERSIDE50%",168150,169446,173336,176937,179962,193150,194446,198336,201937,204962]
["RIVERSIDE45%",177225,179098,185003,190333,194943,202225,204098,210003,215333,219943]
["RIVERSIDE40%",186156,188749,196527,203730,209924,211156,213749,221527,228730,234924]
["RIVERSIDE35%",195231,198544,208195,217270,225049,220231,223544,233195,242270,250049]
["RIVERSIDE30%",204306,208195,219863,230666,240030,229306,233195,244863,255666,265030]
["RIVERSIDE25%",213381,217990,231531,244207,255010,238381,242990,256531,269207,280010]
["RIVERSIDE20%",222456,227641,243199,257603,269991,247456,252641,268199,282603,294991]
["RIVERSIDE15%",231531,237293,254866,271000,284972,256531,262293,279866,296000,309972]
["SACRAMENTO60%",150000,150000,150000,150000,150000,175000,175000,175000,175000,175000]
["SACRAMENTO55%",160660,161380,163540,165701,167574,185660,186380,188540,190701,192574]
["SACRAMENTO50%",171175,172615,177081,181402,185003,196175,197615,202081,206402,210003]
["SACRAMENTO45%",181690,183995,190621,196959,202433,206690,208995,215621,221959,227433]
["SACRAMENTO40%",192206,195231,204162,212661,219863,217206,220231,229162,237661,244863]
["SACRAMENTO35%",202865,206467,217846,228362,237437,227865,231467,242846,253362,262437]
["SACRAMENTO30%",213381,217846,231387,243919,254866,238381,242846,256387,268919,279866]
["SACRAMENTO25%",223896,229082,244927,259620,272296,248896,254082,269927,284620,297296]
["SACRAMENTO20%",234412,240462,258468,275321,289726,259412,265462,283468,300321,314726]
["SACRAMENTO15%",245071,251697,272008,290878,307300,270071,276697,297008,315878,332300]
["SAN BENITO60%",150000,150000,150000,150000,150000,175000,175000,175000,175000,175000]
["SAN BENITO55%",162964,163829,166565,169158,171319,187964,188829,191565,194158,196319]
["SAN BENITO50%",175784,177513,183131,188173,192638,200784,202513,208131,213173,217638]
["SAN BENITO45%",188605,191342,199696,207331,213957,213605,216342,224696,232331,238957]
["SAN BENITO40%",201425,205026,216118,226345,235276,226425,230026,241118,251345,260276]
["SAN BENITO35%",214389,218855,232683,245503,256595,239389,243855,257683,270503,281595]
["SAN BENITO30%",227209,232683,249249,264662,277914,252209,257683,274249,289662,302914]
["SAN BENITO25%",240030,246368,265814,283676,299233,265030,271368,290814,308676,324233]
["SAN BENITO20%",252850,260196,282235,302834,320552,277850,285196,307235,327834,345552]
["SAN BENITO15%",265814,274025,298801,321992,341871,290814,299025,323801,346992,366871]
["SAN BERNARDINO60%",150000,150000,150000,150000,150000,175000,175000,175000,175000,175000]
["SAN BERNARDINO55%",159075,159651,161668,163396,164981,184075,184651,186668,188396,189981]
["SAN BERNARDINO50%",168150,169446,173336,176937,179962,193150,194446,198336,201937,204962]
["SAN BERNARDINO45%",177225,179098,185003,190333,194943,202225,204098,210003,215333,219943]
["SAN BERNARDINO40%",186156,188749,196527,203730,209924,211156,213749,221527,228730,234924]
["SAN BERNARDINO35%",195231,198544,208195,217270,225049,220231,223544,233195,242270,250049]
["SAN BERNARDINO30%",204306,208195,219863,230666,240030,229306,233195,244863,255666,265030]
["SAN BERNARDINO25%",213381,217990,231531,244207,255010,238381,242990,256531,269207,280010]
["SAN BERNARDINO20%",222456,227641,243199,257603,269991,247456,252641,268199,282603,294991]
["SAN BERNARDINO15%",231531,237293,254866,271000,284972,256531,262293,279866,296000,309972]
["SAN DIEGO60%",150000,150000,150000,150000,150000,175000,175000,175000,175000,175000]
["SAN DIEGO55%",163540,164405,167286,170023,172471,188540,189405,192286,195023,197471]
["SAN DIEGO50%",176937,178809,184715,190045,194799,201937,203809,209715,215045,219799]
["SAN DIEGO45%",190477,193358,202001,210068,217126,215477,218358,227001,235068,242126]
["SAN DIEGO40%",203874,207763,219287,230090,239453,228874,232763,244287,255090,264453]
["SAN DIEGO35%",217414,222168,236716,250257,261925,242414,247168,261716,275257,286925]
["SAN DIEGO30%",230955,236716,254002,270279,284252,255955,261716,279002,295279,309252]
["SAN DIEGO25%",244351,251121,271432,290302,306579,269351,276121,296432,315302,331579]
["SAN DIEGO20%",257891,265526,288718,310325,328907,282891,290526,313718,335325,353907]
["SAN DIEGO15%",271432,280075,306003,330347,351378,296432,305075,331003,355347,376378]
["SAN FRANCISCO60%",150000,150000,150000,150000,150000,175000,175000,175000,175000,175000]
["SAN FRANCISCO55%",170311,171751,176073,180106,183707,195311,196751,201073,205106,208707]
["SAN FRANCISCO50%",190621,193646,202289,210356,217414,215621,218646,227289,235356,242414]
["SAN FRANCISCO45%",210932,215397,228362,240462,251121,235932,240397,253362,265462,276121]
["SAN FRANCISCO40%",231243,237149,254434,270712,284684,256243,262149,279434,295712,309684]
["SAN FRANCISCO35%",251697,258900,280651,300962,318391,276697,283900,305651,325962,343391]
["SAN FRANCISCO30%",272008,280651,306723,331067,352098,297008,305651,331723,356067,377098]
["SAN FRANCISCO25%",292319,302546,332940,361317,385805,317319,327546,357940,386317,410805]
["SAN FRANCISCO20%",312629,324297,359013,391423,419368,337629,349297,384013,416423,444368]
["SAN FRANCISCO15%",332940,346048,385085,421673,453076,357940,371048,410085,446673,478076]
["SAN JOAQUIN60%",150000,150000,150000,150000,150000,175000,175000,175000,175000,175000]
["SAN JOAQUIN55%",158931,159507,161380,163108,164693,183931,184507,186380,188108,189693]
["SAN JOAQUIN50%",167718,168870,172759,176217,179242,192718,193870,197759,201217,204242]
["SAN JOAQUIN45%",176505,178377,184139,189325,193934,201505,203377,209139,214325,218934]
["SAN JOAQUIN40%",185292,187740,195375,202433,208483,210292,212740,220375,227433,233483]
["SAN JOAQUIN35%",194223,197248,206755,215542,223176,219223,222248,231755,240542,248176]
["SAN JOAQUIN30%",203009,206755,218134,228650,237725,228009,231755,243134,253650,262725]
["SAN JOAQUIN25%",211796,216118,229514,241758,252418,236796,241118,254514,266758,277418]
["SAN JOAQUIN20%",220583,225625,240750,254866,266966,245583,250625,265750,279866,291966]
["SAN JOAQUIN15%",229514,235132,252130,267975,281659,254514,260132,277130,292975,306659]
["SAN LUIS OBISPO60%",150000,150000,150000,150000,150000,175000,175000,175000,175000,175000]
["SAN LUIS OBISPO55%",161380,162100,164693,166854,168726,186380,187100,189693,191854,193726]
["SAN LUIS OBISPO50%",172759,174344,179242,183707,187596,197759,199344,204242,208707,212596]
["SAN LUIS OBISPO45%",184139,186444,193790,200561,206322,209139,211444,218790,225561,231322]
["SAN LUIS OBISPO40%",195375,198544,208339,217270,225049,220375,223544,233339,242270,250049]
["SAN LUIS OBISPO35%",206755,210788,223032,234124,243919,231755,235788,248032,259124,268919]
["SAN LUIS OBISPO30%",218134,222888,237581,250977,262645,243134,247888,262581,275977,287645]
["SAN LUIS OBISPO25%",229514,235132,252130,267831,281515,254514,260132,277130,292831,306515]
["SAN LUIS OBISPO20%",240750,247232,266678,284684,300241,265750,272232,291678,309684,325241]
["SAN LUIS OBISPO15%",252130,259332,281371,301538,318967,277130,284332,306371,326538,343967]
["SAN MATEO60%",150000,150000,150000,150000,150000,175000,175000,175000,175000,175000]
["SAN MATEO55%",170311,171751,176073,180106,183707,195311,196751,201073,205106,208707]
["SAN MATEO50%",190621,193646,202289,210356,217414,215621,218646,227289,235356,242414]
["SAN MATEO45%",210932,215397,228362,240462,251121,235932,240397,253362,265462,276121]
["SAN MATEO40%",231243,237149,254434,270712,284684,256243,262149,279434,295712,309684]
["SAN MATEO35%",251697,258900,280651,300962,318391,276697,283900,305651,325962,343391]
["SAN MATEO30%",272008,280651,306723,331067,352098,297008,305651,331723,356067,377098]
["SAN MATEO25%",292319,302546,332940,361317,385805,317319,327546,357940,386317,410805]
["SAN MATEO20%",312629,324297,359013,391423,419368,337629,349297,384013,416423,444368]
["SAN MATEO15%",332940,346048,385085,421673,453076,357940,371048,410085,446673,478076]
["SANTA BARBARA60%",150000,150000,150000,150000,150000,175000,175000,175000,175000,175000]
["SANTA BARBARA55%",163973,164981,167862,170743,173048,188973,189981,192862,195743,198048]
["SANTA BARBARA50%",177801,179818,185724,191342,196095,202801,204818,210724,216342,221095]
["SANTA BARBARA45%",191774,194799,203586,212084,219143,216774,219799,228586,237084,244143]
["SANTA BARBARA40%",205602,209636,221447,232683,242190,230602,234636,246447,257683,267190]
["SANTA BARBARA35%",219575,224617,239453,253282,265238,244575,249617,264453,278282,290238]
["SANTA BARBARA30%",233547,239453,257315,274025,288285,258547,264453,282315,299025,313285]
["SANTA BARBARA25%",247376,254434,275177,294623,311333,272376,279434,300177,319623,336333]
["SANTA BARBARA20%",261349,269271,293039,315366,334381,286349,294271,318039,340366,359381]
["SANTA BARBARA15%",275321,284252,310901,335965,357428,300321,309252,335901,360965,382428]
["SANTA CLARA60%",150000,150000,150000,150000,150000,175000,175000,175000,175000,175000]
["SANTA CLARA55%",168438,169879,173768,177513,180682,193438,194879,198768,202513,205682]
["SANTA CLARA50%",186876,189613,197392,204882,211220,211876,214613,222392,229882,236220]
["SANTA CLARA45%",205314,209347,221159,232251,241758,230314,234347,246159,257251,266758]
["SANTA CLARA40%",223752,229082,244783,259620,272296,248752,254082,269783,284620,297296]
["SANTA CLARA35%",242334,248960,268551,287133,302978,267334,273960,293551,312133,327978]
["SANTA CLARA30%",260772,268695,292319,314502,333516,285772,293695,317319,339502,358516]
["SANTA CLARA25%",279210,288429,315942,341871,364054,304210,313429,340942,366871,389054]
["SANTA CLARA20%",297648,308164,339710,369240,394592,322648,333164,364710,394240,419592]
["SANTA CLARA15%",316087,328042,363478,396753,425274,341087,353042,388478,421753,450274]
["SANTA CRUZ60%",150000,150000,150000,150000,150000,175000,175000,175000,175000,175000]
["SANTA CRUZ55%",165413,166565,169879,172904,175640,190413,191565,194879,197904,200640]
["SANTA CRUZ50%",180970,183131,189757,195951,201281,205970,208131,214757,220951,226281]
["SANTA CRUZ45%",196383,199696,209636,218855,226921,221383,224696,234636,243855,251921]
["SANTA CRUZ40%",211796,216262,229514,241902,252562,236796,241262,254514,266902,277562]
["SANTA CRUZ35%",227353,232827,249537,264950,278202,252353,257827,274537,289950,303202]
["SANTA CRUZ30%",242766,249393,269415,287853,303843,267766,274393,294415,312853,328843]
["SANTA CRUZ25%",258324,265958,289294,310901,329483,283324,290958,314294,335901,354483]
["SANTA CRUZ20%",273737,282524,309172,333804,355123,298737,307524,334172,358804,380123]
["SANTA CRUZ15%",289150,299089,329051,356852,380764,314150,324089,354051,381852,405764]
["SHASTA60%",150000,150000,150000,150000,150000,175000,175000,175000,175000,175000]
["SHASTA55%",158211,158787,160515,162244,163540,183211,183787,185515,187244,188540]
["SHASTA50%",166421,167430,171031,174344,177081,191421,192430,196031,199344,202081]
["SHASTA45%",174632,176217,181546,186444,190621,199632,201217,206546,211444,215621]
["SHASTA40%",182699,185003,192062,198544,204162,207699,210003,217062,223544,229162]
["SHASTA35%",190909,193790,202577,210788,217702,215909,218790,227577,235788,242702]
["SHASTA30%",199120,202577,213093,222888,231243,224120,227577,238093,247888,256243]
["SHASTA25%",207331,211220,223608,234988,244783,232331,236220,248608,259988,269783]
["SHASTA20%",215397,220007,234124,247088,258324,240397,245007,259124,272088,283324]
["SHASTA15%",223608,228794,244639,259332,271864,248608,253794,269639,284332,296864]
["SIERRA60%",150000,150000,150000,150000,150000,175000,175000,175000,175000,175000]
["SIERRA55%",159507,160227,162244,164117,165701,184507,185227,187244,189117,190701]
["SIERRA50%",169014,170455,174488,178233,181546,194014,195455,199488,203233,206546]
["SIERRA45%",178521,180682,186732,192350,197248,203521,205682,211732,217350,222248]
["SIERRA40%",188028,190765,198832,206467,212949,213028,215765,223832,231467,237949]
["SIERRA35%",197536,200993,211076,220583,228794,222536,225993,236076,245583,253794]
["SIERRA30%",207043,211220,223320,234700,244495,232043,236220,248320,259700,269495]
["SIERRA25%",216550,221447,235564,248816,260340,241550,246447,260564,273816,285340]
["SIERRA20%",226057,231531,247808,262933,276041,251057,256531,272808,287933,301041]
["SIERRA15%",235564,241758,260052,277050,291743,260564,266758,285052,302050,316743]
["SISKIYOU60%",150000,150000,150000,150000,150000,175000,175000,175000,175000,175000]
["SISKIYOU55%",158211,158787,160515,162244,163540,183211,183787,185515,187244,188540]
["SISKIYOU50%",166421,167430,171031,174344,177081,191421,192430,196031,199344,202081]
["SISKIYOU45%",174632,176217,181546,186444,190621,199632,201217,206546,211444,215621]
["SISKIYOU40%",182699,185003,192062,198544,204162,207699,210003,217062,223544,229162]
["SISKIYOU35%",190909,193790,202577,210788,217702,215909,218790,227577,235788,242702]
["SISKIYOU30%",199120,202577,213093,222888,231243,224120,227577,238093,247888,256243]
["SISKIYOU25%",207331,211220,223608,234988,244783,232331,236220,248608,259988,269783]
["SISKIYOU20%",215397,220007,234124,247088,258324,240397,245007,259124,272088,283324]
["SISKIYOU15%",223608,228794,244639,259332,271864,248608,253794,269639,284332,296864]
["SOLANO60%",150000,150000,150000,150000,150000,175000,175000,175000,175000,175000]
["SOLANO55%",160804,161524,163973,166133,167862,185804,186524,188973,191133,192862]
["SOLANO50%",171607,173192,177801,182123,185868,196607,198192,202801,207123,210868]
["SOLANO45%",182411,184715,191774,198256,203730,207411,209715,216774,223256,228730]
["SOLANO40%",193214,196239,205602,214245,221592,218214,221239,230602,239245,246592]
["SOLANO35%",204018,207907,219575,230234,239597,229018,232907,244575,255234,264597]
["SOLANO30%",214821,219431,233403,246368,257459,239821,244431,258403,271368,282459]
["SOLANO25%",225625,231099,247376,262357,275465,250625,256099,272376,287357,300465]
["SOLANO20%",236428,242622,261205,278490,293327,261428,267622,286205,303490,318327]
["SOLANO15%",247232,254146,275177,294479,311189,272232,279146,300177,319479,336189]
["SONOMA60%",150000,150000,150000,150000,150000,175000,175000,175000,175000,175000]
["SONOMA55%",163684,164693,167574,170311,172615,188684,189693,192574,195311,197615]
["SONOMA50%",177225,179242,185003,190477,195087,202225,204242,210003,215477,220087]
["SONOMA45%",190909,193790,202577,210788,217702,215909,218790,227577,235788,242702]
["SONOMA40%",204450,208339,220007,230955,240174,229450,233339,245007,255955,265174]
["SONOMA35%",218134,223032,237581,251121,262789,243134,248032,262581,276121,287789]
["SONOMA30%",231675,237581,255010,271432,285404,256675,262581,280010,296432,310404]
["SONOMA25%",245359,252130,272584,291598,307876,270359,277130,297584,316598,332876]
["SONOMA20%",258900,266678,290014,311909,330491,283900,291678,315014,336909,355491]
["SONOMA15%",272584,281371,307588,332076,353107,297584,306371,332588,357076,378107]
["STANISLAUS60%",150000,150000,150000,150000,150000,175000,175000,175000,175000,175000]
["STANISLAUS55%",158211,158787,160515,162244,163540,183211,183787,185515,187244,188540]
["STANISLAUS50%",166421,167430,171031,174344,177081,191421,192430,196031,199344,202081]
["STANISLAUS45%",174632,176217,181546,186444,190621,199632,201217,206546,211444,215621]
["STANISLAUS40%",182699,185003,192062,198544,204162,207699,210003,217062,223544,229162]
["STANISLAUS35%",190909,193790,202577,210788,217702,215909,218790,227577,235788,242702]
["STANISLAUS30%",199120,202577,213093,222888,231243,224120,227577,238093,247888,256243]
["STANISLAUS25%",207331,211220,223608,234988,244783,232331,236220,248608,259988,269783]
["STANISLAUS20%",215397,220007,234124,247088,258324,240397,245007,259124,272088,283324]
["STANISLAUS15%",223608,228794,244639,259332,271864,248608,253794,269639,284332,296864]
["SUTTER60%",150000,150000,150000,150000,150000,175000,175000,175000,175000,175000]
["SUTTER55%",158211,158787,160515,162244,163540,183211,183787,185515,187244,188540]
["SUTTER50%",166421,167430,171031,174344,177081,191421,192430,196031,199344,202081]
["SUTTER45%",174632,176217,181546,186444,190621,199632,201217,206546,211444,215621]
["SUTTER40%",182699,185003,192062,198544,204162,207699,210003,217062,223544,229162]
["SUTTER35%",190909,193790,202577,210788,217702,215909,218790,227577,235788,242702]
["SUTTER30%",199120,202577,213093,222888,231243,224120,227577,238093,247888,256243]
["SUTTER25%",207331,211220,223608,234988,244783,232331,236220,248608,259988,269783]
["SUTTER20%",215397,220007,234124,247088,258324,240397,245007,259124,272088,283324]
["SUTTER15%",223608,228794,244639,259332,271864,248608,253794,269639,284332,296864]
["TEHAMA60%",150000,150000,150000,150000,150000,175000,175000,175000,175000,175000]
["TEHAMA55%",158211,158787,160515,162244,163540,183211,183787,185515,187244,188540]
["TEHAMA50%",166421,167430,171031,174344,177081,191421,192430,196031,199344,202081]
["TEHAMA45%",174632,176217,181546,186444,190621,199632,201217,206546,211444,215621]
["TEHAMA40%",182699,185003,192062,198544,204162,207699,210003,217062,223544,229162]
["TEHAMA35%",190909,193790,202577,210788,217702,215909,218790,227577,235788,242702]
["TEHAMA30%",199120,202577,213093,222888,231243,224120,227577,238093,247888,256243]
["TEHAMA25%",207331,211220,223608,234988,244783,232331,236220,248608,259988,269783]
["TEHAMA20%",215397,220007,234124,247088,258324,240397,245007,259124,272088,283324]
["TEHAMA15%",223608,228794,244639,259332,271864,248608,253794,269639,284332,296864]
["TRINITY60%",150000,150000,150000,150000,150000,175000,175000,175000,175000,175000]
["TRINITY55%",158211,158787,160515,162244,163540,183211,183787,185515,187244,188540]
["TRINITY50%",166421,167430,171031,174344,177081,191421,192430,196031,199344,202081]
["TRINITY45%",174632,176217,181546,186444,190621,199632,201217,206546,211444,215621]
["TRINITY40%",182699,185003,192062,198544,204162,207699,210003,217062,223544,229162]
["TRINITY35%",190909,193790,202577,210788,217702,215909,218790,227577,235788,242702]
["TRINITY30%",199120,202577,213093,222888,231243,224120,227577,238093,247888,256243]
["TRINITY25%",207331,211220,223608,234988,244783,232331,236220,248608,259988,269783]
["TRINITY20%",215397,220007,234124,247088,258324,240397,245007,259124,272088,283324]
["TRINITY15%",223608,228794,244639,259332,271864,248608,253794,269639,284332,296864]
["TULARE60%",150000,150000,150000,150000,150000,175000,175000,175000,175000,175000]
["TULARE55%",158211,158787,160515,162244,163540,183211,183787,185515,187244,188540]
["TULARE50%",166421,167430,171031,174344,177081,191421,192430,196031,199344,202081]
["TULARE45%",174632,176217,181546,186444,190621,199632,201217,206546,211444,215621]
["TULARE40%",182699,185003,192062,198544,204162,207699,210003,217062,223544,229162]
["TULARE35%",190909,193790,202577,210788,217702,215909,218790,227577,235788,242702]
["TULARE30%",199120,202577,213093,222888,231243,224120,227577,238093,247888,256243]
["TULARE25%",207331,211220,223608,234988,244783,232331,236220,248608,259988,269783]
["TULARE20%",215397,220007,234124,247088,258324,240397,245007,259124,272088,283324]
["TULARE15%",223608,228794,244639,259332,271864,248608,253794,269639,284332,296864]
["TUOLUMNE60%",150000,150000,150000,150000,150000,175000,175000,175000,175000,175000]
["TUOLUMNE55%",158355,158931,160660,162388,163684,183355,183931,185660,187388,188684]
["TUOLUMNE50%",166565,167718,171319,174632,177513,191565,192718,196319,199632,202513]
["TUOLUMNE45%",174920,176649,181979,187020,191198,199920,201649,206979,212020,216198]
["TUOLUMNE40%",183131,185436,192638,199264,204882,208131,210436,217638,224264,229882]
["TUOLUMNE35%",191486,194367,203298,211508,218711,216486,219367,228298,236508,243711]
["TUOLUMNE30%",199696,203298,213957,223896,232395,224696,228298,238957,248896,257395]
["TUOLUMNE25%",208051,212084,224617,236140,246224,233051,237084,249617,261140,271224]
["TUOLUMNE20%",216262,221015,235276,248528,259908,241262,246015,260276,273528,284908]
["TUOLUMNE15%",224617,229946,245936,260772,273593,249617,254946,270936,285772,298593]
["VENTURA60%",150000,150000,150000,150000,150000,175000,175000,175000,175000,175000]
["VENTURA55%",163252,164117,166998,169590,171895,188252,189117,191998,194590,196895]
["VENTURA50%",176361,178233,183995,189181,193790,201361,203233,208995,214181,218790]
["VENTURA45%",189613,192350,200993,208771,215686,214613,217350,225993,233771,240686]
["VENTURA40%",202721,206467,217846,228362,237437,227721,231467,242846,253362,262437]
["VENTURA35%",215974,220727,234844,247952,259332,240974,245727,259844,272952,284332]
["VENTURA30%",229226,234844,251841,267543,281227,254226,259844,276841,292543,306227]
["VENTURA25%",242334,248960,268839,287133,303122,267334,273960,293839,312133,328122]
["VENTURA20%",255587,263077,285693,306723,324873,280587,288077,310693,331723,349873]
["VENTURA15%",268839,277194,302690,326314,346769,293839,302194,327690,351314,371769]
["YOLO60%",150000,150000,150000,150000,150000,175000,175000,175000,175000,175000]
["YOLO55%",161092,161956,164261,166421,168438,186092,186956,189261,191421,193438]
["YOLO50%",172183,173768,178521,182843,186732,197183,198768,203521,207843,211732]
["YOLO45%",183275,185724,192782,199408,205170,208275,210724,217782,224408,230170]
["YOLO40%",194367,197536,207043,215830,223464,219367,222536,232043,240830,248464]
["YOLO35%",205458,209492,221303,232251,241902,230458,234492,246303,257251,266902]
["YOLO30%",216550,221303,235564,248816,260196,241550,246303,260564,273816,285196]
["YOLO25%",227641,233259,249825,265238,278634,252641,258259,274825,290238,303634]
["YOLO20%",238733,245071,264085,281659,296928,263733,270071,289085,306659,321928]
["YOLO15%",249825,257027,278346,298225,315366,274825,282027,303346,323225,340366]
["YUBA60%",150000,150000,150000,150000,150000,175000,175000,175000,175000,175000]
["YUBA55%",158211,158787,160515,162244,163540,183211,183787,185515,187244,188540]
["YUBA50%",166421,167430,171031,174344,177081,191421,192430,196031,199344,202081]
["YUBA45%",174632,176217,181546,186444,190621,199632,201217,206546,211444,215621]
["YUBA40%",182699,185003,192062,198544,204162,207699,210003,217062,223544,229162]
["YUBA35%",190909,193790,202577,210788,217702,215909,218790,227577,235788,242702]
["YUBA30%",199120,202577,213093,222888,231243,224120,227577,238093,247888,256243]
["YUBA25%",207331,211220,223608,234988,244783,232331,236220,248608,259988,269783]
["YUBA20%",215397,220007,234124,247088,258324,240397,245007,259124,272088,283324]
["YUBA15%",223608,228794,244639,259332,271864,248608,253794,269639,284332,296864]