{"text_format":"1","workbook":"xlsx","n_sheets":18,"sheets":["Calculator","Assumptions","Rent-Owner Afford Cost","Homeowner Cost","PMI","Interest Rates","IncomeLimits","2023","2022","2021","2020","2019","2018","2017","2016","2015","2014","2013"],"not_rendered":{"charts":0,"images":0,"macros":1,"external_links":0,"defined_names":5,"comments":0,"pivot_tables":0},"unopened":[],"bounds":{"document_bytes":16777216,"sheet_cells":100000,"rows_first":2000,"rows_last":500,"rows_between":2000,"halvings":0,"cell_chars":16384,"cell_head_chars":4096},"cells_cut":0,"cells_raw":0,"read":"whole","date_system":"1900"}

{"sheet":"Calculator","index":0,"n_rows":40,"n_cols":11,"rows_kept":40,"cut":false,"hidden":false,"merged":[]}
["Housing Affordability Calculator","Inputs/Outputs"]
["Year",2023]
["County","Fresno"]
["Tenure","Renter",null,null,null,null,null,null,null,null,"Renter"]
["Bedrooms",2,null,null,null,null,null,null,null,null,"Owner"]
[{"$f":"IF(B4=\"Owner\",\"Sales Price\",IF(B4=\"Renter\",\"Monthly Rent\",\"\"))","v":"Monthly Rent"},1200,null,null,null,null,null,null,null,null,0]
["Monthly Cost (Before Utilities)",{"$f":"IF(B4=\"Renter\",$B$6,IF(B4=\"Owner\",'Homeowner Cost'!$B$21,\"\"))","v":1200},null,null,null,null,null,null,null,null,1]
["Lowest Affordability Level",{"$f":"IFERROR(IF(B7<E40,\"Extremely Low Income\",IF(B7>E40,IF(B7<F40,\"Very Low Income\",IF(B7<G40,\"Lower Income\",IF(B7<H40,\"Moderate Income\",\"Above Moderate Income\"))))),\"\")","v":"Lower Income"},null,null,null,null,null,null,null,null,2]
[null,null,null,null,null,null,null,null,null,null,3]
["A. Check to make sure you are using the calculator for the year of the Annual Progress\n   ",null,null,null,null,null,null,null,null,null,4]
["Report you are completing. The year in row 2 should match the year of the Annual ",null,null,null,null,null,null,null,null,null,5]
["Progress Report you are completing. If it does not, close the AMI calculator workbook ",null,null,null,null,null,null,null,null,null,6]
["and download the AMI calculator workbook for the most recent year.",null,null,null,null,null,null,null,null,null,7]
[null,null,null,null,null,null,null,null,null,null,2023]
["B. In row 3, select from the drop down list the County in which the jurisdiction for which ",null,null,null,null,null,null,null,null,null,2022]
[" you are completing the annual report is located.  ",null,null,null,null,null,null,null,null,null,2021]
[null,null,null,null,null,null,null,null,null,null,2020]
["C. In row 4, select the tenure of the unit for which you are calculating the affordability",null,null,null,null,null,null,null,null,null,2019]
["level. If “Owner” is selected in row 4, row 6 will update to say “Sales Price”. If ",null,null,null,null,null,null,null,null,null,{"$f":"K18-1","v":2018}]
["“Renter” is selected in row 4, row 6 will update to say “Monthly Rent”",null,null,null,null,null,null,null,null,null,{"$f":"K19-1","v":2017}]
{"$rows_left_out":21}
{"sheet":"Assumptions","index":1,"n_rows":12,"n_cols":1,"rows_kept":12,"cut":false,"hidden":false,"merged":[]}
["Housing Affordability Calculator"]
["Assumptions"]
["The Housing Affordability Calculator makes its affordability determinations based on the income levels provided in the Official State Income Limits published annually by HCD. The Official State Income Limits are available on HCDs website at http://www.hcd.ca.gov/grants-funding/income-limits/state-and-federal-income-limits.shtml. The Calculator uses the definition of “affordable” as defined in Health and Safety Code Sections 50052.5 and 50053. Where these sections provide more than one option for the rent or housing cost used to calculate affordability, the calculator bases its determination on the higher option.  "]
["For all units, the calculator assumes the following:\nA. Household size will exceed bedroom count by one (e.g. the household size of a two \n     bedroom unit will be three persons).\nB. Monthly housing costs will include a utility allowance equal to the Average California \n     Monthly Residential Utility Bill according to the U.S. Energy Information Administration[i]\n     (EIA) ($116.94 per month in 2020)."]
["For owner-occupied units, the calculator assumes the following based on the most recent data available at the time that the calculator is updated:\nA. A 30-year Federal Housing Administration (FHA) mortgage with a down-payment of\n     3.5% of the sales price.\nB. The highest national average mortgage interest rate from the fiscal year prior[ii]\nC. A private mortgage insurance premium calculated pursuant to HUD’s FHA methodology\nD. A property tax rate of 1.1%\nE. For homeowners’ insurance, the Annual Average Written Premium according to the \n     Homeowners Multi-Peril Data[iii] from the California Department of Insurance.\nF. Average annual home maintenance equal to 1% of sales price\nG. Statewide Average Monthly Water Bill per most recent California Water Boards Drinking\n     Water Needs Assessment [iv]\nH. Monthly sewer costs pursuant to the average California wastewater costs in the State\n     Water Resources Control Board survey [v]\nI.  Monthly trash pickup and residential garbage collection costs in the middle of the range provided by HomeAdvisor[vi].\n\n"]
["References"]
["[i] https://www.eia.gov/electricity/sales_revenue_price/pdf/table5_a.pdf"]
["[ii] https://fred.stlouisfed.org/series/MORTGAGE30US"]
["[iii] https://www.insurance.ca.gov/0400-news/0200-studies-reports/0250-homeowners-study/upload/A-Part-I-Data-Summary.xlsx"]
["[iv]https://www.waterboards.ca.gov/drinking_water/certlic/drinkingwater/documents/needs/2021_needs_assessment.pdf "]
["[v]https://www.waterboards.ca.gov/water_issues/programs/grants_loans/srf/docs/cy2018ww_user_charge_survey.pdf"]
["[vi] https://www.homeadvisor.com/cost/cleaning-services/remove-waste/"]

{"sheet":"Rent-Owner Afford Cost","index":2,"n_rows":107,"n_cols":20,"rows_kept":107,"cut":false,"hidden":true,"merged":[[3,2,3,8],[71,0,71,16],[5,0,5,4],[13,4,15,4],[53,0,69,0],[35,0,51,0],[26,0,33,0],[17,0,24,0],[35,5,42,5],[44,3,51,3],[53,5,60,5],[62,3,69,3],[86,13,86,14],[81,7,82,8],[80,0,80,16],[83,13,83,14],[84,13,84,14],[85,13,85,14],[72,0,72,16],[77,0,77,16],[78,0,78,16],[79,0,79,16],[73,7,73,9],[73,11,73,12],[73,13,73,16],[74,7,74,9],[74,11,74,12],[74,13,74,16]]}
["HCD GUIDE: Applicable for Projects Required to Comply with CA Health & Safety Code Sections 50052.5 and 50053."]
["Example of affordable housing cost estimator:"]
[]
[null,"COUNTY (fill-in):",{"$f":"Calculator!B3","v":"Fresno"},null,null,null,null,null,null,null,{"$f":"Calculator!B2","v":2023},"(fill-in: Calendar Year)"]
["Affordable Housing Cost:",null,"             AREA MEDIAN INCOME (AMI):",null,null,null,null,null,null,null,{"$f":"VLOOKUP(C4,IncomeLimits!$A$2:$B$59,2,FALSE)","v":83800},"(Auto calculated by County name)"]
["Reasonable Utility Allowance (Most Recent Average California Monthly Residential Utility Bill (EIA))\nhttps://www.eia.gov/electricity/sales_revenue_price/pdf/table5_a.pdf:",null,null,null,null,138.29,null,"To find COUNTY & INCOME to \"fill-in\":"]
[null,null,null,"RENTER",null,"OWNER",null,"for AMI, use \"Official State Income Limits\" at below link"]
["Health & Safety Code (H&SC):",null,null,"§§   50053   ",null,"§§   50052.5",null,"http://www.hcd.ca.gov/grants-funding/income-limits/state-and-federal-income-limits/docs/inc2k18.pdf"]
["Extremely Low",null,null,0.3,null,0.3,null,"[",null,null,null," Formula",null,null,null,"Months ]"]
["Very Low",null,null,0.5,null,0.5,null,"  (These columns show how the maximum monthly"]
["Low",null,null,0.6,null,0.7,null,"    rent and maximum housing cost were calculated.)"]
["Moderate",null,null,1.1000000000000001,null,1.1000000000000001,null,null,null,null,null,null,"Above"]
[null," H&SC 50052.5(h)",null,"Maximum",null,null,null,null,null,null,null,null,"County's"]
[null,"Unit","HH","Monthly","Rent After Utility Allowance","Maximum Month",null,null,"Max",null,null,null,"Area",null,"* Family"]
[null,"Size","Size","Renter Housing Cost",null,"House Cost",null,null,"Cost",null,"Median %",null,"Median",null,"Size"]
["Income Group","Bedrooms","Persons","(Renters)",null,"(Owners)",null,"[","%",null,"Upper Limit",null,"Income",null,"Adj.","Months ]",null,null,"Alternate Rent Option"]
[]
["Extremely Low Income HH","0 (Studio)",1,{"$f":"(($I18*$K18*$M18*$O18)/12)","v":439.95},{"$f":"D18-$F$6","v":301.65999999999997},"same",{"$f":"D18-$F$6","v":301.65999999999997},"[ (",0.3,"x",0.3,"x",{"$f":"K$5","v":83800},"x",0.7,")"," / 12  ]"]
[null,"1 bedroom",2,502.8,{"$f":"D19-$F$6","v":364.51},"same",{"$f":"D19-$F$6","v":364.51},"[ (",0.3,"x",0.3,"x",{"$f":"K$5","v":83800},"x",0.8,")"," / 12  ]"]
[null,"2 bedrooms",3,565.65,{"$f":"D20-$F$6","v":427.36},"same",427.36,"[ (",0.3,"x",0.3,"x",{"$f":"K$5","v":83800},"x",0.9,")"," / 12  ]"]
{"$rows_left_out":88}
{"sheet":"Homeowner Cost","index":3,"n_rows":21,"n_cols":5,"rows_kept":21,"cut":false,"hidden":true,"merged":[]}
[null,1]
[null,3.5000000000000003E-2]
["SP",{"$f":"Calculator!B6","v":1200}]
[null,{"$f":"B3","v":1200}]
["DP",{"$f":"B2*B4","v":42.000000000000007}]
["LA",{"$f":"B3-B5","v":1158}]
["IR",{"$f":"'Interest Rates'!C54/100","v":7.0800000000000002E-2},"Updates based on \"Interest Rates\" tab"]
["YR",30]
["PPY",12]
["TP",{"$f":"B9*B8","v":360}]
["PPP",{"$f":"MROUND(-PMT(B7/B9,B10,B6,0),0.01)","v":7.7700000000000005}]
["PMI",{"$f":"PMI!B17","v":0.52},"Updates based on \"PMI\" tab"]
["PT",{"$f":"B3*0.011","v":13.2}]
["INS",1458.47,"https://www.insurance.ca.gov/0400-news/0200-studies-reports/0250-homeowners-study/upload/A-Part-I-Data-Summary.xlsx"]
["MNT",{"$f":"B3*0.01","v":12}]
["WSG",{"$f":"(75.95)+47.87+((25+100)/2)","v":186.32},"Water:\nhttps://www.waterboards.ca.gov/drinking_water/certlic/drinkingwater/documents/needs/2021_needs_assessment.pdf","Sewer: \nhttps://public.tableau.com/app/profile/rafael.maestu/viz/WastewaterSurvey12-18PUBLICAGENCIES/Story1","Garbage: https://www.homeadvisor.com/cost/cleaning-services/remove-waste/"]
["SUM",{"$f":"B11*B10","v":2797.2000000000003}]
["IC",{"$f":"B17-B6","v":1639.2000000000003}]
["R"]
["E",{"$f":"((SUM($B$13:$B$16)/12)+$B$11+$B$12)*12","v":1769.4700000000003}]
{"$rows_left_out":2}
{"sheet":"PMI","index":4,"n_rows":20,"n_cols":8,"rows_kept":20,"cut":false,"hidden":true,"merged":[]}
[null,"https://www.hud.gov/program_offices/housing/comp/premiums/sfpcalc","a.","b.","c.","d"]
[null,{"$f":"'Homeowner Cost'!B6","v":1158},{"$f":"MROUND($B$2*'Homeowner Cost'!B$7*100,0.01)","v":8198.64},{"$f":"MROUND((C2/1200),0.01)","v":6.83},{"$f":"D2+B2","v":1164.83},{"$f":"$E$2-'Homeowner Cost'!$B$11","v":1157.06}]
[null,{"$f":"F2","v":1157.06},{"$f":"MROUND($B3*'Homeowner Cost'!B$7*100,0.01)","v":8191.9800000000005},{"$f":"MROUND((C3/1200),0.01)","v":6.83},{"$f":"D3+B3","v":1163.8899999999999},{"$f":"$E3-'Homeowner Cost'!$B$11","v":1156.1199999999999}]
[null,{"$f":"F3","v":1156.1199999999999},{"$f":"MROUND($B4*'Homeowner Cost'!B$7*100,0.01)","v":8185.33},6.82,{"$f":"D4+B4","v":1162.9399999999998},{"$f":"$E4-'Homeowner Cost'!$B$11","v":1155.1699999999998}]
[null,1155.1699999999998,{"$f":"MROUND($B5*'Homeowner Cost'!B$7*100,0.01)","v":8178.6},6.82,1161.9899999999998,{"$f":"$E5-'Homeowner Cost'!$B$11","v":1154.2199999999998}]
[null,1154.2199999999998,{"$f":"MROUND($B6*'Homeowner Cost'!B$7*100,0.01)","v":8171.88},6.8100000000000005,1161.0299999999997,{"$f":"$E6-'Homeowner Cost'!$B$11","v":1153.2599999999998}]
[null,1153.2599999999998,{"$f":"MROUND($B7*'Homeowner Cost'!B$7*100,0.01)","v":8165.08},6.8,1160.0599999999997,{"$f":"$E7-'Homeowner Cost'!$B$11","v":1152.2899999999997}]
[null,1152.2899999999997,{"$f":"MROUND($B8*'Homeowner Cost'!B$7*100,0.01)","v":8158.21},6.8,1159.0899999999997,{"$f":"$E8-'Homeowner Cost'!$B$11","v":1151.3199999999997}]
[null,1151.3199999999997,{"$f":"MROUND($B9*'Homeowner Cost'!B$7*100,0.01)","v":8151.35},6.79,1158.1099999999997,{"$f":"$E9-'Homeowner Cost'!$B$11","v":1150.3399999999997}]
[null,1150.3399999999997,{"$f":"MROUND($B10*'Homeowner Cost'!B$7*100,0.01)","v":8144.41},6.79,1157.1299999999997,{"$f":"$E10-'Homeowner Cost'!$B$11","v":1149.3599999999997}]
[null,1149.3599999999997,{"$f":"MROUND($B11*'Homeowner Cost'!B$7*100,0.01)","v":8137.47},6.78,1156.1399999999996,{"$f":"$E11-'Homeowner Cost'!$B$11","v":1148.3699999999997}]
[null,{"$f":"F11","v":1148.3699999999997},{"$f":"MROUND($B12*'Homeowner Cost'!B$7*100,0.01)","v":8130.46},6.78,{"$f":"D12+B12","v":1155.1499999999996},{"$f":"$E12-'Homeowner Cost'!$B$11","v":1147.3799999999997}]
[null,{"$f":"F12","v":1147.3799999999997},{"$f":"MROUND($B13*'Homeowner Cost'!B$7*100,0.01)","v":8123.45},6.7700000000000005,{"$f":"D13+B13","v":1154.1499999999996},{"$f":"$E13-'Homeowner Cost'!$B$11","v":1146.3799999999997}]
["Step 1",{"$f":"SUM(B2:B13)/12","v":1152.7408333333331}]
["Step 2",{"$f":"MROUND(IF(B2>F20,(MROUND(B14*H19,0.01)),(MROUND(B14*(H18),0.01))),0.01)","v":6.34},"MIP Rate: https://www.hud.gov/sites/documents/40001HSGH.PDF"]
["Step 3",{"$f":"MROUND((B15/(1+H17)),0.01)","v":6.23},"UFMIP Rate: https://www.hud.gov/sites/documents/40001HSGH.PDF",null,null,null,null,{"$f":"106605/0.965","v":110471.50259067358}]
["Step 4",{"$f":"MROUND((B16/12),0.01)","v":0.52},null,null,null,"UFMIP Rate (Basis Points)",175,{"$f":"G17/10000","v":1.7500000000000002E-2}]
["Step 5",{"$f":"B17*12","v":6.24},null,null,null,{"$f":"CONCATENATE(\"Annual MIP Rate (Basis Points) for Loans Less than or equal to $\", F20)","v":"Annual MIP Rate (Basis Points) for Loans Less than or equal to $726200"},55,{"$f":"G18/10000","v":5.4999999999999997E-3}]
[null,null,null,null,null,{"$f":"CONCATENATE(\"Annual MIP Rate (Basis Points) for Loans Greater Than $\",F20)","v":"Annual MIP Rate (Basis Points) for Loans Greater Than $726200"},65,{"$f":"G19/10000","v":6.4999999999999997E-3}]
[null,null,null,null,null,726200]
{"$rows_left_out":1}
{"sheet":"Interest Rates","index":5,"n_rows":54,"n_cols":3,"rows_kept":54,"cut":false,"hidden":true,"merged":[]}
["DATE","MORTGAGE30US","https://fred.stlouisfed.org/series/MORTGAGE30US"]
["2022-07-07",5.3]
["2022-07-14",5.51]
["2022-07-21",5.54]
["2022-07-28",5.3]
["2022-08-04",4.99]
["2022-08-11",5.22]
["2022-08-18",5.13]
["2022-08-25",5.55]
["2022-09-01",5.66]
["2022-09-08",5.89]
["2022-09-15",6.02]
["2022-09-22",6.29]
["2022-09-29",6.7]
["2022-10-06",6.66]
["2022-10-13",6.92]
["2022-10-20",6.94]
["2022-10-27",7.08]
["2022-11-03",6.95]
["2022-11-10",7.08]
{"$rows_left_out":35}
{"sheet":"IncomeLimits","index":6,"n_rows":59,"n_cols":5,"rows_kept":59,"cut":false,"hidden":true,"merged":[]}
["County","Median Income ","Low Income","Moderate Income",{"$f":"'Rent-Owner Afford Cost'!K4","v":2023}]
["Alameda",{"$f":"VLOOKUP($A2,INDIRECT(\"\"&$E$1&\"!\"&\"$A$2:$D$59\"),2,FALSE)","v":147900},{"$f":"VLOOKUP($A2,INDIRECT(\"\"&$E$1&\"!\"&\"$A$2:$D$59\"),3,FALSE)","v":112150},{"$f":"VLOOKUP($A2,INDIRECT(\"\"&$E$1&\"!\"&\"$A$2:$D$59\"),4,FALSE)","v":177500}]
["Alpine",{"$f":"VLOOKUP($A3,INDIRECT(\"\"&$E$1&\"!\"&\"$A$2:$D$59\"),2,FALSE)","v":114600},{"$f":"VLOOKUP($A3,INDIRECT(\"\"&$E$1&\"!\"&\"$A$2:$D$59\"),3,FALSE)","v":76900},{"$f":"VLOOKUP($A3,INDIRECT(\"\"&$E$1&\"!\"&\"$A$2:$D$59\"),4,FALSE)","v":137500}]
["Amador",101200,73350,121450]
["Butte",91600,65950,109900]
["Calaveras",96200,76250,115450]
["Colusa",83800,65950,100550]
["Contra Costa",147900,112150,177500]
["Del Norte",83800,65950,100550]
["El Dorado",113900,85750,136700]
["Fresno",83800,65950,100550]
["Glenn",83800,65950,100550]
["Humboldt",83800,65950,100550]
["Imperial",83800,65950,100550]
["Inyo",85400,68300,102500]
["Kern",83800,65950,100550]
["Kings",83800,65950,100550]
["Lake",83800,65950,100550]
["Lassen",83800,67050,100550]
["Los Angeles",98200,100900,117850]
{"$rows_left_out":40}
{"sheet":"2023","index":7,"n_rows":59,"n_cols":4,"rows_kept":59,"cut":false,"hidden":true,"merged":[]}
["County","Median Income 2023","Low Income 2023","Moderate Income 2023"]
["Alameda",147900,112150,177500]
["Alpine",114600,76900,137500]
["Amador",101200,73350,121450]
["Butte",91600,65950,109900]
["Calaveras",96200,76250,115450]
["Colusa",83800,65950,100550]
["Contra Costa",147900,112150,177500]
["Del Norte",83800,65950,100550]
["El Dorado",113900,85750,136700]
["Fresno",83800,65950,100550]
["Glenn",83800,65950,100550]
["Humboldt",83800,65950,100550]
["Imperial",83800,65950,100550]
["Inyo",85400,68300,102500]
["Kern",83800,65950,100550]
["Kings",83800,65950,100550]
["Lake",83800,65950,100550]
["Lassen",83800,67050,100550]
["Los Angeles",98200,100900,117850]
{"$rows_left_out":40}
{"sheet":"2022","index":8,"n_rows":59,"n_cols":4,"rows_kept":59,"cut":false,"hidden":true,"merged":[]}
["County","Median Income 2022","Low Income 2022","Moderate Income 2022"]
["Alameda",142800,109600,171350]
["Alpine",94900,72650,113900]
["Amador",86600,69300,103900]
["Butte",85000,62300,102000]
["Calaveras",90000,72000,108000]
["Colusa",80300,62300,96350]
["Contra Costa",142800,109600,171350]
["Del Norte",80300,62300,96350]
["El Dorado",102200,81050,122650]
["Fresno",80300,62300,96350]
["Glenn",80300,62300,96350]
["Humboldt",80300,62300,96350]
["Imperial",80300,62300,96350]
["Inyo",82700,66150,99250]
["Kern",80300,62300,96350]
["Kings",80300,62300,96350]
["Lake",80300,62300,96350]
["Lassen",80300,64250,96350]
["Los Angeles",91100,95300,109300]
{"$rows_left_out":40}
{"sheet":"2021","index":9,"n_rows":59,"n_cols":4,"rows_kept":59,"cut":false,"hidden":true,"merged":[]}
["County","Median Income 2021","Low Income 2021","Moderate Income 2021"]
["Alameda",125600,109600,150700]
["Alpine",94900,66550,113900]
["Amador",78700,62950,94450]
["Butte",70700,56550,84850]
["Calaveras",81700,65350,98050]
["Colusa",70700,55900,84850]
["Contra Costa",125600,109600,150700]
["Del Norte",70700,55900,84850]
["El Dorado",91100,72500,109300]
["Fresno",70700,55900,84850]
["Glenn",70700,55900,84850]
["Humboldt",72000,55900,86400]
["Imperial",70700,55900,84850]
["Inyo",75100,60100,90100]
["Kern",70700,55900,84850]
["Kings",70700,55900,84850]
["Lake",70700,55900,84850]
["Lassen",72200,57750,86650]
["Los Angeles",80000,94600,96000]
{"$rows_left_out":40}
{"sheet":"2020","index":10,"n_rows":59,"n_cols":4,"rows_kept":59,"cut":false,"hidden":true,"merged":[]}
["County","Median Income 2020","Low Income 2020","Moderate Income 2020"]
["Alameda",119200,104400,143050]
["Alpine",94900,66550,113900]
["Amador",78700,62950,94450]
["Butte",70700,56550,84850]
["Calaveras",80400,64300,96500]
["Colusa",70700,55900,84850]
["Contra Costa",119200,104400,143050]
["Del Norte",70700,55900,84850]
["El Dorado",86300,69050,103550]
["Fresno",70700,55900,84850]
["Glenn",70700,55900,84850]
["Humboldt",72000,55900,86400]
["Imperial",70700,55900,84850]
["Inyo",75100,60100,90100]
["Kern",70700,55900,84850]
["Kings",70700,55900,84850]
["Lake",70700,55900,84850]
["Lassen",70700,56550,84850]
["Los Angeles",77300,90100,92750]
{"$rows_left_out":40}
{"sheet":"2019","index":11,"n_rows":59,"n_cols":4,"rows_kept":59,"cut":false,"hidden":true,"merged":[]}
["County","Median Income 2019","Low Income 2019","Moderate Income 2019"]
["Alameda",111700,98550,134050]
["Alpine",94900,65800,113900]
["Amador",73600,58900,88300]
["Butte",66500,53200,79800]
["Calaveras",75300,60250,90350]
["Colusa",64800,51850,77750]
["Contra Costa",111700,98550,134050]
["Del Norte",64800,51850,77750]
["El Dorado",83600,66900,100300]
["Fresno",64800,51850,77750]
["Glenn",64800,51850,77750]
["Humboldt",64800,51850,77750]
["Imperial",64800,51850,77750]
["Inyo",72700,58150,87250]
["Kern",64800,51850,77750]
["Kings",64800,51850,77750]
["Lake",64800,51850,77750]
["Lassen",69400,55500,83300]
["Los Angeles",73100,83500,87700]
{"$rows_left_out":40}
{"sheet":"2018","index":12,"n_rows":59,"n_cols":4,"rows_kept":59,"cut":false,"hidden":true,"merged":[]}
["County","Median Income 2018","Low Income 2018","Moderate Income 2018"]
["Alameda",104400,89600,125300]
["Alpine",94900,65800,113900]
["Amador",73600,58900,88300]
["Butte",62600,50100,75100]
["Calaveras",72300,57850,86750]
["Colusa",59900,47900,71900]
["Contra Costa",104400,89600,125300]
["Del Norte",59900,47900,71900]
["El Dorado",80100,64100,96100]
["Fresno",59900,47900,71900]
["Glenn",59900,47900,71900]
["Humboldt",59900,47900,71900]
["Imperial",59900,47900,71900]
["Inyo",72000,57600,86400]
["Kern",59900,47900,71900]
["Kings",59900,47900,71900]
["Lake",59900,47900,71900]
["Lassen",69400,55500,83300]
["Los Angeles",69300,77500,83150]
{"$rows_left_out":40}
{"sheet":"2017","index":13,"n_rows":59,"n_cols":4,"rows_kept":59,"cut":false,"hidden":true,"merged":[]}
["County","Median Income 2017","Low Income 2017","Moderate Income 2017"]
["Alameda",97400,80400,116900]
["Alpine",94900,65800,113900]
["Amador",72300,57850,86750]
["Butte",62600,50100,75100]
["Calaveras",70200,56150,84250]
["Colusa",59900,47900,71900]
["Contra Costa",97400,80400,116900]
["Del Norte",59900,47900,71900]
["El Dorado",76100,60900,91300]
["Fresno",59900,47900,71900]
["Glenn",59900,47900,71900]
["Humboldt",59900,47900,71900]
["Imperial",59900,47900,71900]
["Inyo",72000,57600,86400]
["Kern",59900,47900,71900]
["Kings",59900,47900,71900]
["Lake",59900,47900,71900]
["Lassen",69400,55500,83300]
["Los Angeles",64800,72100,77750]
{"$rows_left_out":40}
{"sheet":"2016","index":14,"n_rows":59,"n_cols":5,"rows_kept":59,"cut":false,"hidden":true,"merged":[]}
["County","Median Income 2016","Low Income 2016","Moderate Income 2016"]
["Alameda",93600,75150,112300,7]
["Alpine",94900,65800,113900,{"$f":"E2+6","v":13}]
["Amador",72300,57850,86750,{"$f":"E3+6","v":19}]
["Butte",58900,47100,70700,25]
["Calaveras",70200,56150,84250,31]
["Colusa",58900,47100,70700,37]
["Contra Costa",93600,75150,112300,43]
["Del Norte",58900,47100,70700,49]
["El Dorado",76100,60900,91300,55]
["Fresno",58900,47100,70700,61]
["Glenn",58900,47100,70700,67]
["Humboldt",58900,47100,70700,73]
["Imperial",58900,47100,70700,79]
["Inyo",72000,57600,86400,85]
["Kern",58900,47100,70700,91]
["Kings",58900,47100,70700,97]
["Lake",58900,47100,70700,103]
["Lassen",69400,55500,83300,109]
["Los Angeles",64800,69450,77750,115]
{"$rows_left_out":40}
{"sheet":"2015","index":15,"n_rows":59,"n_cols":5,"rows_kept":59,"cut":false,"hidden":true,"merged":[]}
["County","Median Income 2015","Low Income 2015","Moderate Income 2015"]
["Alameda",93500,71600,112200,7]
["Alpine",94900,65800,113900,{"$f":"E2+6","v":13}]
["Amador",72300,57850,86750,{"$f":"E3+6","v":19}]
["Butte",58700,46950,70450,25]
["Calaveras",70200,56150,84250,31]
["Colusa",58700,46950,70450,37]
["Contra Costa",93500,71600,112200,43]
["Del Norte",57900,46300,69500,49]
["El Dorado",76100,60900,91300,55]
["Fresno",57900,46300,69500,61]
["Glenn",57900,46300,69500,67]
["Humboldt",57900,46300,69500,73]
["Imperial",57900,46300,69500,79]
["Inyo",71500,57200,85800,85]
["Kern",57900,46300,69500,91]
["Kings",57900,46300,69500,97]
["Lake",57900,46300,69500,103]
["Lassen",69400,55500,83300,109]
["Los Angeles",64800,68300,77750,115]
{"$rows_left_out":40}
{"sheet":"2014","index":16,"n_rows":59,"n_cols":5,"rows_kept":59,"cut":false,"hidden":true,"merged":[]}
["County","Median Income 2014","Low Income 2014","Moderate Income 2014"]
["Alameda",93500,67600,112200,7]
["Alpine",85000,63900,102000,{"$f":"E2+6","v":13}]
["Amador",72300,57850,86750,{"$f":"E3+6","v":19}]
["Butte",58700,46950,70450,25]
["Calaveras",70000,56000,84000,31]
["Colusa",57900,46300,69500,37]
["Contra Costa",93500,67600,112200,43]
["Del Norte",57900,46300,69500,49]
["El Dorado",76100,60900,91300,55]
["Fresno",57900,46300,69500,61]
["Glenn",57900,46300,69500,67]
["Humboldt",57900,46300,69500,73]
["Imperial",57900,46300,69500,79]
["Inyo",70900,55200,85100,85]
["Kern",57900,46300,69500,91]
["Kings",57900,46300,69500,97]
["Lake",57900,46300,69500,103]
["Lassen",68000,54300,81600,109]
["Los Angeles",64800,68300,77750,115]
{"$rows_left_out":40}
{"sheet":"2013","index":17,"n_rows":59,"n_cols":4,"rows_kept":59,"cut":false,"hidden":true,"merged":[]}
["County","Median Income","Lower Income","Moderate Income"]
["Alameda",93500,66250,112200]
["Alpine",85300,62250,102350]
["Amador",69200,55350,83050]
["Butte",58700,46950,70450]
["Calaveras",69700,55750,83650]
["Colusa",57900,46300,69500]
["Contra Costa",93500,66250,112200]
["Del Norte",57900,46300,69500]
["El Dorado",76100,60900,91300]
["Fresno",57900,46300,69500]
["Glenn",57900,46300,69500]
["Humboldt",57900,46300,69500]
["Imperial",57900,46300,69500]
["Inyo",65800,52650,78950]
["Kern",57900,46300,69500]
["Kings",57900,46300,69500]
["Lake",57900,46300,69500]
["Lassen",66800,51750,80150]
["Los Angeles",64800,68300,77750]
{"$rows_left_out":39}